tomee-commits mailing list archives

Site index · List index
Message view « Date » · « Thread »
Top « Date » · « Thread »
From "karan singh malhi (JIRA)" <j...@apache.org>
Subject [jira] Created: (OPENEJB-843) CalculatorTest fails
Date Wed, 02 Jul 2008 14:41:45 GMT
CalculatorTest fails
--------------------

                 Key: OPENEJB-843
                 URL: https://issues.apache.org/jira/browse/OPENEJB-843
             Project: OpenEJB
          Issue Type: Bug
          Components: examples
    Affects Versions: 3.0.1
         Environment: Ubuntu Linux , sun java 1.5
            Reporter: karan singh malhi
            Assignee: karan singh malhi
             Fix For: 3.0.1


-------------------------------------------------------------------------------
Test set: org.superbiz.calculator.CalculatorTest
-------------------------------------------------------------------------------
Tests run: 1, Failures: 0, Errors: 1, Skipped: 0, Time elapsed: 63.109 sec <<< FAILURE!
testCalculatorViaWsInterface(org.superbiz.calculator.CalculatorTest)  Time elapsed: 63.073
sec  <<< ERROR!
javax.xml.ws.soap.SOAPFaultException: Could not send Message.
        at org.apache.cxf.jaxws.JaxWsClientProxy.invoke(JaxWsClientProxy.java:175)
        at $Proxy17.multiply(Unknown Source)
        at org.superbiz.calculator.CalculatorTest.testCalculatorViaWsInterface(CalculatorTest.java:76)
        at sun.reflect.NativeMethodAccessorImpl.invoke0(Native Method)
        at sun.reflect.NativeMethodAccessorImpl.invoke(NativeMethodAccessorImpl.java:39)
        at sun.reflect.DelegatingMethodAccessorImpl.invoke(DelegatingMethodAccessorImpl.java:25)
        at java.lang.reflect.Method.invoke(Method.java:585)
        at junit.framework.TestCase.runTest(TestCase.java:164)
        at junit.framework.TestCase.runBare(TestCase.java:130)
        at junit.framework.TestResult$1.protect(TestResult.java:110)
        at junit.framework.TestResult.runProtected(TestResult.java:128)
        at junit.framework.TestResult.run(TestResult.java:113)
        at junit.framework.TestCase.run(TestCase.java:120)
        at junit.framework.TestSuite.runTest(TestSuite.java:228)
        at junit.framework.TestSuite.run(TestSuite.java:223)
        at org.junit.internal.runners.OldTestClassRunner.run(OldTestClassRunner.java:35)
        at org.apache.maven.surefire.junit4.JUnit4TestSet.execute(JUnit4TestSet.java:62)
        at org.apache.maven.surefire.suite.AbstractDirectoryTestSuite.executeTestSet(AbstractDirectoryTestSuite.java:140)
        at org.apache.maven.surefire.suite.AbstractDirectoryTestSuite.execute(AbstractDirectoryTestSuite.java:127)
        at org.apache.maven.surefire.Surefire.run(Surefire.java:177)
        at sun.reflect.NativeMethodAccessorImpl.invoke0(Native Method)
        at sun.reflect.NativeMethodAccessorImpl.invoke(NativeMethodAccessorImpl.java:39)
        at sun.reflect.DelegatingMethodAccessorImpl.invoke(DelegatingMethodAccessorImpl.java:25)
        at java.lang.reflect.Method.invoke(Method.java:585)
        at org.apache.maven.surefire.booter.SurefireBooter.runSuitesInProcess(SurefireBooter.java:338)
        at org.apache.maven.surefire.booter.SurefireBooter.main(SurefireBooter.java:997)
Caused by: org.apache.cxf.interceptor.Fault: Could not send Message.
        at org.apache.cxf.interceptor.MessageSenderInterceptor$MessageSenderEndingInterceptor.handleMessage(MessageSenderInterceptor.java:64)
        at org.apache.cxf.phase.PhaseInterceptorChain.doIntercept(PhaseInterceptorChain.java:208)
        at org.apache.cxf.endpoint.ClientImpl.invoke(ClientImpl.java:276)
        at org.apache.cxf.endpoint.ClientImpl.invoke(ClientImpl.java:222)
        at org.apache.cxf.frontend.ClientProxy.invokeSync(ClientProxy.java:73)
        at org.apache.cxf.jaxws.JaxWsClientProxy.invoke(JaxWsClientProxy.java:135)
        ... 25 more
Caused by: java.net.SocketTimeoutException: Read timed out
        at java.net.SocketInputStream.socketRead0(Native Method)
        at java.net.SocketInputStream.read(SocketInputStream.java:129)
        at java.io.BufferedInputStream.fill(BufferedInputStream.java:218)
        at java.io.BufferedInputStream.read1(BufferedInputStream.java:256)
        at java.io.BufferedInputStream.read(BufferedInputStream.java:313)
        at sun.net.www.http.HttpClient.parseHTTPHeader(HttpClient.java:681)
        at sun.net.www.http.HttpClient.parseHTTP(HttpClient.java:626)
        at sun.net.www.http.HttpClient.parseHTTP(HttpClient.java:646)
        at sun.net.www.protocol.http.HttpURLConnection.getInputStream(HttpURLConnection.java:957)
        at java.net.HttpURLConnection.getResponseCode(HttpURLConnection.java:367)
        at org.apache.cxf.transport.http.HTTPConduit$WrappedOutputStream.handleResponse(HTTPConduit.java:1863)
        at org.apache.cxf.transport.http.HTTPConduit$WrappedOutputStream.close(HTTPConduit.java:1791)
        at org.apache.cxf.transport.AbstractConduit.close(AbstractConduit.java:66)
        at org.apache.cxf.transport.http.HTTPConduit.close(HTTPConduit.java:575)
        at org.apache.cxf.interceptor.MessageSenderInterceptor$MessageSenderEndingInterceptor.handleMessage(MessageSenderInterceptor.java:62)
        ... 30 more


-- 
This message is automatically generated by JIRA.
-
You can reply to this email to add a comment to the issue online.


Mime
View raw message