tomee-commits mailing list archives

Site index · List index
Message view « Date » · « Thread »
Top « Date » · « Thread »
From Continuum VMBuild Server <contin...@apache.org>
Subject [continuum] BUILD FAILURE: OpenEJB
Date Tue, 01 Apr 2008 05:27:01 GMT
Online report : http://vmbuild.apache.org/continuum/buildResult.action?buildId=71989&projectId=358

Build statistics:
  State: Failed
  Previous State: Failed
  Started at: Mon 31 Mar 2008 22:25:58 -0700
  Finished at: Mon 31 Mar 2008 22:26:40 -0700
  Total time: 42s
  Build Trigger: Schedule
  Build Number: 28
  Exit code: 1
  Building machine hostname: vmbuild.apache.org
  Operating system : Linux(unknown)
  Java Home version : 
          java version "1.5.0_12"
          Java(TM) 2 Runtime Environment, Standard Edition (build 1.5.0_12-b04)
          Java HotSpot(TM) Client VM (build 1.5.0_12-b04, mixed mode, sharing)
        
  Builder version :
          Maven version: 2.0.7
          Java version: 1.5.0_12
          OS name: "linux" version: "2.6.20-16-server" arch: "i386"
    
****************************************************************************
SCM Changes:
****************************************************************************
No files changed

****************************************************************************
Dependencies Changes:
****************************************************************************
No dependencies changed


****************************************************************************
Build Defintion:
****************************************************************************
POM filename: pom.xml
Goals: -Dassemble clean install site   
Arguments: --batch-mode
Build Fresh: true
Always Build: false
Default Build Definition: true
Schedule: DEFAULT_SCHEDULE
Profile Name: Java 5
Description: 


****************************************************************************
Test Summary:
****************************************************************************
Tests: 0
Failures: 0
Total time: 0

****************************************************************************
Output:
****************************************************************************
[INFO] Scanning for projects...
[INFO] Reactor build order: 
[INFO]   OpenEJB
[INFO]   OpenEJB :: Dependencies
[INFO]   OpenEJB :: Dependencies :: XBean Finder
[INFO]   OpenEJB :: Dependencies :: XBean Reflect
[INFO]   OpenEJB :: iTests
[INFO]   OpenEJB :: iTests Beans
[INFO]   OpenEJB :: iTests Servlets
[INFO]   OpenEJB :: iTests Client
[INFO]   OpenEJB :: iTests Interceptor Beans
[INFO]   OpenEJB :: iTests App
[INFO]   OpenEJB :: iTests Web
[INFO]   OpenEJB :: Container
[INFO]   OpenEJB :: Container :: Loader
[INFO]   OpenEJB :: Container :: Java Agent
[INFO]   OpenEJB :: Container :: Java EE
[INFO]   OpenEJB :: Container :: Core
[INFO]   OpenEJB :: Server
[INFO]   OpenEJB :: Server :: Client
[INFO]   OpenEJB :: Server :: Core
[INFO]   OpenEJB :: Server :: EJBd
[INFO]   OpenEJB :: Server :: Admin
[INFO]   OpenEJB :: Server :: Http
[INFO]   OpenEJB :: Server :: WebAdmin
[INFO]   OpenEJB :: Server :: Telnet
[INFO]   OpenEJB :: Server :: ActiveMQ
[INFO]   OpenEJB :: Server :: CORBA
[INFO]   OpenEJB :: Server :: Derby Network Service
[INFO]   OpenEJB :: Server :: Hsql
[INFO]   OpenEJB :: Server :: Webservices
[INFO]   OpenEJB :: Server :: Axis
[INFO]   OpenEJB :: Server :: Axis2
[INFO]   OpenEJB :: Server :: CXF
[INFO]   OpenEJB :: Examples :: Simple Stateful Pojo
[INFO]   OpenEJB :: Examples :: Simple Stateless Pojo
[INFO]   OpenEJB :: Examples :: Simple Webservice
[INFO]   OpenEJB :: Examples :: EJB 2.1 Component Interfaces
[INFO]   OpenEJB :: Examples :: @EJB Injection
[INFO]   OpenEJB :: Examples :: @Resource env-entry Injection
[INFO]   OpenEJB :: Examples :: @Resource DataSource Injection
[INFO]   OpenEJB :: Examples :: @PersistenceContext EntityManager Injection
[INFO]   OpenEJB :: Examples :: Testing Transactions
[INFO]   OpenEJB :: Examples :: Testing Security
[INFO]   OpenEJB :: Examples :: Interceptors
[INFO]   OpenEJB :: Examples :: Expanded support for Env Entries
[INFO]   OpenEJB :: Examples :: Hello World - Weblogic
[INFO]   OpenEJB :: Examples :: JPA with Hibernate
[INFO]   OpenEJB :: Examples :: Telephone Stateful Pojo
[INFO]   OpenEJB :: Web Examples :: EJB Examples War
[INFO]   OpenEJB :: Web Examples
[INFO]   OpenEJB :: Examples
[INFO]   OpenEJB :: Assembly
[INFO]   OpenEJB :: Assembly :: iTests Standalone Client
[INFO]   OpenEJB :: Assembly :: Standalone
[INFO]   OpenEJB :: Assembly :: Tomcat
[INFO]   OpenEJB :: Assembly :: Tomcat :: Loader
[INFO]   OpenEJB :: Assembly :: Tomcat :: Common
[INFO]   OpenEJB :: Assembly :: Tomcat :: Catalina
[INFO]   OpenEJB :: Assembly :: Tomcat :: Webapp
[INFO] ----------------------------------------------------------------------------
[INFO] Building OpenEJB
[INFO]    task-segment: [clean, install, site]
[INFO] ----------------------------------------------------------------------------
[INFO] [clean:clean]
[INFO] Deleting directory /home/continuum/data/working-directory/358/target
[INFO] Deleting directory /home/continuum/data/working-directory/358/target/classes
[INFO] Deleting directory /home/continuum/data/working-directory/358/target/test-classes
[INFO] Deleting directory /home/continuum/data/working-directory/358/target/site
[INFO] Setting property: classpath.resource.loader.class => 'org.codehaus.plexus.velocity.ContextClassLoaderResourceLoader'.
[INFO] Setting property: velocimacro.messages.on => 'false'.
[INFO] Setting property: resource.loader => 'classpath'.
[INFO] Setting property: resource.manager.logwhenfound => 'false'.
[INFO] [remote-resources:process {execution: default}]
[INFO] [dependency-report:report {execution: default}]
[INFO] No dependencies to report
[INFO] [bundle:manifest {execution: bundle-manifest}]
[INFO] [site:attach-descriptor]
[INFO] [install:install]
[INFO] Installing /home/continuum/data/working-directory/358/pom.xml to /home/continuum/.m2/repository/org/apache/openejb/openejb/3.1-SNAPSHOT/openejb-3.1-SNAPSHOT.pom
[INFO] Preparing clover:instrument
[WARNING] Removing: instrument from forked lifecycle, to prevent recursive invocation.
[INFO] [clover:instrumentInternal]
[INFO] Not instrumenting sources with Clover as this is not a Java project.
[INFO] [remote-resources:process {execution: default}]
[INFO] [dependency-report:report {execution: default}]
[INFO] [bundle:manifest {execution: bundle-manifest}]
[INFO] [site:attach-descriptor]
[INFO] [install:install]
[INFO] Installing /home/continuum/data/working-directory/358/pom.xml to /home/continuum/.m2/repository/org/apache/openejb/openejb/3.1-SNAPSHOT/openejb-3.1-SNAPSHOT.pom
[INFO] [clover:instrument {execution: site}]
[INFO] [clover:aggregate {execution: site}]
[WARNING] No Clover databases found in children projects - No merge done
[INFO] [clover:save-history {execution: site}]
[INFO] No Clover database found, skipping the Clover history point save
[INFO] Setting property: classpath.resource.loader.class => 'org.codehaus.plexus.velocity.ContextClassLoaderResourceLoader'.
[INFO] Setting property: velocimacro.messages.on => 'false'.
[INFO] Setting property: resource.loader => 'classpath'.
[INFO] Setting property: resource.manager.logwhenfound => 'false'.
[INFO] ************************************************************** 
[INFO] Starting Jakarta Velocity v1.4
[INFO] RuntimeInstance initializing.
[INFO] Default Properties File: org/apache/velocity/runtime/defaults/velocity.properties
[INFO] Default ResourceManager initializing. (class org.apache.velocity.runtime.resource.ResourceManagerImpl)
[INFO] Resource Loader Instantiated: org.codehaus.plexus.velocity.ContextClassLoaderResourceLoader
[INFO] ClasspathResourceLoader : initialization starting.
[INFO] ClasspathResourceLoader : initialization complete.
[INFO] ResourceCache : initialized. (class org.apache.velocity.runtime.resource.ResourceCacheImpl)
[INFO] Default ResourceManager initialization complete.
[INFO] Loaded System Directive: org.apache.velocity.runtime.directive.Literal
[INFO] Loaded System Directive: org.apache.velocity.runtime.directive.Macro
[INFO] Loaded System Directive: org.apache.velocity.runtime.directive.Parse
[INFO] Loaded System Directive: org.apache.velocity.runtime.directive.Include
[INFO] Loaded System Directive: org.apache.velocity.runtime.directive.Foreach
[INFO] Created: 20 parsers.
[INFO] Velocimacro : initialization starting.
[INFO] Velocimacro : adding VMs from VM library template : VM_global_library.vm
[ERROR] ResourceManager : unable to find resource 'VM_global_library.vm' in any resource loader.
[INFO] Velocimacro : error using  VM library template VM_global_library.vm : org.apache.velocity.exception.ResourceNotFoundException:
Unable to find resource 'VM_global_library.vm'
[INFO] Velocimacro :  VM library template macro registration complete.
[INFO] Velocimacro : allowInline = true : VMs can be defined inline in templates
[INFO] Velocimacro : allowInlineToOverride = false : VMs defined inline may NOT replace previous
VM definitions
[INFO] Velocimacro : allowInlineLocal = false : VMs defined inline will be  global in scope
if allowed.
[INFO] Velocimacro : initialization complete.
[INFO] Velocity successfully started.
[INFO] Setting property: classpath.resource.loader.class => 'org.codehaus.plexus.velocity.ContextClassLoaderResourceLoader'.
[INFO] Setting property: velocimacro.messages.on => 'false'.
[INFO] Setting property: resource.loader => 'classpath'.
[INFO] Setting property: resource.manager.logwhenfound => 'false'.
[INFO] ************************************************************** 
[INFO] Starting Jakarta Velocity v1.4
[INFO] RuntimeInstance initializing.
[INFO] Default Properties File: org/apache/velocity/runtime/defaults/velocity.properties
[INFO] Default ResourceManager initializing. (class org.apache.velocity.runtime.resource.ResourceManagerImpl)
[INFO] Resource Loader Instantiated: org.codehaus.plexus.velocity.ContextClassLoaderResourceLoader
[INFO] ClasspathResourceLoader : initialization starting.
[INFO] ClasspathResourceLoader : initialization complete.
[INFO] ResourceCache : initialized. (class org.apache.velocity.runtime.resource.ResourceCacheImpl)
[INFO] Default ResourceManager initialization complete.
[INFO] Loaded System Directive: org.apache.velocity.runtime.directive.Literal
[INFO] Loaded System Directive: org.apache.velocity.runtime.directive.Macro
[INFO] Loaded System Directive: org.apache.velocity.runtime.directive.Parse
[INFO] Loaded System Directive: org.apache.velocity.runtime.directive.Include
[INFO] Loaded System Directive: org.apache.velocity.runtime.directive.Foreach
[INFO] Created: 20 parsers.
[INFO] Velocimacro : initialization starting.
[INFO] Velocimacro : adding VMs from VM library template : VM_global_library.vm
[ERROR] ResourceManager : unable to find resource 'VM_global_library.vm' in any resource loader.
[INFO] Velocimacro : error using  VM library template VM_global_library.vm : org.apache.velocity.exception.ResourceNotFoundException:
Unable to find resource 'VM_global_library.vm'
[INFO] Velocimacro :  VM library template macro registration complete.
[INFO] Velocimacro : allowInline = true : VMs can be defined inline in templates
[INFO] Velocimacro : allowInlineToOverride = false : VMs defined inline may NOT replace previous
VM definitions
[INFO] Velocimacro : allowInlineLocal = false : VMs defined inline will be  global in scope
if allowed.
[INFO] Velocimacro : initialization complete.
[INFO] Velocity successfully started.
[INFO] Setting property: classpath.resource.loader.class => 'org.codehaus.plexus.velocity.ContextClassLoaderResourceLoader'.
[INFO] Setting property: velocimacro.messages.on => 'false'.
[INFO] Setting property: resource.loader => 'classpath'.
[INFO] Setting property: resource.manager.logwhenfound => 'false'.
[INFO] Preparing javadoc:javadoc
[WARNING] Removing: instrument from forked lifecycle, to prevent recursive invocation.
[INFO] No goals needed for project - skipping
[INFO] Setting property: classpath.resource.loader.class => 'org.codehaus.plexus.velocity.ContextClassLoaderResourceLoader'.
[INFO] Setting property: velocimacro.messages.on => 'false'.
[INFO] Setting property: resource.loader => 'classpath'.
[INFO] Setting property: resource.manager.logwhenfound => 'false'.
[INFO] [site:site]
[WARNING] No Clover database found, skipping report generation
[WARNING] Unable to load parent project from repository: Could not find the model file '/home/continuum/data/working-directory/358/../pom.xml'.
for project unknown
[INFO] Generate "JavaDocs" report.
Downloading: http://snapshots.repository.codehaus.org/org/apache/openejb/openejb-itests-servlets/3.1-SNAPSHOT/openejb-itests-servlets-3.1-SNAPSHOT.jar
Downloading: http://people.apache.org/repo/m2-snapshot-repository/org/apache/openejb/openejb-itests-servlets/3.1-SNAPSHOT/openejb-itests-servlets-3.1-SNAPSHOT.jar
Downloading: http://download.java.net/maven/1/org.apache.openejb/jars/openejb-itests-servlets-3.1-SNAPSHOT.jar
Downloading: http://people.apache.org/repo/m2-snapshot-repository/org/apache/openejb/openejb-itests-servlets/3.1-SNAPSHOT/openejb-itests-servlets-3.1-SNAPSHOT.jar
Downloading: http://snapshots.repository.codehaus.org/org/apache/openejb/xbean-finder/3.4-r636443-SNAPSHOT/xbean-finder-3.4-r636443-SNAPSHOT.jar
Downloading: http://people.apache.org/repo/m2-snapshot-repository/org/apache/openejb/xbean-finder/3.4-r636443-SNAPSHOT/xbean-finder-3.4-r636443-SNAPSHOT.jar
Downloading: http://download.java.net/maven/1/org.apache.openejb/jars/xbean-finder-3.4-r636443-SNAPSHOT.jar
Downloading: http://people.apache.org/repo/m2-snapshot-repository/org/apache/openejb/xbean-finder/3.4-r636443-SNAPSHOT/xbean-finder-3.4-r636443-SNAPSHOT.jar
[INFO] ------------------------------------------------------------------------
[ERROR] BUILD ERROR
[INFO] ------------------------------------------------------------------------
[INFO] Failed to resolve artifact.

Missing:
----------
1) org.apache.openejb:openejb-itests-servlets:jar:3.1-SNAPSHOT

  Try downloading the file manually from the project website.

  Then, install it using the command: 
      mvn install:install-file -DgroupId=org.apache.openejb -DartifactId=openejb-itests-servlets
\
          -Dversion=3.1-SNAPSHOT -Dpackaging=jar -Dfile=/path/to/file
Alternatively, if you host your own repository you can deploy the file there:       mvn deploy:deploy-file
-DgroupId=org.apache.openejb -DartifactId=openejb-itests-servlets \
          -Dversion=3.1-SNAPSHOT -Dpackaging=jar -Dfile=/path/to/file \
           -Durl=[url] -DrepositoryId=[id]

  Path to dependency: 
  	1) org.apache.openejb:openejb-itests-client:jar:3.1-SNAPSHOT
  	2) org.apache.openejb:openejb-itests-servlets:jar:3.1-SNAPSHOT

2) org.apache.openejb:xbean-finder:jar:3.4-r636443-SNAPSHOT

  Try downloading the file manually from the project website.

  Then, install it using the command: 
      mvn install:install-file -DgroupId=org.apache.openejb -DartifactId=xbean-finder \
          -Dversion=3.4-r636443-SNAPSHOT -Dpackaging=jar -Dfile=/path/to/file
Alternatively, if you host your own repository you can deploy the file there:       mvn deploy:deploy-file
-DgroupId=org.apache.openejb -DartifactId=xbean-finder \
          -Dversion=3.4-r636443-SNAPSHOT -Dpackaging=jar -Dfile=/path/to/file \
           -Durl=[url] -DrepositoryId=[id]

  Path to dependency: 
  	1) org.apache.openejb:openejb-itests-client:jar:3.1-SNAPSHOT
  	2) org.apache.openejb:xbean-finder:jar:3.4-r636443-SNAPSHOT

----------
2 required artifacts are missing.

for artifact: 
  org.apache.openejb:openejb-itests-client:jar:3.1-SNAPSHOT

from the specified remote repositories:
  central (http://repo1.maven.org/maven2),
  apache-m2-snapshot (http://people.apache.org/repo/m2-snapshot-repository),
  java.net (http://download.java.net/maven/1),
  apache.snapshots (http://people.apache.org/repo/m2-snapshot-repository),
  tomcat-private-repository (http://tomcat.apache.org/dev/dist/m2-repository),
  openejb-3rdparty-builds (http://svn.apache.org/repos/asf/openejb/repo/),
  apache-incubating-repository (http://people.apache.org/repo/m2-incubating-repository),
  codehaus-snapshot (http://snapshots.repository.codehaus.org)


[INFO] ------------------------------------------------------------------------
[INFO] For more information, run Maven with the -e switch
[INFO] ------------------------------------------------------------------------
[INFO] Total time: 31 seconds
[INFO] Finished at: Mon Mar 31 22:26:40 PDT 2008
[INFO] Final Memory: 32M/59M
[INFO] ------------------------------------------------------------------------

****************************************************************************



Mime
View raw message