tomee-commits mailing list archives

Site index · List index
Message view « Date » · « Thread »
Top « Date » · « Thread »
From "Continuum@vmbuild.apache.org" <comm...@openejb.apache.org>
Subject [continuum] BUILD FAILURE: OpenEJB :: Container :: Core
Date Sat, 04 Aug 2007 17:17:17 GMT
Online report : http://vmbuild.apache.org/continuum/servlet/continuum/target/ProjectBuild.vm/view/ProjectBuild/id/158/buildId/242919
Build statistics:
  State: Failed
  Previous State: Failed
  Started at: Sat, 4 Aug 2007 10:11:24 -0700
  Finished at: Sat, 4 Aug 2007 10:17:17 -0700
  Total time: 5m 53s
  Build Trigger: Forced
  Exit code: 1
  Building machine hostname: vmbuild.apache.org
  Operating system : Linux(unknown)
  Java version : 1.5.0_06(Sun Microsystems Inc.)

Changes
      No files changed
  
****************************************************************************
Output:
****************************************************************************
[INFO] Scanning for projects...
[INFO] ----------------------------------------------------------------------------
[INFO] Building OpenEJB :: Container :: Core
[INFO]    task-segment: [install]
[INFO] ----------------------------------------------------------------------------
[INFO] [resources:resources]
[INFO] Using default encoding to copy filtered resources.
[INFO] [dependency:copy {execution: copy}]
[INFO] Configured Artifact: org.apache.openejb:openejb-javaagent:3.0.0-SNAPSHOT:jar
[INFO] Copying openejb-javaagent-3.0.0-SNAPSHOT.jar to /x1/continuum/working-directory/158/target/openejb-javaagent-3.0.0-SNAPSHOT.jar
[INFO] snapshot org.apache.openejb:openejb-itests-app:3.0.0-SNAPSHOT: checking for updates
from codehaus-snapshot
[INFO] snapshot org.apache.openejb:openejb-itests-app:3.0.0-SNAPSHOT: checking for updates
from apache-m2-snapshot
[INFO] snapshot org.apache.openejb:openejb-itests-app:3.0.0-SNAPSHOT: checking for updates
from apache.snapshots
[INFO] [compiler:compile]
[INFO] Nothing to compile - all classes are up to date
Downloading: http://people.apache.org/repo/m2-incubating-repository/org/apache/axis2/axis2-jaxws-api/20070804.050039-101/axis2-jaxws-api-20070804.050039-101.pom
Downloading: http://tomcat.apache.org/dev/dist/m2-repository/org/apache/axis2/axis2-jaxws-api/20070804.050039-101/axis2-jaxws-api-20070804.050039-101.pom
Downloading: http://repo1.maven.org/maven2/org/apache/axis2/axis2-jaxws-api/20070804.050039-101/axis2-jaxws-api-20070804.050039-101.pom
[INFO] [antrun:run {execution: default}]
[INFO] Executing tasks
[INFO] Executed tasks
[INFO] [resources:testResources]
[INFO] Using default encoding to copy filtered resources.
[INFO] [compiler:testCompile]
[INFO] Nothing to compile - all classes are up to date
[INFO] [surefire:test]
[INFO] Surefire report directory: /x1/continuum/working-directory/158/target/surefire-reports

-------------------------------------------------------
 T E S T S
-------------------------------------------------------
Running org.apache.openejb.core.stateless.JaxWsWebServiceInvocationTest
log4j:WARN No appenders could be found for logger (OpenEJB.startup.config).
log4j:WARN Please initialize the log4j system properly.
Tests run: 1, Failures: 0, Errors: 0, Skipped: 0, Time elapsed: 5.302 sec
Running org.apache.openejb.core.stateless.StatelessInterceptorTest
log4j:WARN No appenders could be found for logger (OpenEJB.startup.config).
log4j:WARN Please initialize the log4j system properly.
Tests run: 1, Failures: 0, Errors: 0, Skipped: 0, Time elapsed: 4.286 sec
Running org.apache.openejb.core.mdb.MdbTest
log4j:WARN No appenders could be found for logger (org.apache.activemq.broker.BrokerService).
log4j:WARN Please initialize the log4j system properly.
Tests run: 1, Failures: 0, Errors: 0, Skipped: 0, Time elapsed: 12.163 sec
Running org.apache.openejb.assembler.classic.MethodTransactionInfoComparatorTest
Tests run: 1, Failures: 0, Errors: 0, Skipped: 0, Time elapsed: 0.095 sec
Running org.apache.openejb.core.stateful.StatefulInterceptorTest
log4j:WARN No appenders could be found for logger (OpenEJB.startup.config).
log4j:WARN Please initialize the log4j system properly.
Tests run: 1, Failures: 0, Errors: 1, Skipped: 0, Time elapsed: 4.472 sec <<< FAILURE!
Running org.apache.openejb.config.ConfigureServiceTest
log4j:WARN No appenders could be found for logger (OpenEJB.startup.config).
log4j:WARN Please initialize the log4j system properly.
Tests run: 4, Failures: 0, Errors: 0, Skipped: 0, Time elapsed: 1.911 sec
Running org.apache.openejb.core.mdb.SimpleJmsTest
log4j:WARN No appenders could be found for logger (org.apache.activemq.broker.BrokerService).
log4j:WARN Please initialize the log4j system properly.
Tests run: 1, Failures: 0, Errors: 0, Skipped: 0, Time elapsed: 11.79 sec
Running org.apache.openejb.config.SunQueryFilterTest
Tests run: 5, Failures: 0, Errors: 0, Skipped: 0, Time elapsed: 0.102 sec
Running org.apache.openejb.core.stateful.Compat3to2Test
log4j:WARN No appenders could be found for logger (OpenEJB.startup.config).
log4j:WARN Please initialize the log4j system properly.
Tests run: 1, Failures: 0, Errors: 1, Skipped: 0, Time elapsed: 4.541 sec <<< FAILURE!
Running org.apache.openejb.config.SunCmpConversionTest
log4j:WARN No appenders could be found for logger (OpenEJB).
log4j:WARN Please initialize the log4j system properly.
Tests run: 8, Failures: 0, Errors: 0, Skipped: 0, Time elapsed: 12.211 sec
Running org.apache.openejb.ApplicationTest
WARNING: No test suite configuration file specified, assuming system properties contain all
needed information.  To specify a test suite configuration file by setting its location using
the system property "openejb.testsuite.properties"
Apache OpenEJB 3.0.0-SNAPSHOT    build: 20070804-10:11
http://openejb.apache.org/
test server = org.apache.openejb.test.IvmTestServer
entry = java.naming.factory.initial:org.apache.openejb.client.LocalInitialContextFactory
Cannot start the test database: java.lang.IllegalStateException Cannot find 'client/tools/DatabaseHome':
javax.naming.NameNotFoundException Name "client/tools/DatabaseHome" not found.
Tests run: 1, Failures: 0, Errors: 1, Skipped: 0, Time elapsed: 16.533 sec <<< FAILURE!
Running org.apache.openejb.core.stateless.JaxRpcWebServiceInvocationTest
log4j:WARN No appenders could be found for logger (OpenEJB.startup.config).
log4j:WARN Please initialize the log4j system properly.
Tests run: 2, Failures: 0, Errors: 0, Skipped: 0, Time elapsed: 4.041 sec
Running org.apache.openejb.core.mdb.JmsProxyTest
log4j:WARN No appenders could be found for logger (org.apache.activemq.broker.BrokerService).
log4j:WARN Please initialize the log4j system properly.
Tests run: 1, Failures: 0, Errors: 0, Skipped: 0, Time elapsed: 11.495 sec
Running org.apache.openejb.assembler.classic.JdbcConfigTest
log4j:WARN No appenders could be found for logger (OpenEJB.startup.config).
log4j:WARN Please initialize the log4j system properly.
Tests run: 1, Failures: 0, Errors: 0, Skipped: 0, Time elapsed: 3.279 sec
Running org.apache.openejb.util.ClassesTest
Tests run: 1, Failures: 0, Errors: 0, Skipped: 0, Time elapsed: 0.133 sec
Running org.apache.openejb.core.ivm.naming.IvmContextTest
Tests run: 4, Failures: 0, Errors: 0, Skipped: 0, Time elapsed: 0.123 sec
Running org.apache.openejb.config.JaxbUnmarshallerTest
Tests run: 1, Failures: 0, Errors: 0, Skipped: 0, Time elapsed: 1.627 sec
Running org.apache.openejb.DependenceValidationTest
Tests run: 1, Failures: 0, Errors: 0, Skipped: 0, Time elapsed: 1.556 sec
Running org.apache.openejb.resource.jdbc.BasicDataSourceUtilTest
Tests run: 2, Failures: 0, Errors: 0, Skipped: 0, Time elapsed: 0.107 sec
Running org.apache.openejb.core.cmp.jpa.JpaTest
Tests run: 2, Failures: 0, Errors: 0, Skipped: 0, Time elapsed: 8.313 sec
Running org.apache.openejb.core.stateful.StatefulContainerTest
log4j:WARN No appenders could be found for logger (OpenEJB.startup.config).
log4j:WARN Please initialize the log4j system properly.
Tests run: 2, Failures: 0, Errors: 2, Skipped: 0, Time elapsed: 5.234 sec <<< FAILURE!
Running org.apache.openejb.core.stateless.CrossClassLoaderProxyTest
log4j:WARN No appenders could be found for logger (OpenEJB).
log4j:WARN Please initialize the log4j system properly.
Tests run: 4, Failures: 0, Errors: 0, Skipped: 0, Time elapsed: 1.042 sec
Running org.apache.openejb.core.stateless.ExtendedInjectionTest
log4j:WARN No appenders could be found for logger (OpenEJB).
log4j:WARN Please initialize the log4j system properly.
Tests run: 2, Failures: 0, Errors: 0, Skipped: 0, Time elapsed: 0.991 sec
Running org.apache.openejb.core.stateful.StatefulSessionBeanTest
log4j:WARN No appenders could be found for logger (OpenEJB.startup.config).
log4j:WARN Please initialize the log4j system properly.
Tests run: 1, Failures: 0, Errors: 1, Skipped: 0, Time elapsed: 4.246 sec <<< FAILURE!
Running org.apache.openejb.assembler.classic.RedeployTest
log4j:WARN No appenders could be found for logger (OpenEJB.startup.config).
log4j:WARN Please initialize the log4j system properly.
1429  cmp  WARN   [main] openjpa.MetaData - Found duplicate metadata or mapping for "class
org.apache.openejb.test.entity.cmp2.Employee".  Ignoring.
Tests run: 1, Failures: 0, Errors: 1, Skipped: 0, Time elapsed: 22.37 sec <<< FAILURE!
Running org.apache.openejb.resource.SharedLocalConnectionManagerTest
Tests run: 1, Failures: 0, Errors: 0, Skipped: 0, Time elapsed: 1.092 sec
Running org.apache.openejb.assembler.classic.InterceptorBindingInfoComparatorTest
Tests run: 2, Failures: 0, Errors: 0, Skipped: 0, Time elapsed: 0.157 sec
Running org.apache.openejb.assembler.classic.MdbConfigTest
log4j:WARN No appenders could be found for logger (OpenEJB.startup.config).
log4j:WARN Please initialize the log4j system properly.
Tests run: 1, Failures: 0, Errors: 0, Skipped: 0, Time elapsed: 9.836 sec
Running org.apache.openejb.core.security.PropertiesLoginModuleTest
Path to login config: /x1/continuum/working-directory/158/target/classes/login.config
log4j:WARN No appenders could be found for logger (OpenEJB.security).
log4j:WARN Please initialize the log4j system properly.
Path to login config: /x1/continuum/working-directory/158/target/classes/login.config
Path to login config: /x1/continuum/working-directory/158/target/classes/login.config
Tests run: 3, Failures: 0, Errors: 0, Skipped: 0, Time elapsed: 0.208 sec
Running org.apache.openejb.assembler.classic.PersistenceUnitRefTest
Tests run: 1, Failures: 0, Errors: 0, Skipped: 0, Time elapsed: 0.188 sec
Running org.apache.openejb.resource.GeronimoConnectionManagerTest
log4j:WARN No appenders could be found for logger (org.apache.geronimo.connector.outbound.AbstractSinglePoolConnectionInterceptor).
log4j:WARN Please initialize the log4j system properly.
Tests run: 1, Failures: 0, Errors: 0, Skipped: 0, Time elapsed: 1.194 sec
Running org.apache.openejb.config.OpenEjb2ConversionTest
log4j:WARN No appenders could be found for logger (OpenEJB).
log4j:WARN Please initialize the log4j system properly.
Tests run: 9, Failures: 0, Errors: 0, Skipped: 0, Time elapsed: 9.959 sec
Running org.apache.openejb.SomeoneBrokeSurefireAndThisIsADirtyHackForItTest
WARNING: No test suite configuration file specified, assuming system properties contain all
needed information.  To specify a test suite configuration file by setting its location using
the system property "openejb.testsuite.properties"
Apache OpenEJB 3.0.0-SNAPSHOT    build: 20070804-10:11
http://openejb.apache.org/
test server = org.apache.openejb.test.IvmTestServer
entry = java.naming.factory.initial:org.apache.openejb.client.LocalInitialContextFactory
Intercepting BasicStatelessInterceptedBean by ddInterceptorPostConstruct()
Intercepting BasicStatelessInterceptedBean by secondClassInterceptorPostConstruct()
Intercepting BasicStatelessInterceptedBean by superClassInterceptorPostConstruct()
Intercepting BasicStatelessInterceptedBean by classInterceptorPostConstruct()
Intercepting BasicStatelessInterceptedBean by superBeanInterceptorPostConstruct()
Intercepting BasicStatelessInterceptedBean by inBeanInterceptorPostConstruct()
Intercepting reverse by ddInterceptor()
Intercepting reverse by secondClassInterceptor()
Intercepting reverse by superClassInterceptor()
Intercepting reverse by classInterceptor()
Intercepting reverse by methodInterceptor()
Intercepting reverse by superBeanInterceptor()
Intercepting reverse by inBeanInterceptor()
Reversing Intercept
Intercepting getContextData by superBeanInterceptor()
Intercepting getContextData by inBeanInterceptor()
Intercepting reverse by ddInterceptor()
Intercepting reverse by secondClassInterceptor()
Intercepting reverse by superClassInterceptor()
Intercepting reverse by classInterceptor()
Intercepting reverse by methodInterceptor()
Intercepting reverse by superBeanInterceptor()
Intercepting reverse by inBeanInterceptor()
Reversing Intercept
Intercepting getContextData by superBeanInterceptor()
Intercepting getContextData by inBeanInterceptor()
Intercepting getContextData by superBeanInterceptor()
Intercepting getContextData by inBeanInterceptor()
Intercepting concat by superBeanInterceptor()
Intercepting concat by inBeanInterceptor()
Intercepting getContextData by superBeanInterceptor()
Intercepting getContextData by inBeanInterceptor()
org.apache.maven.surefire.booter.SurefireExecutionException: org.apache.openejb.SomeoneBrokeSurefireAndThisIsADirtyHackForItTest;
nested exception is java.lang.IncompatibleClassChangeError: null; nested exception is org.apache.maven.surefire.testset.TestSetFailedException:
org.apache.openejb.SomeoneBrokeSurefireAndThisIsADirtyHackForItTest; nested exception is java.lang.IncompatibleClassChangeError:
null
org.apache.maven.surefire.testset.TestSetFailedException: org.apache.openejb.SomeoneBrokeSurefireAndThisIsADirtyHackForItTest;
nested exception is java.lang.IncompatibleClassChangeError: null
java.lang.IncompatibleClassChangeError
	at org.apache.openejb.core.stateful.StatefulEjbHomeHandler.createProxy(StatefulEjbHomeHandler.java:40)
	at org.apache.openejb.core.ivm.EjbHomeProxyHandler.create(EjbHomeProxyHandler.java:268)
	at org.apache.openejb.core.ivm.EjbHomeProxyHandler._invoke(EjbHomeProxyHandler.java:157)
	at org.apache.openejb.core.ivm.BaseEjbProxyHandler.invoke(BaseEjbProxyHandler.java:320)
	at org.apache.openejb.util.proxy.Jdk13InvocationHandler.invoke(Jdk13InvocationHandler.java:49)
	at $Proxy71.create(Unknown Source)
	at org.apache.openejb.test.stateful.StatefulPojoLocalIntfcTests.setUp(StatefulPojoLocalIntfcTests.java:35)
	at org.apache.openejb.test.NumberedTestCase.run(NumberedTestCase.java:93)
	at junit.framework.TestSuite.runTest(TestSuite.java:228)
	at junit.framework.TestSuite.run(TestSuite.java:223)
	at org.apache.openejb.test.TestSuite.run(TestSuite.java:46)
	at sun.reflect.NativeMethodAccessorImpl.invoke0(Native Method)
	at sun.reflect.NativeMethodAccessorImpl.invoke(NativeMethodAccessorImpl.java:39)
	at sun.reflect.DelegatingMethodAccessorImpl.invoke(DelegatingMethodAccessorImpl.java:25)
	at java.lang.reflect.Method.invoke(Method.java:585)
	at org.apache.maven.surefire.junit.JUnitTestSet.execute(JUnitTestSet.java:210)
	at org.apache.maven.surefire.suite.AbstractDirectoryTestSuite.executeTestSet(AbstractDirectoryTestSuite.java:135)
	at org.apache.maven.surefire.suite.AbstractDirectoryTestSuite.execute(AbstractDirectoryTestSuite.java:160)
	at org.apache.maven.surefire.Surefire.run(Surefire.java:81)
	at sun.reflect.NativeMethodAccessorImpl.invoke0(Native Method)
	at sun.reflect.NativeMethodAccessorImpl.invoke(NativeMethodAccessorImpl.java:39)
	at sun.reflect.DelegatingMethodAccessorImpl.invoke(DelegatingMethodAccessorImpl.java:25)
	at java.lang.reflect.Method.invoke(Method.java:585)
	at org.apache.maven.surefire.booter.SurefireBooter.runSuitesInProcess(SurefireBooter.java:182)
	at org.apache.maven.surefire.booter.SurefireBooter.main(SurefireBooter.java:743)
Running org.apache.openejb.core.mdb.JmsTest
log4j:WARN No appenders could be found for logger (org.apache.activemq.broker.BrokerService).
log4j:WARN Please initialize the log4j system properly.
Tests run: 1, Failures: 0, Errors: 0, Skipped: 0, Time elapsed: 11.232 sec
Running org.apache.openejb.iTest
Tests run: 0, Failures: 0, Errors: 0, Skipped: 0, Time elapsed: 0.026 sec
Running org.apache.openejb.core.stateless.StatelessContainerTest
log4j:WARN No appenders could be found for logger (OpenEJB).
log4j:WARN Please initialize the log4j system properly.
Tests run: 3, Failures: 0, Errors: 0, Skipped: 0, Time elapsed: 0.865 sec
Running org.apache.openejb.core.TemporaryClassLoaderTest
Tests run: 1, Failures: 0, Errors: 0, Skipped: 0, Time elapsed: 0.193 sec
Running org.apache.openejb.core.security.SecurityTest
log4j:WARN No appenders could be found for logger (OpenEJB.startup.config).
log4j:WARN Please initialize the log4j system properly.
Tests run: 1, Failures: 0, Errors: 0, Skipped: 0, Time elapsed: 4.042 sec
Running org.apache.openejb.assembler.classic.OpenEjbConfigurationValidationTest
Tests run: 1, Failures: 0, Errors: 0, Skipped: 0, Time elapsed: 0.191 sec
Running org.apache.openejb.config.rules.CheckInjectionTargetsTest
Tests run: 1, Failures: 0, Errors: 0, Skipped: 0, Time elapsed: 0.121 sec

Results :
Tests run: 76, Failures: 0, Errors: 7, Skipped: 0

[INFO] ------------------------------------------------------------------------
[ERROR] BUILD FAILURE
[INFO] ------------------------------------------------------------------------
[INFO] There are test failures.
[INFO] ------------------------------------------------------------------------
[INFO] For more information, run Maven with the -e switch
[INFO] ------------------------------------------------------------------------
[INFO] Total time: 5 minutes 49 seconds
[INFO] Finished at: Sat Aug 04 10:17:16 PDT 2007
[INFO] Final Memory: 16M/29M
[INFO] ------------------------------------------------------------------------

****************************************************************************



Mime
View raw message