tomee-commits mailing list archives

Site index · List index
Message view « Date » · « Thread »
Top « Date » · « Thread »
From "Continuum@vmbuild.apache.org" <comm...@openejb.apache.org>
Subject [continuum] BUILD FAILURE: OpenEJB :: Container :: Core
Date Thu, 02 Aug 2007 07:24:24 GMT
Online report : http://vmbuild.apache.org/continuum/servlet/continuum/target/ProjectBuild.vm/view/ProjectBuild/id/158/buildId/239615
Build statistics:
  State: Failed
  Previous State: Failed
  Started at: Thu, 2 Aug 2007 00:15:03 -0700
  Finished at: Thu, 2 Aug 2007 00:24:20 -0700
  Total time: 9m 16s
  Build Trigger: Schedule
  Exit code: 1
  Building machine hostname: vmbuild.apache.org
  Operating system : Linux(unknown)
  Java version : 1.5.0_06(Sun Microsystems Inc.)

Changes
         dblevins          Fix for OPENEJB-623: Apply container-transaction delcarations in
proper order

             /openejb/trunk/openejb3/container/openejb-core/src/main/java/org/apache/openejb/assembler/classic/Assembler.java
            /openejb/trunk/openejb3/container/openejb-core/src/main/java/org/apache/openejb/assembler/classic/AssemblerTool.java
            /openejb/trunk/openejb3/container/openejb-core/src/main/java/org/apache/openejb/assembler/classic/MethodTransactionBuilder.java
            /openejb/trunk/openejb3/container/openejb-core/src/main/java/org/apache/openejb/config/ConfigurationFactory.java
            /openejb/trunk/openejb3/container/openejb-core/src/main/java/org/apache/openejb/core/ivm/BaseEjbProxyHandler.java
            /openejb/trunk/openejb3/container/openejb-core/src/test/java/org/apache/openejb/assembler/classic/MethodTransactionInfoComparatorTest.java
        
****************************************************************************
Output:
****************************************************************************
[INFO] Scanning for projects...
[INFO] ----------------------------------------------------------------------------
[INFO] Building OpenEJB :: Container :: Core
[INFO]    task-segment: [install]
[INFO] ----------------------------------------------------------------------------
[INFO] [resources:resources]
[INFO] Using default encoding to copy filtered resources.
[INFO] [dependency:copy {execution: copy}]
[INFO] Configured Artifact: org.apache.openejb:openejb-javaagent:3.0.0-SNAPSHOT:jar
[INFO] snapshot org.apache.openejb:openejb-javaagent:3.0.0-SNAPSHOT: checking for updates
from codehaus-snapshot
[INFO] snapshot org.apache.openejb:openejb-javaagent:3.0.0-SNAPSHOT: checking for updates
from apache-m2-snapshot
[INFO] snapshot org.apache.openejb:openejb-javaagent:3.0.0-SNAPSHOT: checking for updates
from apache.snapshots
[INFO] org.apache.openejb:openejb-javaagent:3.0.0-SNAPSHOT:jar already exists in /x1/continuum/working-directory/158/target
[INFO] snapshot org.apache.openejb:openejb-loader:3.0.0-SNAPSHOT: checking for updates from
codehaus-snapshot
[INFO] snapshot org.apache.openejb:openejb-loader:3.0.0-SNAPSHOT: checking for updates from
apache-m2-snapshot
[INFO] snapshot org.apache.openejb:openejb-loader:3.0.0-SNAPSHOT: checking for updates from
apache.snapshots
[INFO] snapshot org.apache.openejb:openejb-jee:3.0.0-SNAPSHOT: checking for updates from codehaus-snapshot
[INFO] snapshot org.apache.openejb:openejb-jee:3.0.0-SNAPSHOT: checking for updates from apache-m2-snapshot
[INFO] snapshot org.apache.openejb:openejb-jee:3.0.0-SNAPSHOT: checking for updates from apache.snapshots
[INFO] snapshot org.apache.xbean:xbean-finder:3.0-SNAPSHOT: checking for updates from codehaus-snapshot
[INFO] snapshot org.apache.xbean:xbean-finder:3.0-SNAPSHOT: checking for updates from apache-m2-snapshot
[INFO] snapshot org.apache.xbean:xbean-finder:3.0-SNAPSHOT: checking for updates from apache.snapshots
[INFO] snapshot org.apache.xbean:xbean:3.0-SNAPSHOT: checking for updates from codehaus-snapshot
[INFO] snapshot org.apache.xbean:xbean:3.0-SNAPSHOT: checking for updates from apache-m2-snapshot
[INFO] snapshot org.apache.xbean:xbean:3.0-SNAPSHOT: checking for updates from apache.snapshots
[INFO] snapshot org.apache.geronimo.specs:geronimo-stax-api_1.0_spec:1.0-SNAPSHOT: checking
for updates from codehaus-snapshot
[INFO] snapshot org.apache.geronimo.specs:geronimo-stax-api_1.0_spec:1.0-SNAPSHOT: checking
for updates from apache-m2-snapshot
[INFO] snapshot org.apache.geronimo.specs:geronimo-stax-api_1.0_spec:1.0-SNAPSHOT: checking
for updates from apache.snapshots
[INFO] snapshot org.apache.openejb:openejb-itests-app:3.0.0-SNAPSHOT: checking for updates
from codehaus-snapshot
[INFO] snapshot org.apache.openejb:openejb-itests-app:3.0.0-SNAPSHOT: checking for updates
from apache-m2-snapshot
[INFO] snapshot org.apache.openejb:openejb-itests-app:3.0.0-SNAPSHOT: checking for updates
from apache.snapshots
[INFO] snapshot org.apache.openejb:itests:3.0.0-SNAPSHOT: checking for updates from codehaus-snapshot
[INFO] snapshot org.apache.openejb:itests:3.0.0-SNAPSHOT: checking for updates from apache-m2-snapshot
[INFO] snapshot org.apache.openejb:itests:3.0.0-SNAPSHOT: checking for updates from apache.snapshots
[INFO] snapshot org.apache.openejb:openejb-itests-beans:3.0.0-SNAPSHOT: checking for updates
from codehaus-snapshot
[INFO] snapshot org.apache.openejb:openejb-itests-beans:3.0.0-SNAPSHOT: checking for updates
from apache-m2-snapshot
[INFO] snapshot org.apache.openejb:openejb-itests-beans:3.0.0-SNAPSHOT: checking for updates
from apache.snapshots
[INFO] snapshot org.apache.openjpa:openjpa-persistence-jdbc:1.0.0-SNAPSHOT: checking for updates
from codehaus-snapshot
[INFO] snapshot org.apache.openjpa:openjpa-persistence-jdbc:1.0.0-SNAPSHOT: checking for updates
from apache-m2-snapshot
[INFO] snapshot org.apache.openjpa:openjpa-persistence-jdbc:1.0.0-SNAPSHOT: checking for updates
from apache.snapshots
[INFO] snapshot org.apache.openjpa:openjpa-parent:1.0.0-SNAPSHOT: checking for updates from
codehaus-snapshot
[INFO] snapshot org.apache.openjpa:openjpa-parent:1.0.0-SNAPSHOT: checking for updates from
apache-m2-snapshot
[INFO] snapshot org.apache.openjpa:openjpa-parent:1.0.0-SNAPSHOT: checking for updates from
apache.snapshots
[INFO] snapshot org.apache.openjpa:openjpa-jdbc-5:1.0.0-SNAPSHOT: checking for updates from
codehaus-snapshot
[INFO] snapshot org.apache.openjpa:openjpa-jdbc-5:1.0.0-SNAPSHOT: checking for updates from
apache-m2-snapshot
[INFO] snapshot org.apache.openjpa:openjpa-jdbc-5:1.0.0-SNAPSHOT: checking for updates from
apache.snapshots
[INFO] snapshot org.apache.openjpa:openjpa-jdbc:1.0.0-SNAPSHOT: checking for updates from
codehaus-snapshot
[INFO] snapshot org.apache.openjpa:openjpa-jdbc:1.0.0-SNAPSHOT: checking for updates from
apache-m2-snapshot
[INFO] snapshot org.apache.openjpa:openjpa-jdbc:1.0.0-SNAPSHOT: checking for updates from
apache.snapshots
[INFO] snapshot org.apache.openjpa:openjpa-kernel:1.0.0-SNAPSHOT: checking for updates from
codehaus-snapshot
[INFO] snapshot org.apache.openjpa:openjpa-kernel:1.0.0-SNAPSHOT: checking for updates from
apache-m2-snapshot
[INFO] snapshot org.apache.openjpa:openjpa-kernel:1.0.0-SNAPSHOT: checking for updates from
apache.snapshots
[INFO] snapshot org.apache.openjpa:openjpa-lib:1.0.0-SNAPSHOT: checking for updates from codehaus-snapshot
[INFO] snapshot org.apache.openjpa:openjpa-lib:1.0.0-SNAPSHOT: checking for updates from apache-m2-snapshot
[INFO] snapshot org.apache.openjpa:openjpa-lib:1.0.0-SNAPSHOT: checking for updates from apache.snapshots
[INFO] snapshot org.apache.openjpa:openjpa-persistence:1.0.0-SNAPSHOT: checking for updates
from codehaus-snapshot
[INFO] snapshot org.apache.openjpa:openjpa-persistence:1.0.0-SNAPSHOT: checking for updates
from apache-m2-snapshot
[INFO] snapshot org.apache.openjpa:openjpa-persistence:1.0.0-SNAPSHOT: checking for updates
from apache.snapshots
[INFO] snapshot org.apache.openjpa:openjpa-kernel-5:1.0.0-SNAPSHOT: checking for updates from
codehaus-snapshot
[INFO] snapshot org.apache.openjpa:openjpa-kernel-5:1.0.0-SNAPSHOT: checking for updates from
apache-m2-snapshot
[INFO] snapshot org.apache.openjpa:openjpa-kernel-5:1.0.0-SNAPSHOT: checking for updates from
apache.snapshots
[INFO] snapshot org.apache.openejb:openejb-itests-interceptor-beans:3.0.0-SNAPSHOT: checking
for updates from codehaus-snapshot
[INFO] snapshot org.apache.openejb:openejb-itests-interceptor-beans:3.0.0-SNAPSHOT: checking
for updates from apache-m2-snapshot
[INFO] snapshot org.apache.openejb:openejb-itests-interceptor-beans:3.0.0-SNAPSHOT: checking
for updates from apache.snapshots
[INFO] snapshot org.apache.openejb:openejb-itests-client:3.0.0-SNAPSHOT: checking for updates
from codehaus-snapshot
[INFO] snapshot org.apache.openejb:openejb-itests-client:3.0.0-SNAPSHOT: checking for updates
from apache-m2-snapshot
[INFO] snapshot org.apache.openejb:openejb-itests-client:3.0.0-SNAPSHOT: checking for updates
from apache.snapshots
[INFO] snapshot org.apache.geronimo.components:geronimo-connector:2.0-SNAPSHOT: checking for
updates from codehaus-snapshot
[INFO] snapshot org.apache.geronimo.components:geronimo-connector:2.0-SNAPSHOT: checking for
updates from apache-m2-snapshot
[INFO] snapshot org.apache.geronimo.components:geronimo-connector:2.0-SNAPSHOT: checking for
updates from apache.snapshots
[INFO] snapshot org.apache.geronimo.genesis.config:project-config:1.2-SNAPSHOT: checking for
updates from codehaus-snapshot
[INFO] snapshot org.apache.geronimo.genesis.config:project-config:1.2-SNAPSHOT: checking for
updates from apache-m2-snapshot
[INFO] snapshot org.apache.geronimo.genesis.config:project-config:1.2-SNAPSHOT: checking for
updates from apache.snapshots
[INFO] snapshot org.apache.geronimo.genesis.config:config:1.2-SNAPSHOT: checking for updates
from apache-snapshots
[INFO] snapshot org.apache.geronimo.genesis.config:config:1.2-SNAPSHOT: checking for updates
from codehaus-snapshots
[INFO] snapshot org.apache.geronimo.genesis.config:config:1.2-SNAPSHOT: checking for updates
from codehaus-snapshot
[INFO] snapshot org.apache.geronimo.genesis.config:config:1.2-SNAPSHOT: checking for updates
from apache-m2-snapshot
[INFO] snapshot org.apache.geronimo.genesis.config:config:1.2-SNAPSHOT: checking for updates
from apache.snapshots
[INFO] snapshot org.apache.geronimo.genesis:genesis:1.2-SNAPSHOT: checking for updates from
apache-snapshots
[INFO] snapshot org.apache.geronimo.genesis:genesis:1.2-SNAPSHOT: checking for updates from
codehaus-snapshots
[INFO] snapshot org.apache.geronimo.genesis:genesis:1.2-SNAPSHOT: checking for updates from
codehaus-snapshot
[INFO] snapshot org.apache.geronimo.genesis:genesis:1.2-SNAPSHOT: checking for updates from
apache-m2-snapshot
[INFO] snapshot org.apache.geronimo.genesis:genesis:1.2-SNAPSHOT: checking for updates from
apache.snapshots
[INFO] snapshot org.apache.geronimo.components:geronimo-transaction:2.0-SNAPSHOT: checking
for updates from codehaus-snapshot
[INFO] snapshot org.apache.geronimo.components:geronimo-transaction:2.0-SNAPSHOT: checking
for updates from apache-m2-snapshot
[INFO] snapshot org.apache.geronimo.components:geronimo-transaction:2.0-SNAPSHOT: checking
for updates from apache.snapshots
[INFO] snapshot org.apache.geronimo.javamail:geronimo-javamail_1.4_mail:1.1-SNAPSHOT: checking
for updates from codehaus-snapshot
[INFO] snapshot org.apache.geronimo.javamail:geronimo-javamail_1.4_mail:1.1-SNAPSHOT: checking
for updates from apache-m2-snapshot
[INFO] snapshot org.apache.geronimo.javamail:geronimo-javamail_1.4_mail:1.1-SNAPSHOT: checking
for updates from apache.snapshots
[INFO] snapshot org.apache.geronimo.javamail:javamail:1.1-SNAPSHOT: checking for updates from
codehaus-snapshot
[INFO] snapshot org.apache.geronimo.javamail:javamail:1.1-SNAPSHOT: checking for updates from
apache-m2-snapshot
[INFO] snapshot org.apache.geronimo.javamail:javamail:1.1-SNAPSHOT: checking for updates from
apache.snapshots
[INFO] snapshot org.apache.geronimo.javamail:geronimo-javamail_1.4_provider:1.1-SNAPSHOT:
checking for updates from codehaus-snapshot
[INFO] snapshot org.apache.geronimo.javamail:geronimo-javamail_1.4_provider:1.1-SNAPSHOT:
checking for updates from apache-m2-snapshot
[INFO] snapshot org.apache.geronimo.javamail:geronimo-javamail_1.4_provider:1.1-SNAPSHOT:
checking for updates from apache.snapshots
[INFO] snapshot org.apache.geronimo.specs:geronimo-javamail_1.4_spec:1.0-SNAPSHOT: checking
for updates from codehaus-snapshot
[INFO] snapshot org.apache.geronimo.specs:geronimo-javamail_1.4_spec:1.0-SNAPSHOT: checking
for updates from apache-m2-snapshot
[INFO] snapshot org.apache.geronimo.specs:geronimo-javamail_1.4_spec:1.0-SNAPSHOT: checking
for updates from apache.snapshots
[INFO] snapshot org.apache.xbean:xbean-reflect:3.1-SNAPSHOT: checking for updates from codehaus-snapshot
[INFO] snapshot org.apache.xbean:xbean-reflect:3.1-SNAPSHOT: checking for updates from apache-m2-snapshot
[INFO] snapshot org.apache.xbean:xbean-reflect:3.1-SNAPSHOT: checking for updates from apache.snapshots
[INFO] snapshot org.apache.xbean:xbean:3.1-SNAPSHOT: checking for updates from codehaus-snapshot
[INFO] snapshot org.apache.xbean:xbean:3.1-SNAPSHOT: checking for updates from apache-m2-snapshot
[INFO] snapshot org.apache.xbean:xbean:3.1-SNAPSHOT: checking for updates from apache.snapshots
[INFO] snapshot org.apache.xbean:xbean-naming:3.0-SNAPSHOT: checking for updates from codehaus-snapshot
[INFO] snapshot org.apache.xbean:xbean-naming:3.0-SNAPSHOT: checking for updates from apache-m2-snapshot
[INFO] snapshot org.apache.xbean:xbean-naming:3.0-SNAPSHOT: checking for updates from apache.snapshots
[INFO] snapshot commons-dbcp:commons-dbcp:1.3-SNAPSHOT: checking for updates from codehaus-snapshot
[INFO] snapshot commons-dbcp:commons-dbcp:1.3-SNAPSHOT: checking for updates from apache-m2-snapshot
[INFO] snapshot commons-dbcp:commons-dbcp:1.3-SNAPSHOT: checking for updates from apache.snapshots
[INFO] snapshot org.apache.axis2:axis2-jaxws-api:SNAPSHOT: checking for updates from codehaus-snapshot
[INFO] snapshot org.apache.axis2:axis2-jaxws-api:SNAPSHOT: checking for updates from apache-m2-snapshot
[INFO] snapshot org.apache.axis2:axis2-jaxws-api:SNAPSHOT: checking for updates from apache.snapshots
Downloading: http://people.apache.org/repo/m2-snapshot-repository/org/apache/axis2/axis2-jaxws-api/SNAPSHOT/axis2-jaxws-api-20070802.044954-93.pom
2K downloaded
[INFO] snapshot org.apache.axis2:axis2-parent:SNAPSHOT: checking for updates from codehaus-snapshot
[INFO] snapshot org.apache.axis2:axis2-parent:SNAPSHOT: checking for updates from apache-m2-snapshot
[INFO] snapshot org.apache.axis2:axis2-parent:SNAPSHOT: checking for updates from apache.snapshots
Downloading: http://people.apache.org/repo/m2-snapshot-repository/org/apache/axis2/axis2-parent/SNAPSHOT/axis2-parent-20070802.044954-94.pom
38K downloaded
[INFO] snapshot org.apache.ws.commons.axiom:axiom-impl:SNAPSHOT: checking for updates from
codehaus-snapshot
[INFO] snapshot org.apache.ws.commons.axiom:axiom-impl:SNAPSHOT: checking for updates from
apache-m2-snapshot
[INFO] snapshot org.apache.ws.commons.axiom:axiom-impl:SNAPSHOT: checking for updates from
apache.snapshots
Downloading: http://people.apache.org/repo/m2-snapshot-repository/org/apache/ws/commons/axiom/axiom-impl/SNAPSHOT/axiom-impl-20070802.044247-474.pom
2K downloaded
[INFO] snapshot org.apache.ws.commons.axiom:axiom-parent:SNAPSHOT: checking for updates from
codehaus-snapshot
[INFO] snapshot org.apache.ws.commons.axiom:axiom-parent:SNAPSHOT: checking for updates from
apache-m2-snapshot
[INFO] snapshot org.apache.ws.commons.axiom:axiom-parent:SNAPSHOT: checking for updates from
apache.snapshots
Downloading: http://people.apache.org/repo/m2-snapshot-repository/org/apache/ws/commons/axiom/axiom-parent/SNAPSHOT/axiom-parent-20070802.044247-476.pom
19K downloaded
[INFO] snapshot org.apache.ws.commons.axiom:axiom-api:SNAPSHOT: checking for updates from
codehaus-snapshot
[INFO] snapshot org.apache.ws.commons.axiom:axiom-api:SNAPSHOT: checking for updates from
apache-m2-snapshot
[INFO] snapshot org.apache.ws.commons.axiom:axiom-api:SNAPSHOT: checking for updates from
apache.snapshots
Downloading: http://people.apache.org/repo/m2-snapshot-repository/org/apache/ws/commons/axiom/axiom-api/SNAPSHOT/axiom-api-20070802.044247-475.pom
2K downloaded
[INFO] snapshot org.apache.ws.commons.axiom:axiom-dom:SNAPSHOT: checking for updates from
codehaus-snapshot
[INFO] snapshot org.apache.ws.commons.axiom:axiom-dom:SNAPSHOT: checking for updates from
apache-m2-snapshot
[INFO] snapshot org.apache.ws.commons.axiom:axiom-dom:SNAPSHOT: checking for updates from
apache.snapshots
Downloading: http://people.apache.org/repo/m2-snapshot-repository/org/apache/ws/commons/axiom/axiom-dom/SNAPSHOT/axiom-dom-20070802.044247-474.pom
2K downloaded
[INFO] snapshot org.apache.axis2:axis2-saaj-api:SNAPSHOT: checking for updates from codehaus-snapshot
[INFO] snapshot org.apache.axis2:axis2-saaj-api:SNAPSHOT: checking for updates from apache-m2-snapshot
[INFO] snapshot org.apache.axis2:axis2-saaj-api:SNAPSHOT: checking for updates from apache.snapshots
Downloading: http://people.apache.org/repo/m2-snapshot-repository/org/apache/axis2/axis2-saaj-api/SNAPSHOT/axis2-saaj-api-20070802.044954-93.pom
2K downloaded
Downloading: http://people.apache.org/repo/m2-snapshot-repository/org/apache/ws/commons/axiom/axiom-dom/SNAPSHOT/axiom-dom-20070802.044247-474.jar
140K downloaded
Downloading: http://people.apache.org/repo/m2-snapshot-repository/org/apache/ws/commons/axiom/axiom-api/SNAPSHOT/axiom-api-20070802.044247-475.jar
134K downloaded
Downloading: http://people.apache.org/repo/m2-snapshot-repository/org/apache/ws/commons/axiom/axiom-impl/SNAPSHOT/axiom-impl-20070802.044247-474.jar
112K downloaded
Downloading: http://people.apache.org/repo/m2-snapshot-repository/org/apache/axis2/axis2-saaj-api/SNAPSHOT/axis2-saaj-api-20070802.044954-93.jar
25K downloaded
Downloading: http://people.apache.org/repo/m2-snapshot-repository/org/apache/axis2/axis2-jaxws-api/SNAPSHOT/axis2-jaxws-api-20070802.044954-93.jar
28K downloaded
[INFO] [compiler:compile]
Compiling 5 source files to /x1/continuum/working-directory/158/target/classes
Downloading: http://people.apache.org/repo/m2-incubating-repository/org/apache/axis2/axis2-jaxws-api/20070802.044954-93/axis2-jaxws-api-20070802.044954-93.pom
Downloading: http://tomcat.apache.org/dev/dist/m2-repository/org/apache/axis2/axis2-jaxws-api/20070802.044954-93/axis2-jaxws-api-20070802.044954-93.pom
Downloading: http://repo1.maven.org/maven2/org/apache/axis2/axis2-jaxws-api/20070802.044954-93/axis2-jaxws-api-20070802.044954-93.pom
[INFO] [antrun:run {execution: default}]
[INFO] Executing tasks
[INFO] Executed tasks
[INFO] [resources:testResources]
[INFO] Using default encoding to copy filtered resources.
[INFO] [compiler:testCompile]
Compiling 1 source file to /x1/continuum/working-directory/158/target/test-classes
[INFO] [surefire:test]
[INFO] Surefire report directory: /x1/continuum/working-directory/158/target/surefire-reports

-------------------------------------------------------
 T E S T S
-------------------------------------------------------
Running org.apache.openejb.core.stateless.JaxWsWebServiceInvocationTest
log4j:WARN No appenders could be found for logger (OpenEJB.startup.config).
log4j:WARN Please initialize the log4j system properly.
Tests run: 1, Failures: 0, Errors: 0, Skipped: 0, Time elapsed: 4.636 sec
Running org.apache.openejb.core.stateless.StatelessInterceptorTest
log4j:WARN No appenders could be found for logger (OpenEJB.startup.config).
log4j:WARN Please initialize the log4j system properly.
Tests run: 1, Failures: 0, Errors: 0, Skipped: 0, Time elapsed: 4.693 sec
Running org.apache.openejb.core.mdb.MdbTest
log4j:WARN No appenders could be found for logger (org.apache.activemq.broker.BrokerService).
log4j:WARN Please initialize the log4j system properly.
Tests run: 1, Failures: 0, Errors: 0, Skipped: 0, Time elapsed: 12.649 sec
Running org.apache.openejb.assembler.classic.MethodTransactionInfoComparatorTest
Tests run: 1, Failures: 0, Errors: 0, Skipped: 0, Time elapsed: 0.068 sec
Running org.apache.openejb.core.stateful.StatefulInterceptorTest
log4j:WARN No appenders could be found for logger (OpenEJB.startup.config).
log4j:WARN Please initialize the log4j system properly.
Tests run: 1, Failures: 0, Errors: 1, Skipped: 0, Time elapsed: 4.29 sec <<< FAILURE!
Running org.apache.openejb.config.ConfigureServiceTest
Tests run: 4, Failures: 0, Errors: 0, Skipped: 0, Time elapsed: 1.832 sec
log4j:WARN No appenders could be found for logger (OpenEJB.startup.config).
log4j:WARN Please initialize the log4j system properly.
Running org.apache.openejb.core.mdb.SimpleJmsTest
log4j:WARN No appenders could be found for logger (org.apache.activemq.broker.BrokerService).
log4j:WARN Please initialize the log4j system properly.
Tests run: 1, Failures: 0, Errors: 0, Skipped: 0, Time elapsed: 11.406 sec
Running org.apache.openejb.config.SunQueryFilterTest
Tests run: 5, Failures: 0, Errors: 0, Skipped: 0, Time elapsed: 0.141 sec
Running org.apache.openejb.core.stateful.Compat3to2Test
log4j:WARN No appenders could be found for logger (OpenEJB.startup.config).
log4j:WARN Please initialize the log4j system properly.
Tests run: 1, Failures: 0, Errors: 1, Skipped: 0, Time elapsed: 4.743 sec <<< FAILURE!
Running org.apache.openejb.config.SunCmpConversionTest
log4j:WARN No appenders could be found for logger (OpenEJB).
log4j:WARN Please initialize the log4j system properly.
Tests run: 8, Failures: 0, Errors: 0, Skipped: 0, Time elapsed: 15.095 sec
Running org.apache.openejb.ApplicationTest
WARNING: No test suite configuration file specified, assuming system properties contain all
needed information.  To specify a test suite configuration file by setting its location using
the system property "openejb.testsuite.properties"
Apache OpenEJB 3.0.0-SNAPSHOT    build: 20070802-12:15
http://openejb.apache.org/
test server = org.apache.openejb.test.IvmTestServer
entry = java.naming.factory.initial:org.apache.openejb.client.LocalInitialContextFactory
Cannot start the test database: java.lang.IllegalStateException Cannot find 'client/tools/DatabaseHome':
javax.naming.NameNotFoundException Name "client/tools/DatabaseHome" not found.
Tests run: 1, Failures: 0, Errors: 1, Skipped: 0, Time elapsed: 17.988 sec <<< FAILURE!
Running org.apache.openejb.core.stateless.JaxRpcWebServiceInvocationTest
log4j:WARN No appenders could be found for logger (OpenEJB.startup.config).
log4j:WARN Please initialize the log4j system properly.
Tests run: 2, Failures: 0, Errors: 0, Skipped: 0, Time elapsed: 3.971 sec
Running org.apache.openejb.core.mdb.JmsProxyTest
log4j:WARN No appenders could be found for logger (org.apache.activemq.broker.BrokerService).
log4j:WARN Please initialize the log4j system properly.
Tests run: 1, Failures: 0, Errors: 0, Skipped: 0, Time elapsed: 14.34 sec
Running org.apache.openejb.assembler.classic.JdbcConfigTest
log4j:WARN No appenders could be found for logger (OpenEJB.startup.config).
log4j:WARN Please initialize the log4j system properly.
Tests run: 1, Failures: 0, Errors: 0, Skipped: 0, Time elapsed: 3.874 sec
Running org.apache.openejb.util.ClassesTest
Tests run: 1, Failures: 0, Errors: 0, Skipped: 0, Time elapsed: 0.063 sec
Running org.apache.openejb.core.ivm.naming.IvmContextTest
Tests run: 4, Failures: 0, Errors: 0, Skipped: 0, Time elapsed: 0.142 sec
Running org.apache.openejb.config.JaxbUnmarshallerTest
Tests run: 1, Failures: 0, Errors: 0, Skipped: 0, Time elapsed: 1.702 sec
Running org.apache.openejb.DependenceValidationTest
Tests run: 1, Failures: 0, Errors: 0, Skipped: 0, Time elapsed: 1.585 sec
Running org.apache.openejb.resource.jdbc.BasicDataSourceUtilTest
Tests run: 2, Failures: 0, Errors: 0, Skipped: 0, Time elapsed: 0.113 sec
Running org.apache.openejb.core.cmp.jpa.JpaTest
Tests run: 2, Failures: 0, Errors: 0, Skipped: 0, Time elapsed: 8.753 sec
Running org.apache.openejb.core.stateful.StatefulContainerTest
log4j:WARN No appenders could be found for logger (OpenEJB.startup.config).
log4j:WARN Please initialize the log4j system properly.
Tests run: 2, Failures: 0, Errors: 2, Skipped: 0, Time elapsed: 9.016 sec <<< FAILURE!
Running org.apache.openejb.core.stateless.CrossClassLoaderProxyTest
log4j:WARN No appenders could be found for logger (OpenEJB).
log4j:WARN Please initialize the log4j system properly.
Tests run: 4, Failures: 0, Errors: 0, Skipped: 0, Time elapsed: 2.852 sec
Running org.apache.openejb.core.stateless.ExtendedInjectionTest
log4j:WARN No appenders could be found for logger (OpenEJB).
log4j:WARN Please initialize the log4j system properly.
Tests run: 2, Failures: 0, Errors: 0, Skipped: 0, Time elapsed: 1.367 sec
Running org.apache.openejb.core.stateful.StatefulSessionBeanTest
log4j:WARN No appenders could be found for logger (OpenEJB.startup.config).
log4j:WARN Please initialize the log4j system properly.
Tests run: 1, Failures: 0, Errors: 1, Skipped: 0, Time elapsed: 16.285 sec <<< FAILURE!
Running org.apache.openejb.assembler.classic.RedeployTest
log4j:WARN No appenders could be found for logger (OpenEJB.startup.config).
log4j:WARN Please initialize the log4j system properly.
2838  cmp  WARN   [main] openjpa.MetaData - Found duplicate metadata or mapping for "class
org.apache.openejb.test.entity.cmp2.Employee".  Ignoring.
Tests run: 1, Failures: 0, Errors: 1, Skipped: 0, Time elapsed: 43.787 sec <<< FAILURE!
Running org.apache.openejb.resource.SharedLocalConnectionManagerTest
Tests run: 1, Failures: 0, Errors: 0, Skipped: 0, Time elapsed: 2.032 sec
Running org.apache.openejb.assembler.classic.InterceptorBindingInfoComparatorTest
Tests run: 2, Failures: 0, Errors: 0, Skipped: 0, Time elapsed: 0.538 sec
Running org.apache.openejb.assembler.classic.MdbConfigTest
log4j:WARN No appenders could be found for logger (OpenEJB.startup.config).
log4j:WARN Please initialize the log4j system properly.
Tests run: 1, Failures: 0, Errors: 0, Skipped: 0, Time elapsed: 18.682 sec
Running org.apache.openejb.core.security.PropertiesLoginModuleTest
Path to login config: /x1/continuum/working-directory/158/target/classes/login.config
log4j:WARN No appenders could be found for logger (OpenEJB.security).
log4j:WARN Please initialize the log4j system properly.
Path to login config: /x1/continuum/working-directory/158/target/classes/login.config
Path to login config: /x1/continuum/working-directory/158/target/classes/login.config
Tests run: 3, Failures: 0, Errors: 0, Skipped: 0, Time elapsed: 0.419 sec
Running org.apache.openejb.assembler.classic.PersistenceUnitRefTest
Tests run: 1, Failures: 0, Errors: 0, Skipped: 0, Time elapsed: 0.716 sec
Running org.apache.openejb.resource.GeronimoConnectionManagerTest
log4j:WARN No appenders could be found for logger (org.apache.geronimo.connector.outbound.AbstractSinglePoolConnectionInterceptor).
log4j:WARN Please initialize the log4j system properly.
Tests run: 1, Failures: 0, Errors: 0, Skipped: 0, Time elapsed: 2.074 sec
Running org.apache.openejb.config.OpenEjb2ConversionTest
log4j:WARN No appenders could be found for logger (OpenEJB).
log4j:WARN Please initialize the log4j system properly.
Tests run: 9, Failures: 0, Errors: 0, Skipped: 0, Time elapsed: 15.704 sec
Running org.apache.openejb.SomeoneBrokeSurefireAndThisIsADirtyHackForItTest
WARNING: No test suite configuration file specified, assuming system properties contain all
needed information.  To specify a test suite configuration file by setting its location using
the system property "openejb.testsuite.properties"
Apache OpenEJB 3.0.0-SNAPSHOT    build: 20070802-12:15
http://openejb.apache.org/
test server = org.apache.openejb.test.IvmTestServer
entry = java.naming.factory.initial:org.apache.openejb.client.LocalInitialContextFactory
Intercepting BasicStatelessInterceptedBean by ddInterceptorPostConstruct()
Intercepting BasicStatelessInterceptedBean by secondClassInterceptorPostConstruct()
Intercepting BasicStatelessInterceptedBean by superClassInterceptorPostConstruct()
Intercepting BasicStatelessInterceptedBean by classInterceptorPostConstruct()
Intercepting BasicStatelessInterceptedBean by superBeanInterceptorPostConstruct()
Intercepting BasicStatelessInterceptedBean by inBeanInterceptorPostConstruct()
Intercepting reverse by ddInterceptor()
Intercepting reverse by secondClassInterceptor()
Intercepting reverse by superClassInterceptor()
Intercepting reverse by classInterceptor()
Intercepting reverse by methodInterceptor()
Intercepting reverse by superBeanInterceptor()
Intercepting reverse by inBeanInterceptor()
Reversing Intercept
Intercepting getContextData by superBeanInterceptor()
Intercepting getContextData by inBeanInterceptor()
Intercepting reverse by ddInterceptor()
Intercepting reverse by secondClassInterceptor()
Intercepting reverse by superClassInterceptor()
Intercepting reverse by classInterceptor()
Intercepting reverse by methodInterceptor()
Intercepting reverse by superBeanInterceptor()
Intercepting reverse by inBeanInterceptor()
Reversing Intercept
Intercepting getContextData by superBeanInterceptor()
Intercepting getContextData by inBeanInterceptor()
Intercepting getContextData by superBeanInterceptor()
Intercepting getContextData by inBeanInterceptor()
Intercepting concat by superBeanInterceptor()
Intercepting concat by inBeanInterceptor()
Intercepting getContextData by superBeanInterceptor()
Intercepting getContextData by inBeanInterceptor()
org.apache.maven.surefire.booter.SurefireExecutionException: org.apache.openejb.SomeoneBrokeSurefireAndThisIsADirtyHackForItTest;
nested exception is java.lang.IncompatibleClassChangeError: null; nested exception is org.apache.maven.surefire.testset.TestSetFailedException:
org.apache.openejb.SomeoneBrokeSurefireAndThisIsADirtyHackForItTest; nested exception is java.lang.IncompatibleClassChangeError:
null
org.apache.maven.surefire.testset.TestSetFailedException: org.apache.openejb.SomeoneBrokeSurefireAndThisIsADirtyHackForItTest;
nested exception is java.lang.IncompatibleClassChangeError: null
java.lang.IncompatibleClassChangeError
	at org.apache.openejb.core.stateful.StatefulEjbHomeHandler.createProxy(StatefulEjbHomeHandler.java:40)
	at org.apache.openejb.core.ivm.EjbHomeProxyHandler.create(EjbHomeProxyHandler.java:268)
	at org.apache.openejb.core.ivm.EjbHomeProxyHandler._invoke(EjbHomeProxyHandler.java:157)
	at org.apache.openejb.core.ivm.BaseEjbProxyHandler.invoke(BaseEjbProxyHandler.java:305)
	at org.apache.openejb.util.proxy.Jdk13InvocationHandler.invoke(Jdk13InvocationHandler.java:49)
	at $Proxy71.create(Unknown Source)
	at org.apache.openejb.test.stateful.StatefulPojoLocalIntfcTests.setUp(StatefulPojoLocalIntfcTests.java:35)
	at org.apache.openejb.test.NumberedTestCase.run(NumberedTestCase.java:93)
	at junit.framework.TestSuite.runTest(TestSuite.java:228)
	at junit.framework.TestSuite.run(TestSuite.java:223)
	at org.apache.openejb.test.TestSuite.run(TestSuite.java:46)
	at sun.reflect.NativeMethodAccessorImpl.invoke0(Native Method)
	at sun.reflect.NativeMethodAccessorImpl.invoke(NativeMethodAccessorImpl.java:39)
	at sun.reflect.DelegatingMethodAccessorImpl.invoke(DelegatingMethodAccessorImpl.java:25)
	at java.lang.reflect.Method.invoke(Method.java:585)
	at org.apache.maven.surefire.junit.JUnitTestSet.execute(JUnitTestSet.java:210)
	at org.apache.maven.surefire.suite.AbstractDirectoryTestSuite.executeTestSet(AbstractDirectoryTestSuite.java:135)
	at org.apache.maven.surefire.suite.AbstractDirectoryTestSuite.execute(AbstractDirectoryTestSuite.java:160)
	at org.apache.maven.surefire.Surefire.run(Surefire.java:81)
	at sun.reflect.NativeMethodAccessorImpl.invoke0(Native Method)
	at sun.reflect.NativeMethodAccessorImpl.invoke(NativeMethodAccessorImpl.java:39)
	at sun.reflect.DelegatingMethodAccessorImpl.invoke(DelegatingMethodAccessorImpl.java:25)
	at java.lang.reflect.Method.invoke(Method.java:585)
	at org.apache.maven.surefire.booter.SurefireBooter.runSuitesInProcess(SurefireBooter.java:182)
	at org.apache.maven.surefire.booter.SurefireBooter.main(SurefireBooter.java:743)
Running org.apache.openejb.core.mdb.JmsTest
log4j:WARN No appenders could be found for logger (org.apache.activemq.broker.BrokerService).
log4j:WARN Please initialize the log4j system properly.
Tests run: 1, Failures: 0, Errors: 0, Skipped: 0, Time elapsed: 11.836 sec
Running org.apache.openejb.iTest
Tests run: 0, Failures: 0, Errors: 0, Skipped: 0, Time elapsed: 0.032 sec
Running org.apache.openejb.core.stateless.StatelessContainerTest
log4j:WARN No appenders could be found for logger (OpenEJB).
log4j:WARN Please initialize the log4j system properly.
Tests run: 3, Failures: 0, Errors: 0, Skipped: 0, Time elapsed: 1.088 sec
Running org.apache.openejb.core.TemporaryClassLoaderTest
Tests run: 1, Failures: 0, Errors: 0, Skipped: 0, Time elapsed: 0.221 sec
Running org.apache.openejb.core.security.SecurityTest
log4j:WARN No appenders could be found for logger (OpenEJB.startup.config).
log4j:WARN Please initialize the log4j system properly.
Tests run: 1, Failures: 0, Errors: 0, Skipped: 0, Time elapsed: 8.496 sec
Running org.apache.openejb.assembler.classic.OpenEjbConfigurationValidationTest
Tests run: 1, Failures: 0, Errors: 0, Skipped: 0, Time elapsed: 0.574 sec
Running org.apache.openejb.config.rules.CheckInjectionTargetsTest
Tests run: 1, Failures: 0, Errors: 0, Skipped: 0, Time elapsed: 0.197 sec

Results :
Tests run: 76, Failures: 0, Errors: 7, Skipped: 0

[INFO] ------------------------------------------------------------------------
[ERROR] BUILD FAILURE
[INFO] ------------------------------------------------------------------------
[INFO] There are test failures.
[INFO] ------------------------------------------------------------------------
[INFO] For more information, run Maven with the -e switch
[INFO] ------------------------------------------------------------------------
[INFO] Total time: 8 minutes 26 seconds
[INFO] Finished at: Thu Aug 02 00:23:33 PDT 2007
[INFO] Final Memory: 17M/38M
[INFO] ------------------------------------------------------------------------

****************************************************************************



Mime
View raw message