tomee-commits mailing list archives

Site index · List index
Message view « Date » · « Thread »
Top « Date » · « Thread »
From "Continuum@vmbuild.apache.org" <comm...@openejb.apache.org>
Subject [continuum] BUILD FAILURE: OpenEJB :: Server :: Core
Date Thu, 02 Aug 2007 04:22:52 GMT
Online report : http://vmbuild.apache.org/continuum/servlet/continuum/target/ProjectBuild.vm/view/ProjectBuild/id/165/buildId/239479
Build statistics:
  State: Failed
  Previous State: Failed
  Started at: Wed, 1 Aug 2007 21:22:33 -0700
  Finished at: Wed, 1 Aug 2007 21:22:51 -0700
  Total time: 18s
  Build Trigger: Forced
  Exit code: 1
  Building machine hostname: vmbuild.apache.org
  Operating system : Linux(unknown)
  Java version : 1.5.0_06(Sun Microsystems Inc.)

Changes
      No files changed
  
****************************************************************************
Output:
****************************************************************************
[INFO] Scanning for projects...
[INFO] ----------------------------------------------------------------------------
[INFO] Building OpenEJB :: Server :: Core
[INFO]    task-segment: [install]
[INFO] ----------------------------------------------------------------------------
[INFO] [resources:resources]
[INFO] Using default encoding to copy filtered resources.
[INFO] [compiler:compile]
Compiling 1 source file to /x1/continuum/working-directory/165/target/classes
[INFO] ------------------------------------------------------------------------
[ERROR] BUILD FAILURE
[INFO] ------------------------------------------------------------------------
[INFO] Compilation failure

/x1/continuum/working-directory/165/src/main/java/org/apache/openejb/server/Main.java:[29,30]
cannot find symbol
symbol  : class SystemExitException
location: package org.apache.openejb.cli

/x1/continuum/working-directory/165/src/main/java/org/apache/openejb/server/Main.java:[49,50]
cannot find symbol
symbol  : class SystemExitException
location: class org.apache.openejb.server.Main

/x1/continuum/working-directory/165/src/main/java/org/apache/openejb/server/Main.java:[80,22]
cannot find symbol
symbol  : class SystemExitException
location: class org.apache.openejb.server.Main

/x1/continuum/working-directory/165/src/main/java/org/apache/openejb/server/Main.java:[97,26]
cannot find symbol
symbol  : class SystemExitException
location: class org.apache.openejb.server.Main


[INFO] ------------------------------------------------------------------------
[INFO] For more information, run Maven with the -e switch
[INFO] ------------------------------------------------------------------------
[INFO] Total time: 13 seconds
[INFO] Finished at: Wed Aug 01 21:22:51 PDT 2007
[INFO] Final Memory: 11M/28M
[INFO] ------------------------------------------------------------------------

****************************************************************************



Mime
View raw message