tomee-commits mailing list archives

Site index · List index
Message view « Date » · « Thread »
Top « Date » · « Thread »
From "Continuum@vmbuild.apache.org" <comm...@openejb.apache.org>
Subject [continuum] BUILD FAILURE: OpenEJB :: Container :: Core
Date Wed, 01 Aug 2007 10:24:34 GMT
Online report : http://vmbuild.apache.org/continuum/servlet/continuum/target/ProjectBuild.vm/view/ProjectBuild/id/158/buildId/238458
Build statistics:
  State: Failed
  Previous State: Failed
  Started at: Wed, 1 Aug 2007 03:18:37 -0700
  Finished at: Wed, 1 Aug 2007 03:24:33 -0700
  Total time: 5m 55s
  Build Trigger: Schedule
  Exit code: 1
  Building machine hostname: vmbuild.apache.org
  Operating system : Linux(unknown)
  Java version : 1.5.0_06(Sun Microsystems Inc.)

Changes
         dblevins          Moved the start and stop command line commands to the openejb-server
package where they belong
Cleaned up the start command to use commons cli as well as updated it's options
Removed all usage of System.exit in the various commands

             /openejb/trunk/openejb3/container/openejb-core/src/main/java/org/apache/openejb/cli/Bootstrap.java
            /openejb/trunk/openejb3/container/openejb-core/src/main/java/org/apache/openejb/cli/SystemExitException.java
            /openejb/trunk/openejb3/container/openejb-core/src/main/java/org/apache/openejb/config/ConfigurationFactory.java
            /openejb/trunk/openejb3/container/openejb-core/src/main/java/org/apache/openejb/config/Deploy.java
            /openejb/trunk/openejb3/container/openejb-core/src/main/resources/META-INF/org.apache.openejb.cli/deploy.examples
            /openejb/trunk/openejb3/container/openejb-core/src/main/resources/META-INF/org.apache.openejb.cli/deploy.help
            /openejb/trunk/openejb3/container/openejb-core/src/main/resources/META-INF/org.apache.openejb.cli/start
            /openejb/trunk/openejb3/container/openejb-core/src/main/resources/META-INF/org.apache.openejb.cli/start.examples
            /openejb/trunk/openejb3/container/openejb-core/src/main/resources/META-INF/org.apache.openejb.cli/start.help
            /openejb/trunk/openejb3/container/openejb-core/src/main/resources/META-INF/org.apache.openejb.cli/stop
            /openejb/trunk/openejb3/container/openejb-core/src/main/resources/META-INF/org.apache.openejb.cli/stop.examples
            /openejb/trunk/openejb3/container/openejb-core/src/main/resources/META-INF/org.apache.openejb.cli/stop.help
            /openejb/trunk/openejb3/container/openejb-core/src/main/resources/META-INF/org.apache.openejb.cli/validate
            /openejb/trunk/openejb3/container/openejb-core/src/main/resources/META-INF/org.apache.openejb.cli/validate.disabled
(from /openejb/trunk/openejb3/container/openejb-core/src/main/resources/META-INF/org.apache.openejb.cli/validate:561107)
            /openejb/trunk/openejb3/server/openejb-server/src/main/java/org/apache/openejb/server/Main.java
            /openejb/trunk/openejb3/server/openejb-server/src/main/resources/META-INF/org.apache.openejb.cli
            /openejb/trunk/openejb3/server/openejb-server/src/main/resources/META-INF/org.apache.openejb.cli/start
            /openejb/trunk/openejb3/server/openejb-server/src/main/resources/META-INF/org.apache.openejb.cli/start.examples
            /openejb/trunk/openejb3/server/openejb-server/src/main/resources/META-INF/org.apache.openejb.cli/start.help
            /openejb/trunk/openejb3/server/openejb-server/src/main/resources/META-INF/org.apache.openejb.cli/stop
            /openejb/trunk/openejb3/server/openejb-server/src/main/resources/META-INF/org.apache.openejb.cli/stop.examples
        
****************************************************************************
Output:
****************************************************************************
[INFO] Scanning for projects...
[INFO] ----------------------------------------------------------------------------
[INFO] Building OpenEJB :: Container :: Core
[INFO]    task-segment: [install]
[INFO] ----------------------------------------------------------------------------
[INFO] [resources:resources]
[INFO] Using default encoding to copy filtered resources.
[INFO] [dependency:copy {execution: copy}]
[INFO] Configured Artifact: org.apache.openejb:openejb-javaagent:3.0.0-SNAPSHOT:jar
[INFO] org.apache.openejb:openejb-javaagent:3.0.0-SNAPSHOT:jar already exists in /x1/continuum/working-directory/158/target
[INFO] [compiler:compile]
Compiling 4 source files to /x1/continuum/working-directory/158/target/classes
Downloading: http://people.apache.org/repo/m2-incubating-repository/org/apache/axis2/axis2-jaxws-api/20070801.045628-89/axis2-jaxws-api-20070801.045628-89.pom
Downloading: http://tomcat.apache.org/dev/dist/m2-repository/org/apache/axis2/axis2-jaxws-api/20070801.045628-89/axis2-jaxws-api-20070801.045628-89.pom
Downloading: http://repo1.maven.org/maven2/org/apache/axis2/axis2-jaxws-api/20070801.045628-89/axis2-jaxws-api-20070801.045628-89.pom
[INFO] [antrun:run {execution: default}]
[INFO] Executing tasks
[INFO] Executed tasks
[INFO] [resources:testResources]
[INFO] Using default encoding to copy filtered resources.
[INFO] [compiler:testCompile]
[INFO] Nothing to compile - all classes are up to date
[INFO] [surefire:test]
[INFO] Surefire report directory: /x1/continuum/working-directory/158/target/surefire-reports

-------------------------------------------------------
 T E S T S
-------------------------------------------------------
Running org.apache.openejb.core.stateless.JaxWsWebServiceInvocationTest
log4j:WARN No appenders could be found for logger (OpenEJB.startup.config).
log4j:WARN Please initialize the log4j system properly.
Tests run: 1, Failures: 0, Errors: 1, Skipped: 0, Time elapsed: 5.141 sec <<< FAILURE!
Running org.apache.openejb.core.stateless.StatelessInterceptorTest
log4j:WARN No appenders could be found for logger (OpenEJB.startup.config).
log4j:WARN Please initialize the log4j system properly.
Tests run: 1, Failures: 0, Errors: 1, Skipped: 0, Time elapsed: 4.927 sec <<< FAILURE!
Running org.apache.openejb.core.mdb.MdbTest
log4j:WARN No appenders could be found for logger (org.apache.activemq.broker.BrokerService).
log4j:WARN Please initialize the log4j system properly.
Tests run: 1, Failures: 0, Errors: 0, Skipped: 0, Time elapsed: 12.789 sec
Running org.apache.openejb.core.stateful.StatefulInterceptorTest
log4j:WARN No appenders could be found for logger (OpenEJB.startup.config).
log4j:WARN Please initialize the log4j system properly.
Tests run: 1, Failures: 0, Errors: 1, Skipped: 0, Time elapsed: 4.565 sec <<< FAILURE!
Running org.apache.openejb.config.ConfigureServiceTest
log4j:WARN No appenders could be found for logger (OpenEJB.startup.config).
log4j:WARN Please initialize the log4j system properly.
Tests run: 4, Failures: 0, Errors: 0, Skipped: 0, Time elapsed: 1.813 sec
Running org.apache.openejb.core.mdb.SimpleJmsTest
log4j:WARN No appenders could be found for logger (org.apache.activemq.broker.BrokerService).
log4j:WARN Please initialize the log4j system properly.
Tests run: 1, Failures: 0, Errors: 0, Skipped: 0, Time elapsed: 13.539 sec
Running org.apache.openejb.config.SunQueryFilterTest
Tests run: 5, Failures: 0, Errors: 0, Skipped: 0, Time elapsed: 0.089 sec
Running org.apache.openejb.core.stateful.Compat3to2Test
log4j:WARN No appenders could be found for logger (OpenEJB.startup.config).
log4j:WARN Please initialize the log4j system properly.
Tests run: 1, Failures: 0, Errors: 1, Skipped: 0, Time elapsed: 4.837 sec <<< FAILURE!
Running org.apache.openejb.config.SunCmpConversionTest
log4j:WARN No appenders could be found for logger (OpenEJB).
log4j:WARN Please initialize the log4j system properly.
Tests run: 8, Failures: 0, Errors: 0, Skipped: 0, Time elapsed: 11.051 sec
Running org.apache.openejb.ApplicationTest
WARNING: No test suite configuration file specified, assuming system properties contain all
needed information.  To specify a test suite configuration file by setting its location using
the system property "openejb.testsuite.properties"
Apache OpenEJB 3.0.0-SNAPSHOT    build: 20070801-03:19
http://openejb.apache.org/
test server = org.apache.openejb.test.IvmTestServer
entry = java.naming.factory.initial:org.apache.openejb.client.LocalInitialContextFactory
Cannot start the test database: java.lang.IllegalStateException Cannot find 'client/tools/DatabaseHome':
javax.naming.NameNotFoundException Name "client/tools/DatabaseHome" not found.
Tests run: 1, Failures: 0, Errors: 1, Skipped: 0, Time elapsed: 15.158 sec <<< FAILURE!
Running org.apache.openejb.core.stateless.JaxRpcWebServiceInvocationTest
log4j:WARN No appenders could be found for logger (OpenEJB.startup.config).
log4j:WARN Please initialize the log4j system properly.
Tests run: 2, Failures: 0, Errors: 1, Skipped: 0, Time elapsed: 4.617 sec <<< FAILURE!
Running org.apache.openejb.core.mdb.JmsProxyTest
log4j:WARN No appenders could be found for logger (org.apache.activemq.broker.BrokerService).
log4j:WARN Please initialize the log4j system properly.
Tests run: 1, Failures: 0, Errors: 0, Skipped: 0, Time elapsed: 12.128 sec
Running org.apache.openejb.assembler.classic.JdbcConfigTest
log4j:WARN No appenders could be found for logger (OpenEJB.startup.config).
log4j:WARN Please initialize the log4j system properly.
Tests run: 1, Failures: 0, Errors: 0, Skipped: 0, Time elapsed: 3.703 sec
Running org.apache.openejb.util.ClassesTest
Tests run: 1, Failures: 0, Errors: 0, Skipped: 0, Time elapsed: 0.066 sec
Running org.apache.openejb.core.ivm.naming.IvmContextTest
Tests run: 4, Failures: 0, Errors: 0, Skipped: 0, Time elapsed: 0.138 sec
Running org.apache.openejb.config.JaxbUnmarshallerTest
Tests run: 1, Failures: 0, Errors: 0, Skipped: 0, Time elapsed: 1.941 sec
Running org.apache.openejb.DependenceValidationTest
Tests run: 1, Failures: 0, Errors: 0, Skipped: 0, Time elapsed: 1.679 sec
Running org.apache.openejb.resource.jdbc.BasicDataSourceUtilTest
Tests run: 2, Failures: 0, Errors: 0, Skipped: 0, Time elapsed: 0.114 sec
Running org.apache.openejb.core.cmp.jpa.JpaTest
Tests run: 2, Failures: 0, Errors: 0, Skipped: 0, Time elapsed: 8.773 sec
Running org.apache.openejb.core.stateful.StatefulContainerTest
log4j:WARN No appenders could be found for logger (OpenEJB.startup.config).
log4j:WARN Please initialize the log4j system properly.
Tests run: 2, Failures: 0, Errors: 2, Skipped: 0, Time elapsed: 5.122 sec <<< FAILURE!
Running org.apache.openejb.core.stateless.CrossClassLoaderProxyTest
log4j:WARN No appenders could be found for logger (OpenEJB).
log4j:WARN Please initialize the log4j system properly.
Tests run: 4, Failures: 0, Errors: 0, Skipped: 0, Time elapsed: 1.096 sec
Running org.apache.openejb.core.stateless.ExtendedInjectionTest
log4j:WARN No appenders could be found for logger (OpenEJB).
log4j:WARN Please initialize the log4j system properly.
Tests run: 2, Failures: 0, Errors: 0, Skipped: 0, Time elapsed: 1.174 sec
Running org.apache.openejb.core.stateful.StatefulSessionBeanTest
log4j:WARN No appenders could be found for logger (OpenEJB.startup.config).
log4j:WARN Please initialize the log4j system properly.
Tests run: 1, Failures: 0, Errors: 1, Skipped: 0, Time elapsed: 4.684 sec <<< FAILURE!
Running org.apache.openejb.assembler.classic.RedeployTest
log4j:WARN No appenders could be found for logger (OpenEJB.startup.config).
log4j:WARN Please initialize the log4j system properly.
Tests run: 1, Failures: 0, Errors: 1, Skipped: 0, Time elapsed: 18.504 sec <<< FAILURE!
Running org.apache.openejb.resource.SharedLocalConnectionManagerTest
Tests run: 1, Failures: 0, Errors: 0, Skipped: 0, Time elapsed: 1.277 sec
Running org.apache.openejb.assembler.classic.InterceptorBindingInfoComparatorTest
Tests run: 2, Failures: 0, Errors: 0, Skipped: 0, Time elapsed: 0.156 sec
Running org.apache.openejb.assembler.classic.MdbConfigTest
log4j:WARN No appenders could be found for logger (OpenEJB.startup.config).
log4j:WARN Please initialize the log4j system properly.
Tests run: 1, Failures: 0, Errors: 0, Skipped: 0, Time elapsed: 10.603 sec
Running org.apache.openejb.core.security.PropertiesLoginModuleTest
Path to login config: /x1/continuum/working-directory/158/target/classes/login.config
log4j:WARN No appenders could be found for logger (OpenEJB.security).
log4j:WARN Please initialize the log4j system properly.
Path to login config: /x1/continuum/working-directory/158/target/classes/login.config
Path to login config: /x1/continuum/working-directory/158/target/classes/login.config
Tests run: 3, Failures: 0, Errors: 0, Skipped: 0, Time elapsed: 0.322 sec
Running org.apache.openejb.assembler.classic.PersistenceUnitRefTest
Tests run: 1, Failures: 0, Errors: 0, Skipped: 0, Time elapsed: 0.253 sec
Running org.apache.openejb.resource.GeronimoConnectionManagerTest
log4j:WARN No appenders could be found for logger (org.apache.geronimo.connector.outbound.AbstractSinglePoolConnectionInterceptor).
log4j:WARN Please initialize the log4j system properly.
Tests run: 1, Failures: 0, Errors: 0, Skipped: 0, Time elapsed: 1.288 sec
Running org.apache.openejb.config.OpenEjb2ConversionTest
log4j:WARN No appenders could be found for logger (OpenEJB).
log4j:WARN Please initialize the log4j system properly.
Tests run: 9, Failures: 0, Errors: 0, Skipped: 0, Time elapsed: 10.652 sec
Running org.apache.openejb.SomeoneBrokeSurefireAndThisIsADirtyHackForItTest
WARNING: No test suite configuration file specified, assuming system properties contain all
needed information.  To specify a test suite configuration file by setting its location using
the system property "openejb.testsuite.properties"
Apache OpenEJB 3.0.0-SNAPSHOT    build: 20070801-03:19
http://openejb.apache.org/
test server = org.apache.openejb.test.IvmTestServer
entry = java.naming.factory.initial:org.apache.openejb.client.LocalInitialContextFactory
javax.naming.NameNotFoundException: Name "java:comp/env/jms" not found.
	at org.apache.openejb.core.ivm.naming.IvmContext.federate(IvmContext.java:172)
	at org.apache.openejb.core.ivm.naming.IvmContext.lookup(IvmContext.java:129)
	at javax.naming.InitialContext.lookup(InitialContext.java:351)
	at org.apache.openejb.test.stateless.EncStatelessBean.lookupJMSConnectionFactory(EncStatelessBean.java:394)
	at sun.reflect.NativeMethodAccessorImpl.invoke0(Native Method)
	at sun.reflect.NativeMethodAccessorImpl.invoke(NativeMethodAccessorImpl.java:39)
	at sun.reflect.DelegatingMethodAccessorImpl.invoke(DelegatingMethodAccessorImpl.java:25)
	at java.lang.reflect.Method.invoke(Method.java:585)
	at org.apache.openejb.core.interceptor.ReflectionInvocationContext$Invocation.invoke(ReflectionInvocationContext.java:146)
	at org.apache.openejb.core.interceptor.ReflectionInvocationContext.proceed(ReflectionInvocationContext.java:129)
	at org.apache.openejb.core.interceptor.InterceptorStack.invoke(InterceptorStack.java:67)
	at org.apache.openejb.core.stateless.StatelessContainer._invoke(StatelessContainer.java:203)
	at org.apache.openejb.core.stateless.StatelessContainer.invoke(StatelessContainer.java:165)
	at org.apache.openejb.core.ivm.EjbObjectProxyHandler.businessMethod(EjbObjectProxyHandler.java:211)
	at org.apache.openejb.core.ivm.EjbObjectProxyHandler._invoke(EjbObjectProxyHandler.java:65)
	at org.apache.openejb.core.ivm.BaseEjbProxyHandler.invoke(BaseEjbProxyHandler.java:234)
	at org.apache.openejb.util.proxy.Jdk13InvocationHandler.invoke(Jdk13InvocationHandler.java:49)
	at $Proxy73.lookupJMSConnectionFactory(Unknown Source)
	at org.apache.openejb.test.stateless.StatelessJndiEncTests.test23_lookupJMSConnectionFactory(StatelessJndiEncTests.java:275)
	at sun.reflect.NativeMethodAccessorImpl.invoke0(Native Method)
	at sun.reflect.NativeMethodAccessorImpl.invoke(NativeMethodAccessorImpl.java:39)
	at sun.reflect.DelegatingMethodAccessorImpl.invoke(DelegatingMethodAccessorImpl.java:25)
	at java.lang.reflect.Method.invoke(Method.java:585)
	at org.apache.openejb.test.NumberedTestCase.runTestMethod(NumberedTestCase.java:135)
	at org.apache.openejb.test.NumberedTestCase$1.protect(NumberedTestCase.java:120)
	at junit.framework.TestResult.runProtected(TestResult.java:128)
	at org.apache.openejb.test.NumberedTestCase.run(NumberedTestCase.java:123)
	at org.apache.openejb.test.NumberedTestCase.run(NumberedTestCase.java:102)
	at junit.framework.TestSuite.runTest(TestSuite.java:228)
	at junit.framework.TestSuite.run(TestSuite.java:223)
	at org.apache.openejb.test.TestSuite.run(TestSuite.java:46)
	at sun.reflect.NativeMethodAccessorImpl.invoke0(Native Method)
	at sun.reflect.NativeMethodAccessorImpl.invoke(NativeMethodAccessorImpl.java:39)
	at sun.reflect.DelegatingMethodAccessorImpl.invoke(DelegatingMethodAccessorImpl.java:25)
	at java.lang.reflect.Method.invoke(Method.java:585)
	at org.apache.maven.surefire.junit.JUnitTestSet.execute(JUnitTestSet.java:210)
	at org.apache.maven.surefire.suite.AbstractDirectoryTestSuite.executeTestSet(AbstractDirectoryTestSuite.java:135)
	at org.apache.maven.surefire.suite.AbstractDirectoryTestSuite.execute(AbstractDirectoryTestSuite.java:160)
	at org.apache.maven.surefire.Surefire.run(Surefire.java:81)
	at sun.reflect.NativeMethodAccessorImpl.invoke0(Native Method)
	at sun.reflect.NativeMethodAccessorImpl.invoke(NativeMethodAccessorImpl.java:39)
	at sun.reflect.DelegatingMethodAccessorImpl.invoke(DelegatingMethodAccessorImpl.java:25)
	at java.lang.reflect.Method.invoke(Method.java:585)
	at org.apache.maven.surefire.booter.SurefireBooter.runSuitesInProcess(SurefireBooter.java:182)
	at org.apache.maven.surefire.booter.SurefireBooter.main(SurefireBooter.java:743)
java.lang.IllegalArgumentException: javax.naming.NameNotFoundException: Name "jms" not found.
	at org.apache.openejb.core.BaseContext.lookup(BaseContext.java:125)
	at org.apache.openejb.test.stateless.ContextLookupStatelessBean.lookupJMSConnectionFactory(ContextLookupStatelessBean.java:336)
	at sun.reflect.NativeMethodAccessorImpl.invoke0(Native Method)
	at sun.reflect.NativeMethodAccessorImpl.invoke(NativeMethodAccessorImpl.java:39)
	at sun.reflect.DelegatingMethodAccessorImpl.invoke(DelegatingMethodAccessorImpl.java:25)
	at java.lang.reflect.Method.invoke(Method.java:585)
	at org.apache.openejb.core.interceptor.ReflectionInvocationContext$Invocation.invoke(ReflectionInvocationContext.java:146)
	at org.apache.openejb.core.interceptor.ReflectionInvocationContext.proceed(ReflectionInvocationContext.java:129)
	at org.apache.openejb.core.interceptor.InterceptorStack.invoke(InterceptorStack.java:67)
	at org.apache.openejb.core.stateless.StatelessContainer._invoke(StatelessContainer.java:203)
	at org.apache.openejb.core.stateless.StatelessContainer.invoke(StatelessContainer.java:165)
	at org.apache.openejb.core.ivm.EjbObjectProxyHandler.businessMethod(EjbObjectProxyHandler.java:211)
	at org.apache.openejb.core.ivm.EjbObjectProxyHandler._invoke(EjbObjectProxyHandler.java:65)
	at org.apache.openejb.core.ivm.BaseEjbProxyHandler.invoke(BaseEjbProxyHandler.java:234)
	at org.apache.openejb.util.proxy.Jdk13InvocationHandler.invoke(Jdk13InvocationHandler.java:49)
	at $Proxy73.lookupJMSConnectionFactory(Unknown Source)
	at org.apache.openejb.test.stateless.StatelessContextLookupTests.test23_lookupJMSConnectionFactory(StatelessContextLookupTests.java:224)
	at sun.reflect.NativeMethodAccessorImpl.invoke0(Native Method)
	at sun.reflect.NativeMethodAccessorImpl.invoke(NativeMethodAccessorImpl.java:39)
	at sun.reflect.DelegatingMethodAccessorImpl.invoke(DelegatingMethodAccessorImpl.java:25)
	at java.lang.reflect.Method.invoke(Method.java:585)
	at org.apache.openejb.test.NumberedTestCase.runTestMethod(NumberedTestCase.java:135)
	at org.apache.openejb.test.NumberedTestCase$1.protect(NumberedTestCase.java:120)
	at junit.framework.TestResult.runProtected(TestResult.java:128)
	at org.apache.openejb.test.NumberedTestCase.run(NumberedTestCase.java:123)
	at org.apache.openejb.test.NumberedTestCase.run(NumberedTestCase.java:102)
	at junit.framework.TestSuite.runTest(TestSuite.java:228)
	at junit.framework.TestSuite.run(TestSuite.java:223)
	at org.apache.openejb.test.TestSuite.run(TestSuite.java:46)
	at sun.reflect.NativeMethodAccessorImpl.invoke0(Native Method)
	at sun.reflect.NativeMethodAccessorImpl.invoke(NativeMethodAccessorImpl.java:39)
	at sun.reflect.DelegatingMethodAccessorImpl.invoke(DelegatingMethodAccessorImpl.java:25)
	at java.lang.reflect.Method.invoke(Method.java:585)
	at org.apache.maven.surefire.junit.JUnitTestSet.execute(JUnitTestSet.java:210)
	at org.apache.maven.surefire.suite.AbstractDirectoryTestSuite.executeTestSet(AbstractDirectoryTestSuite.java:135)
	at org.apache.maven.surefire.suite.AbstractDirectoryTestSuite.execute(AbstractDirectoryTestSuite.java:160)
	at org.apache.maven.surefire.Surefire.run(Surefire.java:81)
	at sun.reflect.NativeMethodAccessorImpl.invoke0(Native Method)
	at sun.reflect.NativeMethodAccessorImpl.invoke(NativeMethodAccessorImpl.java:39)
	at sun.reflect.DelegatingMethodAccessorImpl.invoke(DelegatingMethodAccessorImpl.java:25)
	at java.lang.reflect.Method.invoke(Method.java:585)
	at org.apache.maven.surefire.booter.SurefireBooter.runSuitesInProcess(SurefireBooter.java:182)
	at org.apache.maven.surefire.booter.SurefireBooter.main(SurefireBooter.java:743)
Caused by: javax.naming.NameNotFoundException: Name "jms" not found.
	at org.apache.openejb.core.ivm.naming.IvmContext.federate(IvmContext.java:172)
	at org.apache.openejb.core.ivm.naming.IvmContext.lookup(IvmContext.java:129)
	at org.apache.openejb.core.BaseContext.lookup(BaseContext.java:123)
	... 42 more
java.lang.IllegalArgumentException: javax.naming.NameNotFoundException: Name "jms" not found.
	at org.apache.openejb.core.BaseContext.lookup(BaseContext.java:125)
	at org.apache.openejb.test.stateless.ContextLookupStatelessBean.lookupJMSConnectionFactory(ContextLookupStatelessBean.java:336)
	at sun.reflect.NativeMethodAccessorImpl.invoke0(Native Method)
	at sun.reflect.NativeMethodAccessorImpl.invoke(NativeMethodAccessorImpl.java:39)
	at sun.reflect.DelegatingMethodAccessorImpl.invoke(DelegatingMethodAccessorImpl.java:25)
	at java.lang.reflect.Method.invoke(Method.java:585)
	at org.apache.openejb.core.interceptor.ReflectionInvocationContext$Invocation.invoke(ReflectionInvocationContext.java:146)
	at org.apache.openejb.core.interceptor.ReflectionInvocationContext.proceed(ReflectionInvocationContext.java:129)
	at org.apache.openejb.core.interceptor.InterceptorStack.invoke(InterceptorStack.java:67)
	at org.apache.openejb.core.stateless.StatelessContainer._invoke(StatelessContainer.java:203)
	at org.apache.openejb.core.stateless.StatelessContainer.invoke(StatelessContainer.java:165)
	at org.apache.openejb.core.ivm.EjbObjectProxyHandler.businessMethod(EjbObjectProxyHandler.java:211)
	at org.apache.openejb.core.ivm.EjbObjectProxyHandler._invoke(EjbObjectProxyHandler.java:65)
	at org.apache.openejb.core.ivm.BaseEjbProxyHandler.invoke(BaseEjbProxyHandler.java:234)
	at org.apache.openejb.util.proxy.Jdk13InvocationHandler.invoke(Jdk13InvocationHandler.java:49)
	at $Proxy73.lookupJMSConnectionFactory(Unknown Source)
	at org.apache.openejb.test.stateless.StatelessPojoContextLookupTests.test23_lookupJMSConnectionFactory(StatelessPojoContextLookupTests.java:224)
	at sun.reflect.NativeMethodAccessorImpl.invoke0(Native Method)
	at sun.reflect.NativeMethodAccessorImpl.invoke(NativeMethodAccessorImpl.java:39)
	at sun.reflect.DelegatingMethodAccessorImpl.invoke(DelegatingMethodAccessorImpl.java:25)
	at java.lang.reflect.Method.invoke(Method.java:585)
	at org.apache.openejb.test.NumberedTestCase.runTestMethod(NumberedTestCase.java:135)
	at org.apache.openejb.test.NumberedTestCase$1.protect(NumberedTestCase.java:120)
	at junit.framework.TestResult.runProtected(TestResult.java:128)
	at org.apache.openejb.test.NumberedTestCase.run(NumberedTestCase.java:123)
	at org.apache.openejb.test.NumberedTestCase.run(NumberedTestCase.java:102)
	at junit.framework.TestSuite.runTest(TestSuite.java:228)
	at junit.framework.TestSuite.run(TestSuite.java:223)
	at org.apache.openejb.test.TestSuite.run(TestSuite.java:46)
	at sun.reflect.NativeMethodAccessorImpl.invoke0(Native Method)
	at sun.reflect.NativeMethodAccessorImpl.invoke(NativeMethodAccessorImpl.java:39)
	at sun.reflect.DelegatingMethodAccessorImpl.invoke(DelegatingMethodAccessorImpl.java:25)
	at java.lang.reflect.Method.invoke(Method.java:585)
	at org.apache.maven.surefire.junit.JUnitTestSet.execute(JUnitTestSet.java:210)
	at org.apache.maven.surefire.suite.AbstractDirectoryTestSuite.executeTestSet(AbstractDirectoryTestSuite.java:135)
	at org.apache.maven.surefire.suite.AbstractDirectoryTestSuite.execute(AbstractDirectoryTestSuite.java:160)
	at org.apache.maven.surefire.Surefire.run(Surefire.java:81)
	at sun.reflect.NativeMethodAccessorImpl.invoke0(Native Method)
	at sun.reflect.NativeMethodAccessorImpl.invoke(NativeMethodAccessorImpl.java:39)
	at sun.reflect.DelegatingMethodAccessorImpl.invoke(DelegatingMethodAccessorImpl.java:25)
	at java.lang.reflect.Method.invoke(Method.java:585)
	at org.apache.maven.surefire.booter.SurefireBooter.runSuitesInProcess(SurefireBooter.java:182)
	at org.apache.maven.surefire.booter.SurefireBooter.main(SurefireBooter.java:743)
Caused by: javax.naming.NameNotFoundException: Name "jms" not found.
	at org.apache.openejb.core.ivm.naming.IvmContext.federate(IvmContext.java:172)
	at org.apache.openejb.core.ivm.naming.IvmContext.lookup(IvmContext.java:129)
	at org.apache.openejb.core.BaseContext.lookup(BaseContext.java:123)
	... 42 more
Intercepting BasicStatelessInterceptedBean by ddInterceptorPostConstruct()
Intercepting BasicStatelessInterceptedBean by secondClassInterceptorPostConstruct()
Intercepting BasicStatelessInterceptedBean by superClassInterceptorPostConstruct()
Intercepting BasicStatelessInterceptedBean by classInterceptorPostConstruct()
Intercepting BasicStatelessInterceptedBean by superBeanInterceptorPostConstruct()
Intercepting BasicStatelessInterceptedBean by inBeanInterceptorPostConstruct()
Intercepting reverse by ddInterceptor()
Intercepting reverse by secondClassInterceptor()
Intercepting reverse by superClassInterceptor()
Intercepting reverse by classInterceptor()
Intercepting reverse by methodInterceptor()
Intercepting reverse by superBeanInterceptor()
Intercepting reverse by inBeanInterceptor()
Reversing Intercept
Intercepting getContextData by superBeanInterceptor()
Intercepting getContextData by inBeanInterceptor()
Intercepting reverse by ddInterceptor()
Intercepting reverse by secondClassInterceptor()
Intercepting reverse by superClassInterceptor()
Intercepting reverse by classInterceptor()
Intercepting reverse by methodInterceptor()
Intercepting reverse by superBeanInterceptor()
Intercepting reverse by inBeanInterceptor()
Reversing Intercept
Intercepting getContextData by superBeanInterceptor()
Intercepting getContextData by inBeanInterceptor()
Intercepting getContextData by superBeanInterceptor()
Intercepting getContextData by inBeanInterceptor()
Intercepting concat by superBeanInterceptor()
Intercepting concat by inBeanInterceptor()
Intercepting getContextData by superBeanInterceptor()
Intercepting getContextData by inBeanInterceptor()
org.apache.maven.surefire.booter.SurefireExecutionException: org.apache.openejb.SomeoneBrokeSurefireAndThisIsADirtyHackForItTest;
nested exception is java.lang.IncompatibleClassChangeError: null; nested exception is org.apache.maven.surefire.testset.TestSetFailedException:
org.apache.openejb.SomeoneBrokeSurefireAndThisIsADirtyHackForItTest; nested exception is java.lang.IncompatibleClassChangeError:
null
org.apache.maven.surefire.testset.TestSetFailedException: org.apache.openejb.SomeoneBrokeSurefireAndThisIsADirtyHackForItTest;
nested exception is java.lang.IncompatibleClassChangeError: null
java.lang.IncompatibleClassChangeError
	at org.apache.openejb.core.stateful.StatefulEjbHomeHandler.createProxy(StatefulEjbHomeHandler.java:40)
	at org.apache.openejb.core.ivm.EjbHomeProxyHandler.create(EjbHomeProxyHandler.java:268)
	at org.apache.openejb.core.ivm.EjbHomeProxyHandler._invoke(EjbHomeProxyHandler.java:157)
	at org.apache.openejb.core.ivm.BaseEjbProxyHandler.invoke(BaseEjbProxyHandler.java:310)
	at org.apache.openejb.util.proxy.Jdk13InvocationHandler.invoke(Jdk13InvocationHandler.java:49)
	at $Proxy53.create(Unknown Source)
	at org.apache.openejb.test.stateful.StatefulPojoLocalIntfcTests.setUp(StatefulPojoLocalIntfcTests.java:35)
	at org.apache.openejb.test.NumberedTestCase.run(NumberedTestCase.java:93)
	at junit.framework.TestSuite.runTest(TestSuite.java:228)
	at junit.framework.TestSuite.run(TestSuite.java:223)
	at org.apache.openejb.test.TestSuite.run(TestSuite.java:46)
	at sun.reflect.NativeMethodAccessorImpl.invoke0(Native Method)
	at sun.reflect.NativeMethodAccessorImpl.invoke(NativeMethodAccessorImpl.java:39)
	at sun.reflect.DelegatingMethodAccessorImpl.invoke(DelegatingMethodAccessorImpl.java:25)
	at java.lang.reflect.Method.invoke(Method.java:585)
	at org.apache.maven.surefire.junit.JUnitTestSet.execute(JUnitTestSet.java:210)
	at org.apache.maven.surefire.suite.AbstractDirectoryTestSuite.executeTestSet(AbstractDirectoryTestSuite.java:135)
	at org.apache.maven.surefire.suite.AbstractDirectoryTestSuite.execute(AbstractDirectoryTestSuite.java:160)
	at org.apache.maven.surefire.Surefire.run(Surefire.java:81)
	at sun.reflect.NativeMethodAccessorImpl.invoke0(Native Method)
	at sun.reflect.NativeMethodAccessorImpl.invoke(NativeMethodAccessorImpl.java:39)
	at sun.reflect.DelegatingMethodAccessorImpl.invoke(DelegatingMethodAccessorImpl.java:25)
	at java.lang.reflect.Method.invoke(Method.java:585)
	at org.apache.maven.surefire.booter.SurefireBooter.runSuitesInProcess(SurefireBooter.java:182)
	at org.apache.maven.surefire.booter.SurefireBooter.main(SurefireBooter.java:743)
Running org.apache.openejb.core.mdb.JmsTest
log4j:WARN No appenders could be found for logger (org.apache.activemq.broker.BrokerService).
log4j:WARN Please initialize the log4j system properly.
Tests run: 1, Failures: 0, Errors: 0, Skipped: 0, Time elapsed: 11.705 sec
Running org.apache.openejb.iTest
Tests run: 0, Failures: 0, Errors: 0, Skipped: 0, Time elapsed: 0.03 sec
Running org.apache.openejb.core.stateless.StatelessContainerTest
log4j:WARN No appenders could be found for logger (OpenEJB).
log4j:WARN Please initialize the log4j system properly.
Tests run: 3, Failures: 0, Errors: 0, Skipped: 0, Time elapsed: 0.932 sec
Running org.apache.openejb.core.TemporaryClassLoaderTest
Tests run: 1, Failures: 0, Errors: 0, Skipped: 0, Time elapsed: 0.188 sec
Running org.apache.openejb.core.security.SecurityTest
log4j:WARN No appenders could be found for logger (OpenEJB.startup.config).
log4j:WARN Please initialize the log4j system properly.
Tests run: 1, Failures: 0, Errors: 1, Skipped: 0, Time elapsed: 4.435 sec <<< FAILURE!
Running org.apache.openejb.assembler.classic.OpenEjbConfigurationValidationTest
Tests run: 1, Failures: 0, Errors: 0, Skipped: 0, Time elapsed: 0.222 sec
Running org.apache.openejb.config.rules.CheckInjectionTargetsTest
Tests run: 1, Failures: 0, Errors: 0, Skipped: 0, Time elapsed: 0.185 sec

Results :
Tests run: 75, Failures: 0, Errors: 11, Skipped: 0

[INFO] ------------------------------------------------------------------------
[ERROR] BUILD FAILURE
[INFO] ------------------------------------------------------------------------
[INFO] There are test failures.
[INFO] ------------------------------------------------------------------------
[INFO] For more information, run Maven with the -e switch
[INFO] ------------------------------------------------------------------------
[INFO] Total time: 5 minutes 53 seconds
[INFO] Finished at: Wed Aug 01 03:24:33 PDT 2007
[INFO] Final Memory: 16M/30M
[INFO] ------------------------------------------------------------------------

****************************************************************************



Mime
View raw message