tomee-commits mailing list archives

Site index · List index
Message view « Date » · « Thread »
Top « Date » · « Thread »
From "Continuum@vmbuild.apache.org" <openejb-comm...@incubator.apache.org>
Subject [continuum] BUILD FAILURE: OpenEJB :: Container :: Core
Date Wed, 04 Apr 2007 23:08:23 GMT
Online report : http://vmbuild.apache.org/continuum/servlet/continuum/target/ProjectBuild.vm/view/ProjectBuild/id/158/buildId/100959
Build statistics:
  State: Failed
  Previous State: Failed
  Started at: Wed, 4 Apr 2007 16:02:47 -0700
  Finished at: Wed, 4 Apr 2007 16:08:23 -0700
  Total time: 5m 35s
  Build Trigger: Schedule
  Exit code: 1
  Building machine hostname: vmbuild.apache.org
  Operating system : Linux(unknown)
  Java version : 1.5.0_06(Sun Microsystems Inc.)

Changes
         kevan          Allow loopback-style operations to succeed. Otherwise, they fail because bean is marked non-reentrant
             /incubator/openejb/trunk/openejb3/container/openejb-core/src/main/java/org/apache/openejb/core/entity/EntityInstanceManager.java
        
****************************************************************************
Output:
****************************************************************************
[INFO] Scanning for projects...
[INFO] ----------------------------------------------------------------------------
[INFO] Building OpenEJB :: Container :: Core
[INFO]    task-segment: [install]
[INFO] ----------------------------------------------------------------------------
[INFO] [resources:resources]
[INFO] Using default encoding to copy filtered resources.
[INFO] [dependency:copy {execution: copy-dependencies}]
[INFO] Configured Artifact: org.apache.openejb:openejb-javaagent:null:3.0-incubating-SNAPSHOT:jar
[INFO] openejb-javaagent-3.0-incubating-SNAPSHOT.jar already exists.
[WARNING] While downloading xerces:xerces:2.4.0
  This artifact has been relocated to xerces:xercesImpl:2.4.0.


[WARNING] 
	Artifact junit:junit:jar:4.1:test retains local scope 'test' overriding broader scope 'compile'
	given by a dependency. If this is not intended, modify or remove the local scope.

[WARNING] 
	Artifact hsqldb:hsqldb:jar:1.8.0.7:test retains local scope 'test' overriding broader scope 'compile'
	given by a dependency. If this is not intended, modify or remove the local scope.

[WARNING] 
	Artifact commons-collections:commons-collections:jar:3.1:test retains local scope 'test' overriding broader scope 'compile'
	given by a dependency. If this is not intended, modify or remove the local scope.

[INFO] [compiler:compile]
Compiling 1 source file to /x1/continuum/working-directory/158/target/classes
[INFO] [antrun:run {execution: default}]
[INFO] Executing tasks
[INFO] Executed tasks
[INFO] [resources:testResources]
[INFO] Using default encoding to copy filtered resources.
[INFO] [compiler:testCompile]
[INFO] Nothing to compile - all classes are up to date
[INFO] [surefire:test]
[INFO] Surefire report directory: /x1/continuum/working-directory/158/target/surefire-reports

-------------------------------------------------------
 T E S T S
-------------------------------------------------------
Running org.apache.openejb.config.OpenEjb2CmpConversionTest
log4j:WARN No appenders could be found for logger (OpenEJB).
log4j:WARN Please initialize the log4j system properly.
Tests run: 9, Failures: 0, Errors: 0, Skipped: 0, Time elapsed: 10.355 sec
Running org.apache.openejb.core.stateless.StatelessInterceptorTest
log4j:WARN No appenders could be found for logger (OpenEJB.startup.config).
log4j:WARN Please initialize the log4j system properly.
Tests run: 1, Failures: 0, Errors: 0, Skipped: 0, Time elapsed: 5.09 sec
Running org.apache.openejb.core.mdb.MdbTest
log4j:WARN No appenders could be found for logger (org.apache.activemq.broker.BrokerService).
log4j:WARN Please initialize the log4j system properly.
Tests run: 1, Failures: 0, Errors: 0, Skipped: 0, Time elapsed: 11.421 sec
Running org.apache.openejb.core.stateful.StatefulInterceptorTest
log4j:WARN No appenders could be found for logger (OpenEJB.startup.config).
log4j:WARN Please initialize the log4j system properly.
Tests run: 1, Failures: 0, Errors: 0, Skipped: 0, Time elapsed: 4.308 sec
Running org.apache.openejb.config.ConfigureServiceTest
log4j:WARN No appenders could be found for logger (OpenEJB.startup.config).
log4j:WARN Please initialize the log4j system properly.
Tests run: 4, Failures: 0, Errors: 0, Skipped: 0, Time elapsed: 1.23 sec
Running org.apache.openejb.core.mdb.SimpleJmsTest
log4j:WARN No appenders could be found for logger (org.apache.activemq.broker.BrokerService).
log4j:WARN Please initialize the log4j system properly.
Tests run: 1, Failures: 0, Errors: 0, Skipped: 0, Time elapsed: 10.929 sec
Running org.apache.openejb.config.SunQueryFilterTest
Tests run: 5, Failures: 0, Errors: 0, Skipped: 0, Time elapsed: 0.076 sec
Running org.apache.openejb.config.SunCmpConversionTest
log4j:WARN No appenders could be found for logger (OpenEJB).
log4j:WARN Please initialize the log4j system properly.
Tests run: 8, Failures: 0, Errors: 0, Skipped: 0, Time elapsed: 13.176 sec
Running org.apache.openejb.core.stateful.Compat3to2Test
log4j:WARN No appenders could be found for logger (OpenEJB.startup.config).
log4j:WARN Please initialize the log4j system properly.
Tests run: 1, Failures: 0, Errors: 0, Skipped: 0, Time elapsed: 6.221 sec
Running org.apache.openejb.ApplicationTest
test server = org.apache.openejb.test.IvmTestServer
entry = java.naming.factory.initial:org.apache.openejb.client.LocalInitialContextFactory
WARN - Unable use logging config as there are 3 file references containing directories which have not been created.  See the list below.
WARN - [0] /x1/continuum/working-directory/158/target/test-classes/conf/logs/transaction.log
WARN - [1] /x1/continuum/working-directory/158/target/test-classes/conf/logs/openejb.log
WARN - [2] /x1/continuum/working-directory/158/target/test-classes/conf/logs/server.log
Apache OpenEJB 3.0-incubating-SNAPSHOT    build: 20070404-04:03
http://incubator.apache.org/openejb
INFO - openejb.home = /x1/continuum/working-directory/158/target/test-classes
INFO - openejb.base = /x1/continuum/working-directory/158/target/test-classes
INFO - Found AppModule in classpath: /home/continuum/.m2/repository/org/apache/openejb/openejb-itests-app/3.0-incubating-SNAPSHOT/openejb-itests-app-3.0-incubating-SNAPSHOT.jar
WARN - Auto-linking res-ref-name 'org.apache.openejb.test.stateful.AnnotatedFieldInjectionStatefulBean/daataSource' in bean AnnotatedFieldInjectionStatefulBean to Connector(id=Default JDBC Database)
WARN - Auto-creating a connector with id 'Default JMS Connection Factory' of type 'javax.jms.ConnectionFactory for 'AnnotatedFieldInjectionStatefulBean'.  THERE IS LITTLE CHANCE THIS WILL WORK!
WARN - Auto-linking res-ref-name 'org.apache.openejb.test.stateful.AnnotatedFieldInjectionStatefulBean/coonnectionFactory' in bean AnnotatedFieldInjectionStatefulBean to Connector(id=Default JMS Connection Factory)
WARN - Auto-linking res-ref-name 'org.apache.openejb.test.stateful.AnnotatedFieldInjectionStatefulBean/queueCoonnectionFactory' in bean AnnotatedFieldInjectionStatefulBean to Connector(id=Default JMS Connection Factory)
WARN - Auto-linking res-ref-name 'org.apache.openejb.test.stateful.AnnotatedFieldInjectionStatefulBean/topicCoonnectionFactory' in bean AnnotatedFieldInjectionStatefulBean to Connector(id=Default JMS Connection Factory)
WARN - Auto-linking res-ref-name 'org.apache.openejb.test.stateless.AnnotatedFieldInjectionStatelessBean/daataSource' in bean AnnotatedFieldInjectionStatelessBean to Connector(id=Default JDBC Database)
WARN - Auto-linking res-ref-name 'org.apache.openejb.test.stateless.AnnotatedFieldInjectionStatelessBean/coonnectionFactory' in bean AnnotatedFieldInjectionStatelessBean to Connector(id=Default JMS Connection Factory)
WARN - Auto-linking res-ref-name 'org.apache.openejb.test.stateless.AnnotatedFieldInjectionStatelessBean/queueCoonnectionFactory' in bean AnnotatedFieldInjectionStatelessBean to Connector(id=Default JMS Connection Factory)
WARN - Auto-linking res-ref-name 'org.apache.openejb.test.stateless.AnnotatedFieldInjectionStatelessBean/topicCoonnectionFactory' in bean AnnotatedFieldInjectionStatelessBean to Connector(id=Default JMS Connection Factory)
log4j:WARN No appenders could be found for logger (org.apache.activemq.broker.BrokerService).
log4j:WARN Please initialize the log4j system properly.
ERROR - FATAL ERROR: Unknown error in Assembler.  Please send the following stack trace and this message to user@openejb.org :
 org.apache.xbean.recipe.MissingAccessorException: Unable to find a valid setter method: public void org.apache.openejb.core.mdb.MdbContainer.setServerUrl(java.lang.String)
	at org.apache.xbean.recipe.ObjectRecipe.findSetter(ObjectRecipe.java:692)
	at org.apache.xbean.recipe.ObjectRecipe.setProperty(ObjectRecipe.java:275)
	at org.apache.xbean.recipe.ObjectRecipe.setProperties(ObjectRecipe.java:251)
	at org.apache.xbean.recipe.ObjectRecipe.create(ObjectRecipe.java:198)
	at org.apache.xbean.recipe.AbstractRecipe.create(AbstractRecipe.java:28)
	at org.apache.openejb.assembler.classic.Assembler.createContainer(Assembler.java:603)
	at org.apache.openejb.assembler.classic.Assembler.buildContainerSystem(Assembler.java:293)
	at org.apache.openejb.assembler.classic.Assembler.build(Assembler.java:201)
	at org.apache.openejb.OpenEJB$Instance.<init>(OpenEJB.java:147)
	at org.apache.openejb.OpenEJB.init(OpenEJB.java:280)
	at org.apache.openejb.OpenEJB.init(OpenEJB.java:265)
	at sun.reflect.NativeMethodAccessorImpl.invoke0(Native Method)
	at sun.reflect.NativeMethodAccessorImpl.invoke(NativeMethodAccessorImpl.java:39)
	at sun.reflect.DelegatingMethodAccessorImpl.invoke(DelegatingMethodAccessorImpl.java:25)
	at java.lang.reflect.Method.invoke(Method.java:585)
	at org.apache.openejb.loader.OpenEJBInstance.init(OpenEJBInstance.java:36)
	at org.apache.openejb.client.LocalInitialContextFactory.init(LocalInitialContextFactory.java:56)
	at org.apache.openejb.client.LocalInitialContextFactory.getInitialContext(LocalInitialContextFactory.java:42)
	at javax.naming.spi.NamingManager.getInitialContext(NamingManager.java:667)
	at javax.naming.InitialContext.getDefaultInitCtx(InitialContext.java:247)
	at javax.naming.InitialContext.init(InitialContext.java:223)
	at javax.naming.InitialContext.<init>(InitialContext.java:197)
	at org.apache.openejb.test.HsqldbTestDatabase.start(HsqldbTestDatabase.java:180)
	at org.apache.openejb.test.TestManager.start(TestManager.java:79)
	at org.apache.openejb.iTest.setUp(iTest.java:57)
	at org.apache.openejb.test.TestSuite.run(TestSuite.java:41)
	at sun.reflect.NativeMethodAccessorImpl.invoke0(Native Method)
	at sun.reflect.NativeMethodAccessorImpl.invoke(NativeMethodAccessorImpl.java:39)
	at sun.reflect.DelegatingMethodAccessorImpl.invoke(DelegatingMethodAccessorImpl.java:25)
	at java.lang.reflect.Method.invoke(Method.java:585)
	at org.apache.maven.surefire.junit.JUnitTestSet.execute(JUnitTestSet.java:210)
	at org.apache.maven.surefire.suite.AbstractDirectoryTestSuite.executeTestSet(AbstractDirectoryTestSuite.java:135)
	at org.apache.maven.surefire.suite.AbstractDirectoryTestSuite.execute(AbstractDirectoryTestSuite.java:160)
	at org.apache.maven.surefire.Surefire.run(Surefire.java:81)
	at sun.reflect.NativeMethodAccessorImpl.invoke0(Native Method)
	at sun.reflect.NativeMethodAccessorImpl.invoke(NativeMethodAccessorImpl.java:39)
	at sun.reflect.DelegatingMethodAccessorImpl.invoke(DelegatingMethodAccessorImpl.java:25)
	at java.lang.reflect.Method.invoke(Method.java:585)
	at org.apache.maven.surefire.booter.SurefireBooter.runSuitesInProcess(SurefireBooter.java:182)
	at org.apache.maven.surefire.booter.SurefireBooter.main(SurefireBooter.java:743)

FATAL - OpenEJB has encountered a fatal error and cannot be started: Assembler failed to build the container system.
org.apache.openejb.OpenEJBException: org.apache.xbean.recipe.MissingAccessorException: Unable to find a valid setter method: public void org.apache.openejb.core.mdb.MdbContainer.setServerUrl(java.lang.String): Unable to find a valid setter method: public void org.apache.openejb.core.mdb.MdbContainer.setServerUrl(java.lang.String)
	at org.apache.openejb.assembler.classic.Assembler.build(Assembler.java:214)
	at org.apache.openejb.OpenEJB$Instance.<init>(OpenEJB.java:147)
	at org.apache.openejb.OpenEJB.init(OpenEJB.java:280)
	at org.apache.openejb.OpenEJB.init(OpenEJB.java:265)
	at sun.reflect.NativeMethodAccessorImpl.invoke0(Native Method)
	at sun.reflect.NativeMethodAccessorImpl.invoke(NativeMethodAccessorImpl.java:39)
	at sun.reflect.DelegatingMethodAccessorImpl.invoke(DelegatingMethodAccessorImpl.java:25)
	at java.lang.reflect.Method.invoke(Method.java:585)
	at org.apache.openejb.loader.OpenEJBInstance.init(OpenEJBInstance.java:36)
	at org.apache.openejb.client.LocalInitialContextFactory.init(LocalInitialContextFactory.java:56)
	at org.apache.openejb.client.LocalInitialContextFactory.getInitialContext(LocalInitialContextFactory.java:42)
	at javax.naming.spi.NamingManager.getInitialContext(NamingManager.java:667)
	at javax.naming.InitialContext.getDefaultInitCtx(InitialContext.java:247)
	at javax.naming.InitialContext.init(InitialContext.java:223)
	at javax.naming.InitialContext.<init>(InitialContext.java:197)
	at org.apache.openejb.test.HsqldbTestDatabase.start(HsqldbTestDatabase.java:180)
	at org.apache.openejb.test.TestManager.start(TestManager.java:79)
	at org.apache.openejb.iTest.setUp(iTest.java:57)
	at org.apache.openejb.test.TestSuite.run(TestSuite.java:41)
	at sun.reflect.NativeMethodAccessorImpl.invoke0(Native Method)
	at sun.reflect.NativeMethodAccessorImpl.invoke(NativeMethodAccessorImpl.java:39)
	at sun.reflect.DelegatingMethodAccessorImpl.invoke(DelegatingMethodAccessorImpl.java:25)
	at java.lang.reflect.Method.invoke(Method.java:585)
	at org.apache.maven.surefire.junit.JUnitTestSet.execute(JUnitTestSet.java:210)
	at org.apache.maven.surefire.suite.AbstractDirectoryTestSuite.executeTestSet(AbstractDirectoryTestSuite.java:135)
	at org.apache.maven.surefire.suite.AbstractDirectoryTestSuite.execute(AbstractDirectoryTestSuite.java:160)
	at org.apache.maven.surefire.Surefire.run(Surefire.java:81)
	at sun.reflect.NativeMethodAccessorImpl.invoke0(Native Method)
	at sun.reflect.NativeMethodAccessorImpl.invoke(NativeMethodAccessorImpl.java:39)
	at sun.reflect.DelegatingMethodAccessorImpl.invoke(DelegatingMethodAccessorImpl.java:25)
	at java.lang.reflect.Method.invoke(Method.java:585)
	at org.apache.maven.surefire.booter.SurefireBooter.runSuitesInProcess(SurefireBooter.java:182)
	at org.apache.maven.surefire.booter.SurefireBooter.main(SurefireBooter.java:743)
Caused by: org.apache.xbean.recipe.MissingAccessorException: Unable to find a valid setter method: public void org.apache.openejb.core.mdb.MdbContainer.setServerUrl(java.lang.String)
	at org.apache.xbean.recipe.ObjectRecipe.findSetter(ObjectRecipe.java:692)
	at org.apache.xbean.recipe.ObjectRecipe.setProperty(ObjectRecipe.java:275)
	at org.apache.xbean.recipe.ObjectRecipe.setProperties(ObjectRecipe.java:251)
	at org.apache.xbean.recipe.ObjectRecipe.create(ObjectRecipe.java:198)
	at org.apache.xbean.recipe.AbstractRecipe.create(AbstractRecipe.java:28)
	at org.apache.openejb.assembler.classic.Assembler.createContainer(Assembler.java:603)
	at org.apache.openejb.assembler.classic.Assembler.buildContainerSystem(Assembler.java:293)
	at org.apache.openejb.assembler.classic.Assembler.build(Assembler.java:201)
	... 32 more
Tests run: 1, Failures: 0, Errors: 1, Skipped: 0, Time elapsed: 17.632 sec <<< FAILURE!
Running org.apache.openejb.core.mdb.JmsProxyTest
log4j:WARN No appenders could be found for logger (org.apache.activemq.broker.BrokerService).
log4j:WARN Please initialize the log4j system properly.
Tests run: 1, Failures: 0, Errors: 0, Skipped: 0, Time elapsed: 11.393 sec
Running org.apache.openejb.assembler.classic.JdbcConfigTest
log4j:WARN No appenders could be found for logger (OpenEJB.startup.config).
log4j:WARN Please initialize the log4j system properly.
Tests run: 1, Failures: 0, Errors: 0, Skipped: 0, Time elapsed: 2.72 sec
Running org.apache.openejb.util.ClassesTest
Tests run: 1, Failures: 0, Errors: 0, Skipped: 0, Time elapsed: 0.065 sec
Running org.apache.openejb.core.ivm.naming.IvmContextTest
Tests run: 1, Failures: 0, Errors: 0, Skipped: 0, Time elapsed: 0.098 sec
Running org.apache.openejb.config.JaxbUnmarshallerTest
Tests run: 1, Failures: 0, Errors: 0, Skipped: 0, Time elapsed: 2.119 sec
Running org.apache.openejb.core.stateful.StatefulContainerTest
log4j:WARN No appenders could be found for logger (OpenEJB.startup.config).
log4j:WARN Please initialize the log4j system properly.
Tests run: 2, Failures: 0, Errors: 0, Skipped: 0, Time elapsed: 5.915 sec
Running org.apache.openejb.core.cmp.jpa.JpaTest
Tests run: 2, Failures: 0, Errors: 0, Skipped: 0, Time elapsed: 9.955 sec
Running org.apache.openejb.DependenceValidationTest
Tests run: 1, Failures: 0, Errors: 0, Skipped: 0, Time elapsed: 1.791 sec
Running org.apache.openejb.core.stateful.StatefulSessionBeanTest
log4j:WARN No appenders could be found for logger (OpenEJB.startup.config).
log4j:WARN Please initialize the log4j system properly.
Tests run: 1, Failures: 0, Errors: 0, Skipped: 0, Time elapsed: 5.906 sec
Running org.apache.openejb.core.stateless.CrossClassLoaderProxyTest
log4j:WARN No appenders could be found for logger (OpenEJB).
log4j:WARN Please initialize the log4j system properly.
Tests run: 4, Failures: 0, Errors: 0, Skipped: 0, Time elapsed: 1.121 sec
Running org.apache.openejb.core.stateless.ExtendedInjectionTest
log4j:WARN No appenders could be found for logger (OpenEJB).
log4j:WARN Please initialize the log4j system properly.
Tests run: 2, Failures: 0, Errors: 0, Skipped: 0, Time elapsed: 1.075 sec
Running org.apache.openejb.assembler.classic.RedeployTest
log4j:WARN No appenders could be found for logger (OpenEJB.startup.config).
log4j:WARN Please initialize the log4j system properly.
390  INFO   [main] openjpa.MetaData - Found 36 classes with metadata in 149 milliseconds.
47  INFO   [main] openjpa.MetaData - Found 1 classes with metadata in 43 milliseconds.
1157  INFO   [main] openjpa.MetaData - Parsing resource "jar:file:/home/continuum/.m2/repository/org/apache/openejb/openejb-itests-beans/3.0-incubating-SNAPSHOT/openejb-itests-beans-3.0-incubating-SNAPSHOT.jar!/META-INF/jpa.mapping.xml".
1882  INFO   [main] openjpa.MetaData - Parsing class "org.apache.openejb.test.entity.cmp2.Employee".
1962  INFO   [main] openjpa.MetaData - Parsing class "org.apache.openejb.test.entity.cmp2.Employee".
1963  INFO   [main] openjpa.MetaData - Parsing package "org.apache.openejb.test.entity.cmp2.Employee".
2009  INFO   [main] openjpa.MetaData - Parsing resource "jar:file:/tmp/OpenEJB_Generated_37826.jar!/META-INF/openejb-cmp-generated-orm.xml".
2110  INFO   [main] openjpa.MetaData - Parsing class "org.apache.openejb.test.entity.cmp.BasicCmpBean".
2115  INFO   [main] openjpa.MetaData - Parsing class "org.apache.openejb.test.entity.cmp.BasicCmpBean".
2115  INFO   [main] openjpa.MetaData - Parsing package "org.apache.openejb.test.entity.cmp.BasicCmpBean".
2119  INFO   [main] openjpa.MetaData - Parsing class "org.apache.openejb.test.entity.cmp.ComplexCmpBean".
2122  INFO   [main] openjpa.MetaData - Parsing class "org.apache.openejb.test.entity.cmp.ComplexCmpBean".
2127  INFO   [main] openjpa.MetaData - Parsing class "org.apache.openejb.test.entity.cmp.UnknownCmpBean".
2132  INFO   [main] openjpa.MetaData - Parsing class "org.apache.openejb.test.entity.cmp.UnknownCmpBean".
2152  INFO   [main] openjpa.MetaData - Parsing class "org.apache.openejb.test.entity.cmp.AllowedOperationsCmpBean".
2154  INFO   [main] openjpa.MetaData - Parsing class "org.apache.openejb.test.entity.cmp.AllowedOperationsCmpBean".
2165  INFO   [main] openjpa.MetaData - Parsing class "org.apache.openejb.test.entity.cmp.EncCmpBean".
2182  INFO   [main] openjpa.MetaData - Parsing class "org.apache.openejb.test.entity.cmp.EncCmpBean".
2191  INFO   [main] openjpa.MetaData - Parsing class "org.apache.openejb.test.entity.cmp.ContextLookupCmpBean".
2254  INFO   [main] openjpa.MetaData - Parsing class "org.apache.openejb.test.entity.cmp.ContextLookupCmpBean".
2269  INFO   [main] openjpa.MetaData - Parsing class "org.apache.openejb.test.entity.cmp.RmiIiopCmpBean".
2274  INFO   [main] openjpa.MetaData - Parsing class "org.apache.openejb.test.entity.cmp.RmiIiopCmpBean".
2290  INFO   [main] openjpa.MetaData - Parsing class "openejb.org.apache.openejb.test.entity.cmp.BasicCmpBeanX".
2292  INFO   [main] openjpa.MetaData - Parsing class "openejb.org.apache.openejb.test.entity.cmp.BasicCmpBeanX".
2292  INFO   [main] openjpa.MetaData - Parsing package "openejb.org.apache.openejb.test.entity.cmp.BasicCmpBeanX".
2293  INFO   [main] openjpa.MetaData - Parsing query "BasicCmpBeanX.findByLastName(java.lang.String)".
2300  INFO   [main] openjpa.MetaData - Parsing query "BasicCmpBeanX.findEmptyCollection".
2307  INFO   [main] openjpa.MetaData - Parsing class "openejb.org.apache.openejb.test.entity.cmp.ComplexCmpBeanX".
2308  INFO   [main] openjpa.MetaData - Parsing class "openejb.org.apache.openejb.test.entity.cmp.ComplexCmpBeanX".
2308  INFO   [main] openjpa.MetaData - Parsing query "ComplexCmpBeanX.findByLastName(java.lang.String)".
2309  INFO   [main] openjpa.MetaData - Parsing query "ComplexCmpBeanX.findEmptyCollection".
2310  INFO   [main] openjpa.MetaData - Parsing class "openejb.org.apache.openejb.test.entity.cmp.UnknownCmpBeanX".
2311  INFO   [main] openjpa.MetaData - Parsing class "openejb.org.apache.openejb.test.entity.cmp.UnknownCmpBeanX".
2311  INFO   [main] openjpa.MetaData - Parsing query "UnknownCmpBeanX.findByLastName(java.lang.String)".
2311  INFO   [main] openjpa.MetaData - Parsing query "UnknownCmpBeanX.findEmptyCollection".
2317  INFO   [main] openjpa.MetaData - Parsing class "openejb.org.apache.openejb.test.entity.cmp.BasicCmp2Bean".
2319  INFO   [main] openjpa.MetaData - Parsing class "openejb.org.apache.openejb.test.entity.cmp.BasicCmp2Bean".
2319  INFO   [main] openjpa.MetaData - Parsing query "BasicCmp2Bean.findByLastName(java.lang.String)".
2320  INFO   [main] openjpa.MetaData - Parsing query "BasicCmp2Bean.findEmptyCollection".
2327  INFO   [main] openjpa.MetaData - Parsing class "openejb.org.apache.openejb.test.entity.cmp.ComplexCmp2Bean".
2328  INFO   [main] openjpa.MetaData - Parsing class "openejb.org.apache.openejb.test.entity.cmp.ComplexCmp2Bean".
2329  INFO   [main] openjpa.MetaData - Parsing query "ComplexCmp2Bean.findByLastName(java.lang.String)".
2330  INFO   [main] openjpa.MetaData - Parsing query "ComplexCmp2Bean.findEmptyCollection".
2337  INFO   [main] openjpa.MetaData - Parsing class "openejb.org.apache.openejb.test.entity.cmp.UnknownCmp2Bean".
2338  INFO   [main] openjpa.MetaData - Parsing class "openejb.org.apache.openejb.test.entity.cmp.UnknownCmp2Bean".
2339  INFO   [main] openjpa.MetaData - Parsing query "UnknownCmp2Bean.findByLastName(java.lang.String)".
2339  INFO   [main] openjpa.MetaData - Parsing query "UnknownCmp2Bean.findEmptyCollection".
2343  INFO   [main] openjpa.MetaData - Parsing class "openejb.org.apache.openejb.test.entity.cmp.AOBasicCmpBean".
2343  INFO   [main] openjpa.MetaData - Parsing class "openejb.org.apache.openejb.test.entity.cmp.AOBasicCmpBean".
2344  INFO   [main] openjpa.MetaData - Parsing query "AOBasicCmpBean.findByLastName(java.lang.String)".
2344  INFO   [main] openjpa.MetaData - Parsing query "AOBasicCmpBean.findEmptyCollection".
2354  INFO   [main] openjpa.MetaData - Parsing class "openejb.org.apache.openejb.test.entity.cmp.AllowedOperationsCmp2Bean".
2356  INFO   [main] openjpa.MetaData - Parsing class "openejb.org.apache.openejb.test.entity.cmp.AllowedOperationsCmp2Bean".
2357  INFO   [main] openjpa.MetaData - Parsing query "AllowedOperationsCmp2Bean.findByLastName(java.lang.String)".
2357  INFO   [main] openjpa.MetaData - Parsing query "AllowedOperationsCmp2Bean.findEmptyCollection".
2359  INFO   [main] openjpa.MetaData - Parsing class "openejb.org.apache.openejb.test.entity.cmp.EncCmpBean".
2359  INFO   [main] openjpa.MetaData - Parsing class "openejb.org.apache.openejb.test.entity.cmp.EncCmpBean".
2365  INFO   [main] openjpa.MetaData - Parsing class "openejb.org.apache.openejb.test.entity.cmp.EncCmp2Bean".
2369  INFO   [main] openjpa.MetaData - Parsing class "openejb.org.apache.openejb.test.entity.cmp.EncCmp2Bean".
2372  INFO   [main] openjpa.MetaData - Parsing class "openejb.org.apache.openejb.test.entity.cmp.ContextLookupCmpBean".
2381  INFO   [main] openjpa.MetaData - Parsing class "openejb.org.apache.openejb.test.entity.cmp.ContextLookupCmpBean".
2393  INFO   [main] openjpa.MetaData - Parsing class "openejb.org.apache.openejb.test.entity.cmp.Cmp_RMI_IIOP_Bean".
2399  INFO   [main] openjpa.MetaData - Parsing class "openejb.org.apache.openejb.test.entity.cmp.Cmp_RMI_IIOP_Bean".
2412  INFO   [main] openjpa.MetaData - Parsing class "openejb.org.apache.openejb.test.entity.cmp.Cmp2_RMI_IIOP_Bean".
2419  INFO   [main] openjpa.MetaData - Parsing class "openejb.org.apache.openejb.test.entity.cmp.Cmp2_RMI_IIOP_Bean".
2434  INFO   [main] openjpa.MetaData - Parsing class "openejb.org.apache.openejb.test.entity.cmr.onetoone.Person".
2462  INFO   [main] openjpa.MetaData - Parsing class "openejb.org.apache.openejb.test.entity.cmr.onetoone.Person".
2462  INFO   [main] openjpa.MetaData - Parsing package "openejb.org.apache.openejb.test.entity.cmr.onetoone.Person".
2463  INFO   [main] openjpa.MetaData - Parsing query "Person.findByPrimaryKey(org.apache.openejb.test.entity.cmr.onetoone.PersonPk)".
2465  INFO   [main] openjpa.MetaData - Parsing class "openejb.org.apache.openejb.test.entity.cmr.onetoone.License".
2473  INFO   [main] openjpa.MetaData - Parsing class "openejb.org.apache.openejb.test.entity.cmr.onetoone.License".
2474  INFO   [main] openjpa.MetaData - Parsing query "License.findByPrimaryKey(org.apache.openejb.test.entity.cmr.onetoone.LicensePk)".
2479  INFO   [main] openjpa.MetaData - Parsing class "openejb.org.apache.openejb.test.entity.cmr.onetomany.Artist".
2485  INFO   [main] openjpa.MetaData - Parsing class "openejb.org.apache.openejb.test.entity.cmr.onetomany.Artist".
2485  INFO   [main] openjpa.MetaData - Parsing package "openejb.org.apache.openejb.test.entity.cmr.onetomany.Artist".
2486  INFO   [main] openjpa.MetaData - Parsing query "Artist.findByPrimaryKey(org.apache.openejb.test.entity.cmr.onetomany.ArtistPk)".
2492  INFO   [main] openjpa.MetaData - Parsing class "openejb.org.apache.openejb.test.entity.cmr.onetomany.Song".
2498  INFO   [main] openjpa.MetaData - Parsing class "openejb.org.apache.openejb.test.entity.cmr.onetomany.Song".
2498  INFO   [main] openjpa.MetaData - Parsing query "Song.findByPrimaryKey(org.apache.openejb.test.entity.cmr.onetomany.SongPk)".
2503  INFO   [main] openjpa.MetaData - Parsing class "openejb.org.apache.openejb.test.entity.cmr.manytomany.Game".
2506  INFO   [main] openjpa.MetaData - Parsing class "openejb.org.apache.openejb.test.entity.cmr.manytomany.Game".
2506  INFO   [main] openjpa.MetaData - Parsing package "openejb.org.apache.openejb.test.entity.cmr.manytomany.Game".
2507  INFO   [main] openjpa.MetaData - Parsing query "Game.findByPrimaryKey(org.apache.openejb.test.entity.cmr.manytomany.GamePk)".
2514  INFO   [main] openjpa.MetaData - Parsing class "openejb.org.apache.openejb.test.entity.cmr.manytomany.Platform".
2517  INFO   [main] openjpa.MetaData - Parsing class "openejb.org.apache.openejb.test.entity.cmr.manytomany.Platform".
2517  INFO   [main] openjpa.MetaData - Parsing query "Platform.findByPrimaryKey(org.apache.openejb.test.entity.cmr.manytomany.PlatformPk)".
2520  INFO   [main] openjpa.MetaData - Parsing class "openejb.org.apache.openejb.test.entity.cmr.onetoone.ComplexPerson".
2523  INFO   [main] openjpa.MetaData - Parsing class "openejb.org.apache.openejb.test.entity.cmr.onetoone.ComplexPerson".
2524  INFO   [main] openjpa.MetaData - Parsing query "ComplexPerson.findByPrimaryKey(java.lang.Integer)".
2530  INFO   [main] openjpa.MetaData - Parsing class "openejb.org.apache.openejb.test.entity.cmr.onetoone.ComplexLicense".
2531  INFO   [main] openjpa.MetaData - Parsing class "openejb.org.apache.openejb.test.entity.cmr.onetoone.ComplexLicense".
2532  INFO   [main] openjpa.MetaData - Parsing query "ComplexLicense.findByPrimaryKey(java.lang.Integer)".
2542  INFO   [main] openjpa.MetaData - Parsing class "openejb.org.apache.openejb.test.entity.cmr.onetomany.ComplexArtist".
2544  INFO   [main] openjpa.MetaData - Parsing class "openejb.org.apache.openejb.test.entity.cmr.onetomany.ComplexArtist".
2544  INFO   [main] openjpa.MetaData - Parsing query "ComplexArtist.findByPrimaryKey(java.lang.Integer)".
2548  INFO   [main] openjpa.MetaData - Parsing class "openejb.org.apache.openejb.test.entity.cmr.onetomany.ComplexSong".
2549  INFO   [main] openjpa.MetaData - Parsing class "openejb.org.apache.openejb.test.entity.cmr.onetomany.ComplexSong".
2549  INFO   [main] openjpa.MetaData - Parsing query "ComplexSong.findByPrimaryKey(java.lang.Integer)".
2552  INFO   [main] openjpa.MetaData - Parsing class "openejb.org.apache.openejb.test.entity.cmr.manytomany.ComplexGame".
2553  INFO   [main] openjpa.MetaData - Parsing class "openejb.org.apache.openejb.test.entity.cmr.manytomany.ComplexGame".
2554  INFO   [main] openjpa.MetaData - Parsing query "ComplexGame.findByPrimaryKey(java.lang.Integer)".
2557  INFO   [main] openjpa.MetaData - Parsing class "openejb.org.apache.openejb.test.entity.cmr.manytomany.ComplexPlatform".
2558  INFO   [main] openjpa.MetaData - Parsing class "openejb.org.apache.openejb.test.entity.cmr.manytomany.ComplexPlatform".
2559  INFO   [main] openjpa.MetaData - Parsing query "ComplexPlatform.findByPrimaryKey(java.lang.Integer)".
2573  INFO   [main] openjpa.MetaData - Parsing class "openejb.org.apache.openejb.test.entity.ejbql.Query".
2575  INFO   [main] openjpa.MetaData - Parsing class "openejb.org.apache.openejb.test.entity.ejbql.Query".
2576  INFO   [main] openjpa.MetaData - Parsing package "openejb.org.apache.openejb.test.entity.ejbql.Query".
2577  INFO   [main] openjpa.MetaData - Parsing query "Query.ejbSelectSingleStringField(java.lang.String)".
2577  INFO   [main] openjpa.MetaData - Parsing query "Query.ejbSelectSingleBooleanField(boolean)".
2578  INFO   [main] openjpa.MetaData - Parsing query "Query.ejbSelectSingleCharField(char)".
2578  INFO   [main] openjpa.MetaData - Parsing query "Query.ejbSelectSingleByteField(byte)".
2578  INFO   [main] openjpa.MetaData - Parsing query "Query.ejbSelectSingleShortField(short)".
2578  INFO   [main] openjpa.MetaData - Parsing query "Query.ejbSelectSingleIntField(int)".
2579  INFO   [main] openjpa.MetaData - Parsing query "Query.ejbSelectSingleLongField(long)".
2579  INFO   [main] openjpa.MetaData - Parsing query "Query.ejbSelectSingleFloatField(float)".
2579  INFO   [main] openjpa.MetaData - Parsing query "Query.ejbSelectSingleDoubleField(double)".
2580  INFO   [main] openjpa.MetaData - Parsing query "Query.ejbSelectCollectionStringField".
2580  INFO   [main] openjpa.MetaData - Parsing query "Query.ejbSelectCollectionBooleanField".
2580  INFO   [main] openjpa.MetaData - Parsing query "Query.ejbSelectCollectionCharField".
2580  INFO   [main] openjpa.MetaData - Parsing query "Query.ejbSelectCollectionByteField".
2581  INFO   [main] openjpa.MetaData - Parsing query "Query.ejbSelectCollectionShortField".
2581  INFO   [main] openjpa.MetaData - Parsing query "Query.ejbSelectCollectionIntField".
2581  INFO   [main] openjpa.MetaData - Parsing query "Query.ejbSelectCollectionLongField".
2582  INFO   [main] openjpa.MetaData - Parsing query "Query.ejbSelectCollectionFloatField".
2582  INFO   [main] openjpa.MetaData - Parsing query "Query.ejbSelectCollectionDoubleField".
2582  INFO   [main] openjpa.MetaData - Parsing query "Query.ejbSelectSingleLocalEjb(int)".
2582  INFO   [main] openjpa.MetaData - Parsing query "Query.ejbSelectSingleRemoteEjb(int)".
2583  INFO   [main] openjpa.MetaData - Parsing query "Query.ejbSelectCollectionLocalEjb".
2583  INFO   [main] openjpa.MetaData - Parsing query "Query.ejbSelectCollectionRemoteEjb".
2587  INFO   [main] openjpa.MetaData - Parsing class "openejb.org.apache.openejb.test.entity.ejbql.QueryData".
2589  INFO   [main] openjpa.MetaData - Parsing class "openejb.org.apache.openejb.test.entity.ejbql.QueryData".
2602  INFO   [main] openjpa.MetaData - Parsing class "org.apache.openejb.test.object.OperationsPolicy".
2602  INFO   [main] openjpa.MetaData - Parsing package "org.apache.openejb.test.object.OperationsPolicy".
2651  INFO   [main] openjpa.MetaData - Parsing class "javax.ejb.EntityContext".
2652  INFO   [main] openjpa.MetaData - Parsing package "javax.ejb.EntityContext".
3773  INFO   [main] openjpa.MetaData - Parsing class "org.apache.openejb.test.entity.cmp.BasicCmp2Bean".
3885  INFO   [main] openjpa.MetaData - Parsing class "org.apache.openejb.test.entity.cmp.ComplexCmp2Bean".
3889  INFO   [main] openjpa.MetaData - Parsing class "org.apache.openejb.test.entity.cmp.ComplexCmpBeanPk".
3963  INFO   [main] openjpa.MetaData - Parsing class "org.apache.openejb.test.entity.cmp.UnknownCmp2Bean".
4217  INFO   [main] openjpa.MetaData - Parsing class "org.apache.openejb.test.entity.cmp.AllowedOperationsCmp2Bean".
4424  INFO   [main] openjpa.MetaData - Parsing class "org.apache.openejb.test.entity.cmp.EncCmp2Bean".
4654  INFO   [main] openjpa.MetaData - Parsing class "org.apache.openejb.test.entity.cmp.RmiIiopCmp2Bean".
4719  INFO   [main] openjpa.MetaData - Parsing class "org.apache.openejb.test.entity.cmr.onetoone.PersonBean".
4719  INFO   [main] openjpa.MetaData - Parsing package "org.apache.openejb.test.entity.cmr.onetoone.PersonBean".
4721  INFO   [main] openjpa.MetaData - Parsing class "org.apache.openejb.test.entity.cmr.onetoone.LicenseBean".
4847  INFO   [main] openjpa.MetaData - Parsing class "org.apache.openejb.test.entity.cmr.onetomany.ArtistBean".
4847  INFO   [main] openjpa.MetaData - Parsing package "org.apache.openejb.test.entity.cmr.onetomany.ArtistBean".
4847  INFO   [main] openjpa.MetaData - Parsing class "org.apache.openejb.test.entity.cmr.onetomany.SongBean".
4991  INFO   [main] openjpa.MetaData - Parsing class "org.apache.openejb.test.entity.cmr.manytomany.GameBean".
4991  INFO   [main] openjpa.MetaData - Parsing package "org.apache.openejb.test.entity.cmr.manytomany.GameBean".
4991  INFO   [main] openjpa.MetaData - Parsing class "org.apache.openejb.test.entity.cmr.manytomany.PlatformBean".
5098  INFO   [main] openjpa.MetaData - Parsing class "org.apache.openejb.test.entity.cmr.onetoone.PersonPk".
5169  INFO   [main] openjpa.MetaData - Parsing class "org.apache.openejb.test.entity.cmr.onetoone.LicensePk".
5246  INFO   [main] openjpa.MetaData - Parsing class "org.apache.openejb.test.entity.cmr.onetomany.ArtistPk".
5286  INFO   [main] openjpa.MetaData - Parsing class "org.apache.openejb.test.entity.cmr.onetomany.SongPk".
5346  INFO   [main] openjpa.MetaData - Parsing class "org.apache.openejb.test.entity.cmr.manytomany.GamePk".
5385  INFO   [main] openjpa.MetaData - Parsing class "org.apache.openejb.test.entity.cmr.manytomany.PlatformPk".
5459  INFO   [main] openjpa.MetaData - Parsing class "org.apache.openejb.test.entity.ejbql.QueryBean".
5459  INFO   [main] openjpa.MetaData - Parsing package "org.apache.openejb.test.entity.ejbql.QueryBean".
5524  INFO   [main] openjpa.MetaData - Parsing class "org.apache.openejb.test.entity.ejbql.QueryDataBean".
74  INFO   [main] openjpa.MetaData - Found 36 classes with metadata in 68 milliseconds.
39  INFO   [main] openjpa.MetaData - Found 1 classes with metadata in 39 milliseconds.
43  INFO   [main] openjpa.MetaData - Found 36 classes with metadata in 42 milliseconds.
29  INFO   [main] openjpa.MetaData - Found 1 classes with metadata in 28 milliseconds.
Tests run: 1, Failures: 0, Errors: 0, Skipped: 0, Time elapsed: 39.893 sec
Running org.apache.openejb.resource.SharedLocalConnectionManagerTest
Tests run: 1, Failures: 0, Errors: 0, Skipped: 0, Time elapsed: 1.222 sec
Running org.apache.openejb.assembler.classic.InterceptorBindingInfoComparatorTest
Tests run: 2, Failures: 0, Errors: 0, Skipped: 0, Time elapsed: 0.184 sec
Running org.apache.openejb.assembler.classic.MdbConfigTest
log4j:WARN No appenders could be found for logger (OpenEJB.startup.config).
log4j:WARN Please initialize the log4j system properly.
Tests run: 1, Failures: 0, Errors: 0, Skipped: 0, Time elapsed: 9.734 sec
Running org.apache.openejb.core.security.PropertiesLoginModuleTest
Path to login config: /x1/continuum/working-directory/158/target/test-classes/login.config
Path to login config: /x1/continuum/working-directory/158/target/test-classes/login.config
Path to login config: /x1/continuum/working-directory/158/target/test-classes/login.config
Tests run: 3, Failures: 0, Errors: 3, Skipped: 0, Time elapsed: 0.261 sec <<< FAILURE!
Running org.apache.openejb.assembler.classic.PersistenceUnitRefTest
Tests run: 1, Failures: 0, Errors: 0, Skipped: 0, Time elapsed: 0.217 sec
Running org.apache.openejb.resource.GeronimoConnectionManagerTest
log4j:WARN No appenders could be found for logger (org.apache.geronimo.connector.outbound.AbstractSinglePoolConnectionInterceptor).
log4j:WARN Please initialize the log4j system properly.
Tests run: 1, Failures: 0, Errors: 0, Skipped: 0, Time elapsed: 1.13 sec
Running org.apache.openejb.core.mdb.JmsTest
log4j:WARN No appenders could be found for logger (org.apache.activemq.broker.BrokerService).
log4j:WARN Please initialize the log4j system properly.
Tests run: 1, Failures: 0, Errors: 0, Skipped: 0, Time elapsed: 11.175 sec
Running org.apache.openejb.SomeoneBrokeSurefireAndThisIsADirtyHackForItTest
test server = org.apache.openejb.test.IvmTestServer
entry = java.naming.factory.initial:org.apache.openejb.client.LocalInitialContextFactory
WARN - Unable use logging config as there are 3 file references containing directories which have not been created.  See the list below.
WARN - [0] /x1/continuum/working-directory/158/target/test-classes/conf/logs/transaction.log
WARN - [1] /x1/continuum/working-directory/158/target/test-classes/conf/logs/openejb.log
WARN - [2] /x1/continuum/working-directory/158/target/test-classes/conf/logs/server.log
Apache OpenEJB 3.0-incubating-SNAPSHOT    build: 20070404-04:03
http://incubator.apache.org/openejb
INFO - openejb.home = /x1/continuum/working-directory/158/target/test-classes
INFO - openejb.base = /x1/continuum/working-directory/158/target/test-classes
INFO - Found EjbModule in classpath: /home/continuum/.m2/repository/org/apache/openejb/openejb-itests-beans/3.0-incubating-SNAPSHOT/openejb-itests-beans-3.0-incubating-SNAPSHOT.jar
WARN - Auto-linking res-ref-name 'stateless/references/Resource_manager_access' in bean client/tests/entity/cmp/allowed_operations/EntityHome to Connector(id=Default JDBC Database)
WARN - Auto-linking res-ref-name 'stateless/references/Resource_manager_access' in bean client/tests/entity/cmp2/allowed_operations/EntityHome to Connector(id=Default JDBC Database)
WARN - Auto-linking res-ref-name 'org.apache.openejb.test.stateful.AnnotatedFieldInjectionStatefulBean/daataSource' in bean AnnotatedFieldInjectionStatefulBean to Connector(id=Default JDBC Database)
WARN - Auto-linking res-ref-name 'org.apache.openejb.test.stateful.AnnotatedFieldInjectionStatefulBean/coonnectionFactory' in bean AnnotatedFieldInjectionStatefulBean to Connector(id=Default JMS Connection Factory)
WARN - Auto-linking res-ref-name 'org.apache.openejb.test.stateful.AnnotatedFieldInjectionStatefulBean/queueCoonnectionFactory' in bean AnnotatedFieldInjectionStatefulBean to Connector(id=Default JMS Connection Factory)
WARN - Auto-linking res-ref-name 'org.apache.openejb.test.stateful.AnnotatedFieldInjectionStatefulBean/topicCoonnectionFactory' in bean AnnotatedFieldInjectionStatefulBean to Connector(id=Default JMS Connection Factory)
WARN - Auto-linking res-ref-name 'org.apache.openejb.test.stateless.AnnotatedFieldInjectionStatelessBean/daataSource' in bean AnnotatedFieldInjectionStatelessBean to Connector(id=Default JDBC Database)
WARN - Auto-linking res-ref-name 'org.apache.openejb.test.stateless.AnnotatedFieldInjectionStatelessBean/coonnectionFactory' in bean AnnotatedFieldInjectionStatelessBean to Connector(id=Default JMS Connection Factory)
WARN - Auto-linking res-ref-name 'org.apache.openejb.test.stateless.AnnotatedFieldInjectionStatelessBean/queueCoonnectionFactory' in bean AnnotatedFieldInjectionStatelessBean to Connector(id=Default JMS Connection Factory)
WARN - Auto-linking res-ref-name 'org.apache.openejb.test.stateless.AnnotatedFieldInjectionStatelessBean/topicCoonnectionFactory' in bean AnnotatedFieldInjectionStatelessBean to Connector(id=Default JMS Connection Factory)
WARN - Auto-linking res-ref-name 'org.apache.openejb.test.mdb.AnnotatedFieldInjectionMdbBean/daataSource' in bean AnnotatedFieldInjectionMdbBean to Connector(id=Default JDBC Database)
WARN - Auto-linking res-ref-name 'org.apache.openejb.test.mdb.AnnotatedFieldInjectionMdbBean/coonnectionFactory' in bean AnnotatedFieldInjectionMdbBean to Connector(id=Default JMS Connection Factory)
WARN - Auto-linking res-ref-name 'org.apache.openejb.test.mdb.AnnotatedFieldInjectionMdbBean/queueCoonnectionFactory' in bean AnnotatedFieldInjectionMdbBean to Connector(id=Default JMS Connection Factory)
WARN - Auto-linking res-ref-name 'org.apache.openejb.test.mdb.AnnotatedFieldInjectionMdbBean/topicCoonnectionFactory' in bean AnnotatedFieldInjectionMdbBean to Connector(id=Default JMS Connection Factory)
log4j:WARN No appenders could be found for logger (org.apache.activemq.broker.BrokerService).
log4j:WARN Please initialize the log4j system properly.
ERROR - FATAL ERROR: Unknown error in Assembler.  Please send the following stack trace and this message to user@openejb.org :
 org.apache.xbean.recipe.MissingAccessorException: Unable to find a valid setter method: public void org.apache.openejb.core.mdb.MdbContainer.setServerUrl(java.lang.String)
	at org.apache.xbean.recipe.ObjectRecipe.findSetter(ObjectRecipe.java:692)
	at org.apache.xbean.recipe.ObjectRecipe.setProperty(ObjectRecipe.java:275)
	at org.apache.xbean.recipe.ObjectRecipe.setProperties(ObjectRecipe.java:251)
	at org.apache.xbean.recipe.ObjectRecipe.create(ObjectRecipe.java:198)
	at org.apache.xbean.recipe.AbstractRecipe.create(AbstractRecipe.java:28)
	at org.apache.openejb.assembler.classic.Assembler.createContainer(Assembler.java:603)
	at org.apache.openejb.assembler.classic.Assembler.buildContainerSystem(Assembler.java:293)
	at org.apache.openejb.assembler.classic.Assembler.build(Assembler.java:201)
	at org.apache.openejb.OpenEJB$Instance.<init>(OpenEJB.java:147)
	at org.apache.openejb.OpenEJB.init(OpenEJB.java:280)
	at org.apache.openejb.OpenEJB.init(OpenEJB.java:265)
	at sun.reflect.NativeMethodAccessorImpl.invoke0(Native Method)
	at sun.reflect.NativeMethodAccessorImpl.invoke(NativeMethodAccessorImpl.java:39)
	at sun.reflect.DelegatingMethodAccessorImpl.invoke(DelegatingMethodAccessorImpl.java:25)
	at java.lang.reflect.Method.invoke(Method.java:585)
	at org.apache.openejb.loader.OpenEJBInstance.init(OpenEJBInstance.java:36)
	at org.apache.openejb.client.LocalInitialContextFactory.init(LocalInitialContextFactory.java:56)
	at org.apache.openejb.client.LocalInitialContextFactory.getInitialContext(LocalInitialContextFactory.java:42)
	at javax.naming.spi.NamingManager.getInitialContext(NamingManager.java:667)
	at javax.naming.InitialContext.getDefaultInitCtx(InitialContext.java:247)
	at javax.naming.InitialContext.init(InitialContext.java:223)
	at javax.naming.InitialContext.<init>(InitialContext.java:197)
	at org.apache.openejb.test.HsqldbTestDatabase.start(HsqldbTestDatabase.java:180)
	at org.apache.openejb.test.TestManager.start(TestManager.java:79)
	at org.apache.openejb.iTest.setUp(iTest.java:57)
	at org.apache.openejb.test.TestSuite.run(TestSuite.java:41)
	at sun.reflect.NativeMethodAccessorImpl.invoke0(Native Method)
	at sun.reflect.NativeMethodAccessorImpl.invoke(NativeMethodAccessorImpl.java:39)
	at sun.reflect.DelegatingMethodAccessorImpl.invoke(DelegatingMethodAccessorImpl.java:25)
	at java.lang.reflect.Method.invoke(Method.java:585)
	at org.apache.maven.surefire.junit.JUnitTestSet.execute(JUnitTestSet.java:210)
	at org.apache.maven.surefire.suite.AbstractDirectoryTestSuite.executeTestSet(AbstractDirectoryTestSuite.java:135)
	at org.apache.maven.surefire.suite.AbstractDirectoryTestSuite.execute(AbstractDirectoryTestSuite.java:160)
	at org.apache.maven.surefire.Surefire.run(Surefire.java:81)
	at sun.reflect.NativeMethodAccessorImpl.invoke0(Native Method)
	at sun.reflect.NativeMethodAccessorImpl.invoke(NativeMethodAccessorImpl.java:39)
	at sun.reflect.DelegatingMethodAccessorImpl.invoke(DelegatingMethodAccessorImpl.java:25)
	at java.lang.reflect.Method.invoke(Method.java:585)
	at org.apache.maven.surefire.booter.SurefireBooter.runSuitesInProcess(SurefireBooter.java:182)
	at org.apache.maven.surefire.booter.SurefireBooter.main(SurefireBooter.java:743)

FATAL - OpenEJB has encountered a fatal error and cannot be started: Assembler failed to build the container system.
org.apache.openejb.OpenEJBException: org.apache.xbean.recipe.MissingAccessorException: Unable to find a valid setter method: public void org.apache.openejb.core.mdb.MdbContainer.setServerUrl(java.lang.String): Unable to find a valid setter method: public void org.apache.openejb.core.mdb.MdbContainer.setServerUrl(java.lang.String)
	at org.apache.openejb.assembler.classic.Assembler.build(Assembler.java:214)
	at org.apache.openejb.OpenEJB$Instance.<init>(OpenEJB.java:147)
	at org.apache.openejb.OpenEJB.init(OpenEJB.java:280)
	at org.apache.openejb.OpenEJB.init(OpenEJB.java:265)
	at sun.reflect.NativeMethodAccessorImpl.invoke0(Native Method)
	at sun.reflect.NativeMethodAccessorImpl.invoke(NativeMethodAccessorImpl.java:39)
	at sun.reflect.DelegatingMethodAccessorImpl.invoke(DelegatingMethodAccessorImpl.java:25)
	at java.lang.reflect.Method.invoke(Method.java:585)
	at org.apache.openejb.loader.OpenEJBInstance.init(OpenEJBInstance.java:36)
	at org.apache.openejb.client.LocalInitialContextFactory.init(LocalInitialContextFactory.java:56)
	at org.apache.openejb.client.LocalInitialContextFactory.getInitialContext(LocalInitialContextFactory.java:42)
	at javax.naming.spi.NamingManager.getInitialContext(NamingManager.java:667)
	at javax.naming.InitialContext.getDefaultInitCtx(InitialContext.java:247)
	at javax.naming.InitialContext.init(InitialContext.java:223)
	at javax.naming.InitialContext.<init>(InitialContext.java:197)
	at org.apache.openejb.test.HsqldbTestDatabase.start(HsqldbTestDatabase.java:180)
	at org.apache.openejb.test.TestManager.start(TestManager.java:79)
	at org.apache.openejb.iTest.setUp(iTest.java:57)
	at org.apache.openejb.test.TestSuite.run(TestSuite.java:41)
	at sun.reflect.NativeMethodAccessorImpl.invoke0(Native Method)
	at sun.reflect.NativeMethodAccessorImpl.invoke(NativeMethodAccessorImpl.java:39)
	at sun.reflect.DelegatingMethodAccessorImpl.invoke(DelegatingMethodAccessorImpl.java:25)
	at java.lang.reflect.Method.invoke(Method.java:585)
	at org.apache.maven.surefire.junit.JUnitTestSet.execute(JUnitTestSet.java:210)
	at org.apache.maven.surefire.suite.AbstractDirectoryTestSuite.executeTestSet(AbstractDirectoryTestSuite.java:135)
	at org.apache.maven.surefire.suite.AbstractDirectoryTestSuite.execute(AbstractDirectoryTestSuite.java:160)
	at org.apache.maven.surefire.Surefire.run(Surefire.java:81)
	at sun.reflect.NativeMethodAccessorImpl.invoke0(Native Method)
	at sun.reflect.NativeMethodAccessorImpl.invoke(NativeMethodAccessorImpl.java:39)
	at sun.reflect.DelegatingMethodAccessorImpl.invoke(DelegatingMethodAccessorImpl.java:25)
	at java.lang.reflect.Method.invoke(Method.java:585)
	at org.apache.maven.surefire.booter.SurefireBooter.runSuitesInProcess(SurefireBooter.java:182)
	at org.apache.maven.surefire.booter.SurefireBooter.main(SurefireBooter.java:743)
Caused by: org.apache.xbean.recipe.MissingAccessorException: Unable to find a valid setter method: public void org.apache.openejb.core.mdb.MdbContainer.setServerUrl(java.lang.String)
	at org.apache.xbean.recipe.ObjectRecipe.findSetter(ObjectRecipe.java:692)
	at org.apache.xbean.recipe.ObjectRecipe.setProperty(ObjectRecipe.java:275)
	at org.apache.xbean.recipe.ObjectRecipe.setProperties(ObjectRecipe.java:251)
	at org.apache.xbean.recipe.ObjectRecipe.create(ObjectRecipe.java:198)
	at org.apache.xbean.recipe.AbstractRecipe.create(AbstractRecipe.java:28)
	at org.apache.openejb.assembler.classic.Assembler.createContainer(Assembler.java:603)
	at org.apache.openejb.assembler.classic.Assembler.buildContainerSystem(Assembler.java:293)
	at org.apache.openejb.assembler.classic.Assembler.build(Assembler.java:201)
	... 32 more
Tests run: 1, Failures: 0, Errors: 1, Skipped: 0, Time elapsed: 15.389 sec <<< FAILURE!
Running org.apache.openejb.iTest
Tests run: 0, Failures: 0, Errors: 0, Skipped: 0, Time elapsed: 0.04 sec
Running org.apache.openejb.core.stateless.StatelessContainerTest
log4j:WARN No appenders could be found for logger (OpenEJB).
log4j:WARN Please initialize the log4j system properly.
Tests run: 3, Failures: 0, Errors: 0, Skipped: 0, Time elapsed: 1.059 sec
Running org.apache.openejb.core.TemporaryClassLoaderTest
Tests run: 1, Failures: 0, Errors: 0, Skipped: 0, Time elapsed: 0.18 sec
Running org.apache.openejb.core.security.SecurityTest
log4j:WARN No appenders could be found for logger (OpenEJB.startup.config).
log4j:WARN Please initialize the log4j system properly.
Tests run: 1, Failures: 0, Errors: 1, Skipped: 0, Time elapsed: 4.134 sec <<< FAILURE!
Running org.apache.openejb.assembler.classic.OpenEjbConfigurationValidationTest
Tests run: 1, Failures: 0, Errors: 0, Skipped: 0, Time elapsed: 0.244 sec

Results :
Tests run: 67, Failures: 0, Errors: 6, Skipped: 0

[INFO] ------------------------------------------------------------------------
[ERROR] BUILD FAILURE
[INFO] ------------------------------------------------------------------------
[INFO] There are test failures.
[INFO] ------------------------------------------------------------------------
[INFO] For more information, run Maven with the -e switch
[INFO] ------------------------------------------------------------------------
[INFO] Total time: 5 minutes 33 seconds
[INFO] Finished at: Wed Apr 04 16:08:22 PDT 2007
[INFO] Final Memory: 14M/27M
[INFO] ------------------------------------------------------------------------

****************************************************************************



Mime
View raw message