tomee-commits mailing list archives

Site index · List index
Message view « Date » · « Thread »
Top « Date » · « Thread »
From "Continuum@vmbuild.apache.org" <openejb-comm...@incubator.apache.org>
Subject [continuum] BUILD FAILURE: OpenEJB :: Container :: Core
Date Wed, 04 Apr 2007 13:08:01 GMT
Online report : http://vmbuild.apache.org/continuum/servlet/continuum/target/ProjectBuild.vm/view/ProjectBuild/id/158/buildId/100466
Build statistics:
  State: Failed
  Previous State: Failed
  Started at: Wed, 4 Apr 2007 06:02:33 -0700
  Finished at: Wed, 4 Apr 2007 06:08:01 -0700
  Total time: 5m 28s
  Build Trigger: Schedule
  Exit code: 1
  Building machine hostname: vmbuild.apache.org
  Operating system : Linux(unknown)
  Java version : 1.5.0_06(Sun Microsystems Inc.)

Changes
         manugeorge          For Jiras OPENEJB-532 and OPENEJB-533
Wiring in LifeCycle and onMessage interceptor support
             /incubator/openejb/trunk/openejb3/container/openejb-core/src/main/java/org/apache/openejb/DeploymentInfo.java
            /incubator/openejb/trunk/openejb3/container/openejb-core/src/main/java/org/apache/openejb/core/mdb/EndpointHandler.java
            /incubator/openejb/trunk/openejb3/container/openejb-core/src/main/java/org/apache/openejb/core/mdb/Instance.java
            /incubator/openejb/trunk/openejb3/container/openejb-core/src/main/java/org/apache/openejb/core/mdb/MdbContainer.java
            /incubator/openejb/trunk/openejb3/container/openejb-core/src/main/java/org/apache/openejb/core/mdb/MdbContext.java
            /incubator/openejb/trunk/openejb3/container/openejb-core/src/main/java/org/apache/openejb/core/mdb/MdbInstanceFactory.java
        
****************************************************************************
Output:
****************************************************************************
[INFO] Scanning for projects...
[INFO] ----------------------------------------------------------------------------
[INFO] Building OpenEJB :: Container :: Core
[INFO]    task-segment: [install]
[INFO] ----------------------------------------------------------------------------
[INFO] [resources:resources]
[INFO] Using default encoding to copy filtered resources.
[INFO] [dependency:copy {execution: copy-dependencies}]
[INFO] Configured Artifact: org.apache.openejb:openejb-javaagent:null:3.0-incubating-SNAPSHOT:jar
[INFO] snapshot org.apache.openejb:openejb-javaagent:3.0-incubating-SNAPSHOT: checking for updates from codehaus-snapshot
[INFO] snapshot org.apache.openejb:openejb-javaagent:3.0-incubating-SNAPSHOT: checking for updates from apache-m2-snapshot
[INFO] snapshot org.apache.openejb:openejb-javaagent:3.0-incubating-SNAPSHOT: checking for updates from apache.snapshots
Downloading: http://people.apache.org/repo/m2-snapshot-repository/org/apache/openejb/openejb-javaagent/3.0-incubating-SNAPSHOT/openejb-javaagent-3.0-incubating-20070404.125607-105.jar
3K downloaded
[INFO] openejb-javaagent-3.0-incubating-SNAPSHOT.jar already exists.
[INFO] snapshot org.apache.openejb:openejb-loader:3.0-incubating-SNAPSHOT: checking for updates from codehaus-snapshot
[INFO] snapshot org.apache.openejb:openejb-loader:3.0-incubating-SNAPSHOT: checking for updates from apache-m2-snapshot
[INFO] snapshot org.apache.openejb:openejb-loader:3.0-incubating-SNAPSHOT: checking for updates from apache.snapshots
Downloading: http://people.apache.org/repo/m2-snapshot-repository/org/apache/openejb/openejb-loader/3.0-incubating-SNAPSHOT/openejb-loader-3.0-incubating-20070404.125607-110.pom
765b downloaded
Downloading: http://people.apache.org/repo/m2-snapshot-repository/org/apache/openejb/openejb-javaagent/3.0-incubating-SNAPSHOT/openejb-javaagent-3.0-incubating-20070404.125607-105.pom
1K downloaded
[INFO] snapshot org.apache.openejb:openejb-jee:3.0-incubating-SNAPSHOT: checking for updates from codehaus-snapshot
[INFO] snapshot org.apache.openejb:openejb-jee:3.0-incubating-SNAPSHOT: checking for updates from apache-m2-snapshot
[INFO] snapshot org.apache.openejb:openejb-jee:3.0-incubating-SNAPSHOT: checking for updates from apache.snapshots
Downloading: http://people.apache.org/repo/m2-snapshot-repository/org/apache/openejb/openejb-jee/3.0-incubating-SNAPSHOT/openejb-jee-3.0-incubating-20070404.125607-107.pom
1K downloaded
[INFO] snapshot org.apache.xbean:xbean-finder:3.0-SNAPSHOT: checking for updates from codehaus-snapshot
[INFO] snapshot org.apache.xbean:xbean-finder:3.0-SNAPSHOT: checking for updates from apache-m2-snapshot
[INFO] snapshot org.apache.xbean:xbean-finder:3.0-SNAPSHOT: checking for updates from apache.snapshots
[INFO] snapshot org.apache.xbean:xbean:3.0-SNAPSHOT: checking for updates from codehaus-snapshot
[INFO] snapshot org.apache.xbean:xbean:3.0-SNAPSHOT: checking for updates from apache-m2-snapshot
[INFO] snapshot org.apache.xbean:xbean:3.0-SNAPSHOT: checking for updates from apache.snapshots
[INFO] snapshot org.apache.geronimo.specs:geronimo-stax-api_1.0_spec:1.0-SNAPSHOT: checking for updates from codehaus-snapshot
[INFO] snapshot org.apache.geronimo.specs:geronimo-stax-api_1.0_spec:1.0-SNAPSHOT: checking for updates from apache-m2-snapshot
[INFO] snapshot org.apache.geronimo.specs:geronimo-stax-api_1.0_spec:1.0-SNAPSHOT: checking for updates from apache.snapshots
[INFO] snapshot org.apache.activemq:activemq-ra:4.1-SNAPSHOT: checking for updates from codehaus-snapshot
[INFO] snapshot org.apache.activemq:activemq-ra:4.1-SNAPSHOT: checking for updates from apache-m2-snapshot
[INFO] snapshot org.apache.activemq:activemq-ra:4.1-SNAPSHOT: checking for updates from apache.snapshots
[INFO] snapshot org.apache.activemq:activemq-parent:4.1-SNAPSHOT: checking for updates from codehaus-snapshot
[INFO] snapshot org.apache.activemq:activemq-parent:4.1-SNAPSHOT: checking for updates from apache-m2-snapshot
[INFO] snapshot org.apache.activemq:activemq-parent:4.1-SNAPSHOT: checking for updates from apache.snapshots
[INFO] snapshot org.apache.activemq:activemq-core:4.1-SNAPSHOT: checking for updates from codehaus-snapshot
[INFO] snapshot org.apache.activemq:activemq-core:4.1-SNAPSHOT: checking for updates from apache-m2-snapshot
[INFO] snapshot org.apache.activemq:activemq-core:4.1-SNAPSHOT: checking for updates from apache.snapshots
[WARNING] While downloading xerces:xerces:2.4.0
  This artifact has been relocated to xerces:xercesImpl:2.4.0.


[INFO] snapshot org.apache.geronimo.modules:geronimo-connector:2.0-SNAPSHOT: checking for updates from codehaus-snapshot
[INFO] snapshot org.apache.geronimo.modules:geronimo-connector:2.0-SNAPSHOT: checking for updates from apache-m2-snapshot
[INFO] snapshot org.apache.geronimo.modules:geronimo-connector:2.0-SNAPSHOT: checking for updates from apache.snapshots
Downloading: http://people.apache.org/repo/m2-snapshot-repository/org/apache/geronimo/modules/geronimo-connector/2.0-SNAPSHOT/geronimo-connector-2.0-20070403.214710-14.pom
3K downloaded
[INFO] snapshot org.apache.geronimo.modules:modules:2.0-SNAPSHOT: checking for updates from codehaus-snapshot
[INFO] snapshot org.apache.geronimo.modules:modules:2.0-SNAPSHOT: checking for updates from apache-m2-snapshot
[INFO] snapshot org.apache.geronimo.modules:modules:2.0-SNAPSHOT: checking for updates from apache.snapshots
Downloading: http://people.apache.org/repo/m2-snapshot-repository/org/apache/geronimo/modules/modules/2.0-SNAPSHOT/modules-2.0-20070403.214710-15.pom
5K downloaded
[INFO] snapshot org.apache.geronimo:geronimo:2.0-SNAPSHOT: checking for updates from codehaus-snapshot
[INFO] snapshot org.apache.geronimo:geronimo:2.0-SNAPSHOT: checking for updates from apache-m2-snapshot
[INFO] snapshot org.apache.geronimo:geronimo:2.0-SNAPSHOT: checking for updates from apache.snapshots
Downloading: http://people.apache.org/repo/m2-snapshot-repository/org/apache/geronimo/geronimo/2.0-SNAPSHOT/geronimo-2.0-20070403.214710-17.pom
72K downloaded
[INFO] snapshot org.apache.geronimo.genesis.config:project-config:1.2-SNAPSHOT: checking for updates from apache-snapshots
[INFO] snapshot org.apache.geronimo.genesis.config:project-config:1.2-SNAPSHOT: checking for updates from codehaus-snapshot
[INFO] snapshot org.apache.geronimo.genesis.config:project-config:1.2-SNAPSHOT: checking for updates from apache-m2-snapshot
[INFO] snapshot org.apache.geronimo.genesis.config:project-config:1.2-SNAPSHOT: checking for updates from apache.snapshots
Downloading: http://people.apache.org/repo/m2-snapshot-repository/org/apache/geronimo/genesis/config/project-config/1.2-SNAPSHOT/project-config-1.2-20070402.035602-5.pom
21K downloaded
[INFO] snapshot org.apache.geronimo.genesis.config:config:1.2-SNAPSHOT: checking for updates from apache-snapshots
[INFO] snapshot org.apache.geronimo.genesis.config:config:1.2-SNAPSHOT: checking for updates from codehaus-snapshots
[INFO] snapshot org.apache.geronimo.genesis.config:config:1.2-SNAPSHOT: checking for updates from codehaus-snapshot
[INFO] snapshot org.apache.geronimo.genesis.config:config:1.2-SNAPSHOT: checking for updates from apache-m2-snapshot
[INFO] snapshot org.apache.geronimo.genesis.config:config:1.2-SNAPSHOT: checking for updates from apache.snapshots
Downloading: http://people.apache.org/repo/m2-snapshot-repository/org/apache/geronimo/genesis/config/config/1.2-SNAPSHOT/config-1.2-20070402.035602-5.pom
1K downloaded
[INFO] snapshot org.apache.geronimo.genesis:genesis:1.2-SNAPSHOT: checking for updates from apache-snapshots
[INFO] snapshot org.apache.geronimo.genesis:genesis:1.2-SNAPSHOT: checking for updates from codehaus-snapshots
[INFO] snapshot org.apache.geronimo.genesis:genesis:1.2-SNAPSHOT: checking for updates from codehaus-snapshot
[INFO] snapshot org.apache.geronimo.genesis:genesis:1.2-SNAPSHOT: checking for updates from apache-m2-snapshot
[INFO] snapshot org.apache.geronimo.genesis:genesis:1.2-SNAPSHOT: checking for updates from apache.snapshots
Downloading: http://people.apache.org/repo/m2-snapshot-repository/org/apache/geronimo/genesis/genesis/1.2-SNAPSHOT/genesis-1.2-20070402.035602-5.pom
10K downloaded
[INFO] snapshot org.apache.geronimo.modules:geronimo-transaction:2.0-SNAPSHOT: checking for updates from codehaus-snapshot
[INFO] snapshot org.apache.geronimo.modules:geronimo-transaction:2.0-SNAPSHOT: checking for updates from apache-m2-snapshot
[INFO] snapshot org.apache.geronimo.modules:geronimo-transaction:2.0-SNAPSHOT: checking for updates from apache.snapshots
Downloading: http://people.apache.org/repo/m2-snapshot-repository/org/apache/geronimo/modules/geronimo-transaction/2.0-SNAPSHOT/geronimo-transaction-2.0-20070403.214710-14.pom
2K downloaded
[INFO] snapshot org.apache.geronimo.modules:geronimo-core:2.0-SNAPSHOT: checking for updates from codehaus-snapshot
[INFO] snapshot org.apache.geronimo.modules:geronimo-core:2.0-SNAPSHOT: checking for updates from apache-m2-snapshot
[INFO] snapshot org.apache.geronimo.modules:geronimo-core:2.0-SNAPSHOT: checking for updates from apache.snapshots
Downloading: http://people.apache.org/repo/m2-snapshot-repository/org/apache/geronimo/modules/geronimo-core/2.0-SNAPSHOT/geronimo-core-2.0-20070403.214710-14.pom
1K downloaded
[INFO] snapshot org.apache.geronimo.modules:geronimo-system:2.0-SNAPSHOT: checking for updates from codehaus-snapshot
[INFO] snapshot org.apache.geronimo.modules:geronimo-system:2.0-SNAPSHOT: checking for updates from apache-m2-snapshot
[INFO] snapshot org.apache.geronimo.modules:geronimo-system:2.0-SNAPSHOT: checking for updates from apache.snapshots
Downloading: http://people.apache.org/repo/m2-snapshot-repository/org/apache/geronimo/modules/geronimo-system/2.0-SNAPSHOT/geronimo-system-2.0-20070403.214710-14.pom
4K downloaded
[INFO] snapshot org.apache.geronimo.modules:geronimo-util:2.0-SNAPSHOT: checking for updates from codehaus-snapshot
[INFO] snapshot org.apache.geronimo.modules:geronimo-util:2.0-SNAPSHOT: checking for updates from apache-m2-snapshot
[INFO] snapshot org.apache.geronimo.modules:geronimo-util:2.0-SNAPSHOT: checking for updates from apache.snapshots
Downloading: http://people.apache.org/repo/m2-snapshot-repository/org/apache/geronimo/modules/geronimo-util/2.0-SNAPSHOT/geronimo-util-2.0-20070403.214710-15.pom
1K downloaded
[INFO] snapshot org.apache.geronimo.modules:geronimo-kernel:2.0-SNAPSHOT: checking for updates from codehaus-snapshot
[INFO] snapshot org.apache.geronimo.modules:geronimo-kernel:2.0-SNAPSHOT: checking for updates from apache-m2-snapshot
[INFO] snapshot org.apache.geronimo.modules:geronimo-kernel:2.0-SNAPSHOT: checking for updates from apache.snapshots
Downloading: http://people.apache.org/repo/m2-snapshot-repository/org/apache/geronimo/modules/geronimo-kernel/2.0-SNAPSHOT/geronimo-kernel-2.0-20070403.214710-14.pom
3K downloaded
[INFO] snapshot org.apache.geronimo.modules:geronimo-transaction-jta11:2.0-SNAPSHOT: checking for updates from codehaus-snapshot
[INFO] snapshot org.apache.geronimo.modules:geronimo-transaction-jta11:2.0-SNAPSHOT: checking for updates from apache-m2-snapshot
[INFO] snapshot org.apache.geronimo.modules:geronimo-transaction-jta11:2.0-SNAPSHOT: checking for updates from apache.snapshots
Downloading: http://people.apache.org/repo/m2-snapshot-repository/org/apache/geronimo/modules/geronimo-transaction-jta11/2.0-SNAPSHOT/geronimo-transaction-jta11-2.0-20070403.214710-9.pom
1K downloaded
[INFO] snapshot org.apache.xbean:xbean-reflect:3.0-SNAPSHOT: checking for updates from codehaus-snapshot
[INFO] snapshot org.apache.xbean:xbean-reflect:3.0-SNAPSHOT: checking for updates from apache-m2-snapshot
[INFO] snapshot org.apache.xbean:xbean-reflect:3.0-SNAPSHOT: checking for updates from apache.snapshots
[INFO] snapshot org.apache.xbean:xbean-naming:3.0-SNAPSHOT: checking for updates from codehaus-snapshot
[INFO] snapshot org.apache.xbean:xbean-naming:3.0-SNAPSHOT: checking for updates from apache-m2-snapshot
[INFO] snapshot org.apache.xbean:xbean-naming:3.0-SNAPSHOT: checking for updates from apache.snapshots
[WARNING] 
	Artifact junit:junit:jar:4.1:test retains local scope 'test' overriding broader scope 'compile'
	given by a dependency. If this is not intended, modify or remove the local scope.

[WARNING] 
	Artifact hsqldb:hsqldb:jar:1.8.0.7:test retains local scope 'test' overriding broader scope 'compile'
	given by a dependency. If this is not intended, modify or remove the local scope.

[INFO] snapshot org.apache.openejb:openejb-itests-app:3.0-incubating-SNAPSHOT: checking for updates from codehaus-snapshot
[INFO] snapshot org.apache.openejb:openejb-itests-app:3.0-incubating-SNAPSHOT: checking for updates from apache-m2-snapshot
[INFO] snapshot org.apache.openejb:openejb-itests-app:3.0-incubating-SNAPSHOT: checking for updates from apache.snapshots
Downloading: http://people.apache.org/repo/m2-snapshot-repository/org/apache/openejb/openejb-itests-app/3.0-incubating-SNAPSHOT/openejb-itests-app-3.0-incubating-20070404.125607-110.pom
2K downloaded
[INFO] snapshot org.apache.openejb:itests:3.0-incubating-SNAPSHOT: checking for updates from codehaus-snapshot
[INFO] snapshot org.apache.openejb:itests:3.0-incubating-SNAPSHOT: checking for updates from apache-m2-snapshot
[INFO] snapshot org.apache.openejb:itests:3.0-incubating-SNAPSHOT: checking for updates from apache.snapshots
Downloading: http://people.apache.org/repo/m2-snapshot-repository/org/apache/openejb/itests/3.0-incubating-SNAPSHOT/itests-3.0-incubating-20070404.125607-111.pom
1K downloaded
[INFO] snapshot org.apache.openejb:openejb-itests-beans:3.0-incubating-SNAPSHOT: checking for updates from codehaus-snapshot
[INFO] snapshot org.apache.openejb:openejb-itests-beans:3.0-incubating-SNAPSHOT: checking for updates from apache-m2-snapshot
[INFO] snapshot org.apache.openejb:openejb-itests-beans:3.0-incubating-SNAPSHOT: checking for updates from apache.snapshots
Downloading: http://people.apache.org/repo/m2-snapshot-repository/org/apache/openejb/openejb-itests-beans/3.0-incubating-SNAPSHOT/openejb-itests-beans-3.0-incubating-20070404.125607-111.pom
1K downloaded
[INFO] snapshot org.apache.openejb:openejb-itests-client:3.0-incubating-SNAPSHOT: checking for updates from codehaus-snapshot
[INFO] snapshot org.apache.openejb:openejb-itests-client:3.0-incubating-SNAPSHOT: checking for updates from apache-m2-snapshot
[INFO] snapshot org.apache.openejb:openejb-itests-client:3.0-incubating-SNAPSHOT: checking for updates from apache.snapshots
Downloading: http://people.apache.org/repo/m2-snapshot-repository/org/apache/openejb/openejb-itests-client/3.0-incubating-SNAPSHOT/openejb-itests-client-3.0-incubating-20070404.125607-110.pom
1K downloaded
[WARNING] 
	Artifact commons-collections:commons-collections:jar:3.1:test retains local scope 'test' overriding broader scope 'compile'
	given by a dependency. If this is not intended, modify or remove the local scope.

[INFO] snapshot org.apache.axis2:axis2-jaxws-api:SNAPSHOT: checking for updates from codehaus-snapshot
[INFO] snapshot org.apache.axis2:axis2-jaxws-api:SNAPSHOT: checking for updates from apache-m2-snapshot
[INFO] snapshot org.apache.axis2:axis2-jaxws-api:SNAPSHOT: checking for updates from apache.snapshots
Downloading: http://people.apache.org/repo/m2-snapshot-repository/org/apache/axis2/axis2-jaxws-api/SNAPSHOT/axis2-jaxws-api-20070404.051519-109.pom
1K downloaded
[INFO] snapshot org.apache.axis2:axis2-parent:SNAPSHOT: checking for updates from codehaus-snapshot
[INFO] snapshot org.apache.axis2:axis2-parent:SNAPSHOT: checking for updates from apache-m2-snapshot
[INFO] snapshot org.apache.axis2:axis2-parent:SNAPSHOT: checking for updates from apache.snapshots
Downloading: http://people.apache.org/repo/m2-snapshot-repository/org/apache/axis2/axis2-parent/SNAPSHOT/axis2-parent-20070404.093953-162.pom
25K downloaded
[INFO] snapshot org.apache.axis2:axis2-saaj-api:SNAPSHOT: checking for updates from codehaus-snapshot
[INFO] snapshot org.apache.axis2:axis2-saaj-api:SNAPSHOT: checking for updates from apache-m2-snapshot
[INFO] snapshot org.apache.axis2:axis2-saaj-api:SNAPSHOT: checking for updates from apache.snapshots
Downloading: http://people.apache.org/repo/m2-snapshot-repository/org/apache/axis2/axis2-saaj-api/SNAPSHOT/axis2-saaj-api-20070404.051519-112.pom
1K downloaded
[INFO] snapshot org.apache.geronimo.specs:geronimo-javamail_1.4_spec:1.0-SNAPSHOT: checking for updates from codehaus-snapshot
[INFO] snapshot org.apache.geronimo.specs:geronimo-javamail_1.4_spec:1.0-SNAPSHOT: checking for updates from apache-m2-snapshot
[INFO] snapshot org.apache.geronimo.specs:geronimo-javamail_1.4_spec:1.0-SNAPSHOT: checking for updates from apache.snapshots
[INFO] snapshot org.apache.geronimo.specs:geronimo-activation_1.1_spec:1.0-SNAPSHOT: checking for updates from codehaus-snapshot
[INFO] snapshot org.apache.geronimo.specs:geronimo-activation_1.1_spec:1.0-SNAPSHOT: checking for updates from apache-m2-snapshot
[INFO] snapshot org.apache.geronimo.specs:geronimo-activation_1.1_spec:1.0-SNAPSHOT: checking for updates from apache.snapshots
Downloading: http://people.apache.org/repo/m2-snapshot-repository/org/apache/geronimo/modules/geronimo-transaction/2.0-SNAPSHOT/geronimo-transaction-2.0-20070403.214710-14.jar
56K downloaded
Downloading: http://people.apache.org/repo/m2-snapshot-repository/org/apache/axis2/axis2-saaj-api/SNAPSHOT/axis2-saaj-api-20070404.051519-112.jar
25K downloaded
Downloading: http://people.apache.org/repo/m2-snapshot-repository/org/apache/axis2/axis2-jaxws-api/SNAPSHOT/axis2-jaxws-api-20070404.051519-109.jar
37K downloaded
Downloading: http://people.apache.org/repo/m2-snapshot-repository/org/apache/openejb/openejb-loader/3.0-incubating-SNAPSHOT/openejb-loader-3.0-incubating-20070404.125607-110.jar
27K downloaded
Downloading: http://people.apache.org/repo/m2-snapshot-repository/org/apache/geronimo/modules/geronimo-connector/2.0-SNAPSHOT/geronimo-connector-2.0-20070403.214710-14.jar
137K downloaded
Downloading: http://people.apache.org/repo/m2-snapshot-repository/org/apache/geronimo/modules/geronimo-transaction-jta11/2.0-SNAPSHOT/geronimo-transaction-jta11-2.0-20070403.214710-9.jar
7K downloaded
Downloading: http://people.apache.org/repo/m2-snapshot-repository/org/apache/openejb/openejb-jee/3.0-incubating-SNAPSHOT/openejb-jee-3.0-incubating-20070404.125607-107.jar
568K downloaded
[INFO] [compiler:compile]
Compiling 6 source files to /x1/continuum/working-directory/158/target/classes
Downloading: http://snapshots.repository.codehaus.org/org/apache/geronimo/modules/geronimo-connector/2.0-SNAPSHOT/geronimo-connector-2.0-20070403.214710-14.pom
[WARNING] Unable to get resource 'org.apache.geronimo.modules:geronimo-connector:pom:2.0-SNAPSHOT' from repository codehaus-snapshot (http://snapshots.repository.codehaus.org)
Downloading: http://people.apache.org/repo/m2-snapshot-repository/org/apache/geronimo/modules/geronimo-connector/2.0-SNAPSHOT/geronimo-connector-2.0-20070403.214710-14.pom
3K downloaded
Downloading: http://snapshots.repository.codehaus.org/org/apache/geronimo/modules/geronimo-transaction/2.0-SNAPSHOT/geronimo-transaction-2.0-20070403.214710-14.pom
[WARNING] Unable to get resource 'org.apache.geronimo.modules:geronimo-transaction:pom:2.0-SNAPSHOT' from repository codehaus-snapshot (http://snapshots.repository.codehaus.org)
Downloading: http://people.apache.org/repo/m2-snapshot-repository/org/apache/geronimo/modules/geronimo-transaction/2.0-SNAPSHOT/geronimo-transaction-2.0-20070403.214710-14.pom
2K downloaded
Downloading: http://snapshots.repository.codehaus.org/org/apache/geronimo/modules/geronimo-transaction-jta11/2.0-SNAPSHOT/geronimo-transaction-jta11-2.0-20070403.214710-9.pom
[WARNING] Unable to get resource 'org.apache.geronimo.modules:geronimo-transaction-jta11:pom:2.0-SNAPSHOT' from repository codehaus-snapshot (http://snapshots.repository.codehaus.org)
Downloading: http://people.apache.org/repo/m2-snapshot-repository/org/apache/geronimo/modules/geronimo-transaction-jta11/2.0-SNAPSHOT/geronimo-transaction-jta11-2.0-20070403.214710-9.pom
1K downloaded
Downloading: http://people.apache.org/repo/m2-snapshot-repository/org/apache/openejb/openejb-itests-beans/3.0-incubating-SNAPSHOT/openejb-itests-beans-3.0-incubating-20070404.125607-111.jar
272K downloaded
Downloading: http://people.apache.org/repo/m2-snapshot-repository/org/apache/openejb/openejb-itests-client/3.0-incubating-SNAPSHOT/openejb-itests-client-3.0-incubating-20070404.125607-110.jar
410K downloaded
Downloading: http://people.apache.org/repo/m2-snapshot-repository/org/apache/openejb/openejb-itests-app/3.0-incubating-SNAPSHOT/openejb-itests-app-3.0-incubating-20070404.125607-110.jar
8907K downloaded
[INFO] [antrun:run {execution: default}]
[INFO] Executing tasks
[INFO] Executed tasks
[INFO] [resources:testResources]
[INFO] Using default encoding to copy filtered resources.
[INFO] [compiler:testCompile]
[INFO] Nothing to compile - all classes are up to date
[INFO] [surefire:test]
[INFO] Surefire report directory: /x1/continuum/working-directory/158/target/surefire-reports

-------------------------------------------------------
 T E S T S
-------------------------------------------------------
Running org.apache.openejb.config.OpenEjb2CmpConversionTest
log4j:WARN No appenders could be found for logger (OpenEJB).
log4j:WARN Please initialize the log4j system properly.
Tests run: 9, Failures: 0, Errors: 0, Skipped: 0, Time elapsed: 10.188 sec
Running org.apache.openejb.core.stateless.StatelessInterceptorTest
log4j:WARN No appenders could be found for logger (OpenEJB.startup.config).
log4j:WARN Please initialize the log4j system properly.
Tests run: 1, Failures: 0, Errors: 0, Skipped: 0, Time elapsed: 5.123 sec
Running org.apache.openejb.core.mdb.MdbTest
log4j:WARN No appenders could be found for logger (org.apache.activemq.broker.BrokerService).
log4j:WARN Please initialize the log4j system properly.
Tests run: 1, Failures: 0, Errors: 0, Skipped: 0, Time elapsed: 11.828 sec
Running org.apache.openejb.core.stateful.StatefulInterceptorTest
log4j:WARN No appenders could be found for logger (OpenEJB.startup.config).
log4j:WARN Please initialize the log4j system properly.
Tests run: 1, Failures: 0, Errors: 0, Skipped: 0, Time elapsed: 4.391 sec
Running org.apache.openejb.config.ConfigureServiceTest
log4j:WARN No appenders could be found for logger (OpenEJB.startup.config).
log4j:WARN Please initialize the log4j system properly.
Tests run: 4, Failures: 0, Errors: 0, Skipped: 0, Time elapsed: 1.378 sec
Running org.apache.openejb.core.mdb.SimpleJmsTest
log4j:WARN No appenders could be found for logger (org.apache.activemq.broker.BrokerService).
log4j:WARN Please initialize the log4j system properly.
Tests run: 1, Failures: 0, Errors: 0, Skipped: 0, Time elapsed: 11.015 sec
Running org.apache.openejb.config.SunQueryFilterTest
Tests run: 5, Failures: 0, Errors: 0, Skipped: 0, Time elapsed: 0.136 sec
Running org.apache.openejb.config.SunCmpConversionTest
log4j:WARN No appenders could be found for logger (OpenEJB).
log4j:WARN Please initialize the log4j system properly.
Tests run: 8, Failures: 0, Errors: 0, Skipped: 0, Time elapsed: 10.981 sec
Running org.apache.openejb.core.stateful.Compat3to2Test
log4j:WARN No appenders could be found for logger (OpenEJB.startup.config).
log4j:WARN Please initialize the log4j system properly.
Tests run: 1, Failures: 0, Errors: 0, Skipped: 0, Time elapsed: 4.436 sec
Running org.apache.openejb.ApplicationTest
test server = org.apache.openejb.test.IvmTestServer
entry = java.naming.factory.initial:org.apache.openejb.client.LocalInitialContextFactory
WARN - Unable use logging config as there are 3 file references containing directories which have not been created.  See the list below.
WARN - [0] /x1/continuum/working-directory/158/target/test-classes/conf/logs/transaction.log
WARN - [1] /x1/continuum/working-directory/158/target/test-classes/conf/logs/openejb.log
WARN - [2] /x1/continuum/working-directory/158/target/test-classes/conf/logs/server.log
Apache OpenEJB 3.0-incubating-SNAPSHOT    build: 20070404-06:03
http://incubator.apache.org/openejb
INFO - openejb.home = /x1/continuum/working-directory/158/target/test-classes
INFO - openejb.base = /x1/continuum/working-directory/158/target/test-classes
INFO - Found AppModule in classpath: /home/continuum/.m2/repository/org/apache/openejb/openejb-itests-app/3.0-incubating-SNAPSHOT/openejb-itests-app-3.0-incubating-SNAPSHOT.jar
WARN - Auto-linking res-ref-name 'org.apache.openejb.test.stateful.AnnotatedFieldInjectionStatefulBean/daataSource' in bean AnnotatedFieldInjectionStatefulBean to Connector(id=Default JDBC Database)
WARN - Auto-creating a connector with id 'Default JMS Connection Factory' of type 'javax.jms.ConnectionFactory for 'AnnotatedFieldInjectionStatefulBean'.  THERE IS LITTLE CHANCE THIS WILL WORK!
WARN - Auto-linking res-ref-name 'org.apache.openejb.test.stateful.AnnotatedFieldInjectionStatefulBean/coonnectionFactory' in bean AnnotatedFieldInjectionStatefulBean to Connector(id=Default JMS Connection Factory)
WARN - Auto-linking res-ref-name 'org.apache.openejb.test.stateful.AnnotatedFieldInjectionStatefulBean/queueCoonnectionFactory' in bean AnnotatedFieldInjectionStatefulBean to Connector(id=Default JMS Connection Factory)
WARN - Auto-linking res-ref-name 'org.apache.openejb.test.stateful.AnnotatedFieldInjectionStatefulBean/topicCoonnectionFactory' in bean AnnotatedFieldInjectionStatefulBean to Connector(id=Default JMS Connection Factory)
WARN - Auto-linking res-ref-name 'org.apache.openejb.test.stateless.AnnotatedFieldInjectionStatelessBean/daataSource' in bean AnnotatedFieldInjectionStatelessBean to Connector(id=Default JDBC Database)
WARN - Auto-linking res-ref-name 'org.apache.openejb.test.stateless.AnnotatedFieldInjectionStatelessBean/coonnectionFactory' in bean AnnotatedFieldInjectionStatelessBean to Connector(id=Default JMS Connection Factory)
WARN - Auto-linking res-ref-name 'org.apache.openejb.test.stateless.AnnotatedFieldInjectionStatelessBean/queueCoonnectionFactory' in bean AnnotatedFieldInjectionStatelessBean to Connector(id=Default JMS Connection Factory)
WARN - Auto-linking res-ref-name 'org.apache.openejb.test.stateless.AnnotatedFieldInjectionStatelessBean/topicCoonnectionFactory' in bean AnnotatedFieldInjectionStatelessBean to Connector(id=Default JMS Connection Factory)
log4j:WARN No appenders could be found for logger (org.apache.activemq.broker.BrokerService).
log4j:WARN Please initialize the log4j system properly.
ERROR - FATAL ERROR: Unknown error in Assembler.  Please send the following stack trace and this message to user@openejb.org :
 org.apache.xbean.recipe.MissingAccessorException: Unable to find a valid setter method: public void org.apache.openejb.core.mdb.MdbContainer.setServerUrl(java.lang.String)
	at org.apache.xbean.recipe.ObjectRecipe.findSetter(ObjectRecipe.java:692)
	at org.apache.xbean.recipe.ObjectRecipe.setProperty(ObjectRecipe.java:275)
	at org.apache.xbean.recipe.ObjectRecipe.setProperties(ObjectRecipe.java:251)
	at org.apache.xbean.recipe.ObjectRecipe.create(ObjectRecipe.java:198)
	at org.apache.xbean.recipe.AbstractRecipe.create(AbstractRecipe.java:28)
	at org.apache.openejb.assembler.classic.Assembler.createContainer(Assembler.java:603)
	at org.apache.openejb.assembler.classic.Assembler.buildContainerSystem(Assembler.java:293)
	at org.apache.openejb.assembler.classic.Assembler.build(Assembler.java:201)
	at org.apache.openejb.OpenEJB$Instance.<init>(OpenEJB.java:147)
	at org.apache.openejb.OpenEJB.init(OpenEJB.java:280)
	at org.apache.openejb.OpenEJB.init(OpenEJB.java:265)
	at sun.reflect.NativeMethodAccessorImpl.invoke0(Native Method)
	at sun.reflect.NativeMethodAccessorImpl.invoke(NativeMethodAccessorImpl.java:39)
	at sun.reflect.DelegatingMethodAccessorImpl.invoke(DelegatingMethodAccessorImpl.java:25)
	at java.lang.reflect.Method.invoke(Method.java:585)
	at org.apache.openejb.loader.OpenEJBInstance.init(OpenEJBInstance.java:36)
	at org.apache.openejb.client.LocalInitialContextFactory.init(LocalInitialContextFactory.java:56)
	at org.apache.openejb.client.LocalInitialContextFactory.getInitialContext(LocalInitialContextFactory.java:42)
	at javax.naming.spi.NamingManager.getInitialContext(NamingManager.java:667)
	at javax.naming.InitialContext.getDefaultInitCtx(InitialContext.java:247)
	at javax.naming.InitialContext.init(InitialContext.java:223)
	at javax.naming.InitialContext.<init>(InitialContext.java:197)
	at org.apache.openejb.test.HsqldbTestDatabase.start(HsqldbTestDatabase.java:180)
	at org.apache.openejb.test.TestManager.start(TestManager.java:79)
	at org.apache.openejb.iTest.setUp(iTest.java:57)
	at org.apache.openejb.test.TestSuite.run(TestSuite.java:41)
	at sun.reflect.NativeMethodAccessorImpl.invoke0(Native Method)
	at sun.reflect.NativeMethodAccessorImpl.invoke(NativeMethodAccessorImpl.java:39)
	at sun.reflect.DelegatingMethodAccessorImpl.invoke(DelegatingMethodAccessorImpl.java:25)
	at java.lang.reflect.Method.invoke(Method.java:585)
	at org.apache.maven.surefire.junit.JUnitTestSet.execute(JUnitTestSet.java:210)
	at org.apache.maven.surefire.suite.AbstractDirectoryTestSuite.executeTestSet(AbstractDirectoryTestSuite.java:135)
	at org.apache.maven.surefire.suite.AbstractDirectoryTestSuite.execute(AbstractDirectoryTestSuite.java:160)
	at org.apache.maven.surefire.Surefire.run(Surefire.java:81)
	at sun.reflect.NativeMethodAccessorImpl.invoke0(Native Method)
	at sun.reflect.NativeMethodAccessorImpl.invoke(NativeMethodAccessorImpl.java:39)
	at sun.reflect.DelegatingMethodAccessorImpl.invoke(DelegatingMethodAccessorImpl.java:25)
	at java.lang.reflect.Method.invoke(Method.java:585)
	at org.apache.maven.surefire.booter.SurefireBooter.runSuitesInProcess(SurefireBooter.java:182)
	at org.apache.maven.surefire.booter.SurefireBooter.main(SurefireBooter.java:743)

FATAL - OpenEJB has encountered a fatal error and cannot be started: Assembler failed to build the container system.
org.apache.openejb.OpenEJBException: org.apache.xbean.recipe.MissingAccessorException: Unable to find a valid setter method: public void org.apache.openejb.core.mdb.MdbContainer.setServerUrl(java.lang.String): Unable to find a valid setter method: public void org.apache.openejb.core.mdb.MdbContainer.setServerUrl(java.lang.String)
	at org.apache.openejb.assembler.classic.Assembler.build(Assembler.java:214)
	at org.apache.openejb.OpenEJB$Instance.<init>(OpenEJB.java:147)
	at org.apache.openejb.OpenEJB.init(OpenEJB.java:280)
	at org.apache.openejb.OpenEJB.init(OpenEJB.java:265)
	at sun.reflect.NativeMethodAccessorImpl.invoke0(Native Method)
	at sun.reflect.NativeMethodAccessorImpl.invoke(NativeMethodAccessorImpl.java:39)
	at sun.reflect.DelegatingMethodAccessorImpl.invoke(DelegatingMethodAccessorImpl.java:25)
	at java.lang.reflect.Method.invoke(Method.java:585)
	at org.apache.openejb.loader.OpenEJBInstance.init(OpenEJBInstance.java:36)
	at org.apache.openejb.client.LocalInitialContextFactory.init(LocalInitialContextFactory.java:56)
	at org.apache.openejb.client.LocalInitialContextFactory.getInitialContext(LocalInitialContextFactory.java:42)
	at javax.naming.spi.NamingManager.getInitialContext(NamingManager.java:667)
	at javax.naming.InitialContext.getDefaultInitCtx(InitialContext.java:247)
	at javax.naming.InitialContext.init(InitialContext.java:223)
	at javax.naming.InitialContext.<init>(InitialContext.java:197)
	at org.apache.openejb.test.HsqldbTestDatabase.start(HsqldbTestDatabase.java:180)
	at org.apache.openejb.test.TestManager.start(TestManager.java:79)
	at org.apache.openejb.iTest.setUp(iTest.java:57)
	at org.apache.openejb.test.TestSuite.run(TestSuite.java:41)
	at sun.reflect.NativeMethodAccessorImpl.invoke0(Native Method)
	at sun.reflect.NativeMethodAccessorImpl.invoke(NativeMethodAccessorImpl.java:39)
	at sun.reflect.DelegatingMethodAccessorImpl.invoke(DelegatingMethodAccessorImpl.java:25)
	at java.lang.reflect.Method.invoke(Method.java:585)
	at org.apache.maven.surefire.junit.JUnitTestSet.execute(JUnitTestSet.java:210)
	at org.apache.maven.surefire.suite.AbstractDirectoryTestSuite.executeTestSet(AbstractDirectoryTestSuite.java:135)
	at org.apache.maven.surefire.suite.AbstractDirectoryTestSuite.execute(AbstractDirectoryTestSuite.java:160)
	at org.apache.maven.surefire.Surefire.run(Surefire.java:81)
	at sun.reflect.NativeMethodAccessorImpl.invoke0(Native Method)
	at sun.reflect.NativeMethodAccessorImpl.invoke(NativeMethodAccessorImpl.java:39)
	at sun.reflect.DelegatingMethodAccessorImpl.invoke(DelegatingMethodAccessorImpl.java:25)
	at java.lang.reflect.Method.invoke(Method.java:585)
	at org.apache.maven.surefire.booter.SurefireBooter.runSuitesInProcess(SurefireBooter.java:182)
	at org.apache.maven.surefire.booter.SurefireBooter.main(SurefireBooter.java:743)
Caused by: org.apache.xbean.recipe.MissingAccessorException: Unable to find a valid setter method: public void org.apache.openejb.core.mdb.MdbContainer.setServerUrl(java.lang.String)
	at org.apache.xbean.recipe.ObjectRecipe.findSetter(ObjectRecipe.java:692)
	at org.apache.xbean.recipe.ObjectRecipe.setProperty(ObjectRecipe.java:275)
	at org.apache.xbean.recipe.ObjectRecipe.setProperties(ObjectRecipe.java:251)
	at org.apache.xbean.recipe.ObjectRecipe.create(ObjectRecipe.java:198)
	at org.apache.xbean.recipe.AbstractRecipe.create(AbstractRecipe.java:28)
	at org.apache.openejb.assembler.classic.Assembler.createContainer(Assembler.java:603)
	at org.apache.openejb.assembler.classic.Assembler.buildContainerSystem(Assembler.java:293)
	at org.apache.openejb.assembler.classic.Assembler.build(Assembler.java:201)
	... 32 more
Tests run: 1, Failures: 0, Errors: 1, Skipped: 0, Time elapsed: 15.88 sec <<< FAILURE!
Running org.apache.openejb.core.mdb.JmsProxyTest
log4j:WARN No appenders could be found for logger (org.apache.activemq.broker.BrokerService).
log4j:WARN Please initialize the log4j system properly.
Tests run: 1, Failures: 0, Errors: 0, Skipped: 0, Time elapsed: 10.903 sec
Running org.apache.openejb.assembler.classic.JdbcConfigTest
log4j:WARN No appenders could be found for logger (OpenEJB.startup.config).
log4j:WARN Please initialize the log4j system properly.
Tests run: 1, Failures: 0, Errors: 0, Skipped: 0, Time elapsed: 2.395 sec
Running org.apache.openejb.util.ClassesTest
Tests run: 1, Failures: 0, Errors: 0, Skipped: 0, Time elapsed: 0.06 sec
Running org.apache.openejb.core.ivm.naming.IvmContextTest
Tests run: 1, Failures: 0, Errors: 0, Skipped: 0, Time elapsed: 0.096 sec
Running org.apache.openejb.config.JaxbUnmarshallerTest
Tests run: 1, Failures: 0, Errors: 0, Skipped: 0, Time elapsed: 1.841 sec
Running org.apache.openejb.core.stateful.StatefulContainerTest
log4j:WARN No appenders could be found for logger (OpenEJB.startup.config).
log4j:WARN Please initialize the log4j system properly.
Tests run: 2, Failures: 0, Errors: 0, Skipped: 0, Time elapsed: 5.271 sec
Running org.apache.openejb.core.cmp.jpa.JpaTest
Tests run: 2, Failures: 0, Errors: 0, Skipped: 0, Time elapsed: 8.177 sec
Running org.apache.openejb.DependenceValidationTest
Tests run: 1, Failures: 0, Errors: 0, Skipped: 0, Time elapsed: 1.433 sec
Running org.apache.openejb.core.stateful.StatefulSessionBeanTest
log4j:WARN No appenders could be found for logger (OpenEJB.startup.config).
log4j:WARN Please initialize the log4j system properly.
Tests run: 1, Failures: 0, Errors: 0, Skipped: 0, Time elapsed: 4.592 sec
Running org.apache.openejb.core.stateless.CrossClassLoaderProxyTest
log4j:WARN No appenders could be found for logger (OpenEJB).
log4j:WARN Please initialize the log4j system properly.
Tests run: 4, Failures: 0, Errors: 0, Skipped: 0, Time elapsed: 1.09 sec
Running org.apache.openejb.core.stateless.ExtendedInjectionTest
log4j:WARN No appenders could be found for logger (OpenEJB).
log4j:WARN Please initialize the log4j system properly.
Tests run: 2, Failures: 0, Errors: 0, Skipped: 0, Time elapsed: 1.062 sec
Running org.apache.openejb.assembler.classic.RedeployTest
log4j:WARN No appenders could be found for logger (OpenEJB.startup.config).
log4j:WARN Please initialize the log4j system properly.
236  INFO   [main] openjpa.MetaData - Found 36 classes with metadata in 86 milliseconds.
92  INFO   [main] openjpa.MetaData - Found 1 classes with metadata in 82 milliseconds.
800  INFO   [main] openjpa.MetaData - Parsing resource "jar:file:/home/continuum/.m2/repository/org/apache/openejb/openejb-itests-beans/3.0-incubating-SNAPSHOT/openejb-itests-beans-3.0-incubating-SNAPSHOT.jar!/META-INF/jpa.mapping.xml".
1332  INFO   [main] openjpa.MetaData - Parsing class "org.apache.openejb.test.entity.cmp2.Employee".
1366  INFO   [main] openjpa.MetaData - Parsing class "org.apache.openejb.test.entity.cmp2.Employee".
1367  INFO   [main] openjpa.MetaData - Parsing package "org.apache.openejb.test.entity.cmp2.Employee".
1391  INFO   [main] openjpa.MetaData - Parsing resource "jar:file:/tmp/OpenEJB_Generated_47384.jar!/META-INF/openejb-cmp-generated-orm.xml".
1480  INFO   [main] openjpa.MetaData - Parsing class "org.apache.openejb.test.entity.cmp.BasicCmpBean".
1485  INFO   [main] openjpa.MetaData - Parsing class "org.apache.openejb.test.entity.cmp.BasicCmpBean".
1485  INFO   [main] openjpa.MetaData - Parsing package "org.apache.openejb.test.entity.cmp.BasicCmpBean".
1490  INFO   [main] openjpa.MetaData - Parsing class "org.apache.openejb.test.entity.cmp.ComplexCmpBean".
1492  INFO   [main] openjpa.MetaData - Parsing class "org.apache.openejb.test.entity.cmp.ComplexCmpBean".
1498  INFO   [main] openjpa.MetaData - Parsing class "org.apache.openejb.test.entity.cmp.UnknownCmpBean".
1499  INFO   [main] openjpa.MetaData - Parsing class "org.apache.openejb.test.entity.cmp.UnknownCmpBean".
1503  INFO   [main] openjpa.MetaData - Parsing class "org.apache.openejb.test.entity.cmp.AllowedOperationsCmpBean".
1504  INFO   [main] openjpa.MetaData - Parsing class "org.apache.openejb.test.entity.cmp.AllowedOperationsCmpBean".
1511  INFO   [main] openjpa.MetaData - Parsing class "org.apache.openejb.test.entity.cmp.EncCmpBean".
1518  INFO   [main] openjpa.MetaData - Parsing class "org.apache.openejb.test.entity.cmp.EncCmpBean".
1522  INFO   [main] openjpa.MetaData - Parsing class "org.apache.openejb.test.entity.cmp.ContextLookupCmpBean".
1544  INFO   [main] openjpa.MetaData - Parsing class "org.apache.openejb.test.entity.cmp.ContextLookupCmpBean".
1549  INFO   [main] openjpa.MetaData - Parsing class "org.apache.openejb.test.entity.cmp.RmiIiopCmpBean".
1553  INFO   [main] openjpa.MetaData - Parsing class "org.apache.openejb.test.entity.cmp.RmiIiopCmpBean".
1558  INFO   [main] openjpa.MetaData - Parsing class "openejb.org.apache.openejb.test.entity.cmp.BasicCmpBeanX".
1559  INFO   [main] openjpa.MetaData - Parsing class "openejb.org.apache.openejb.test.entity.cmp.BasicCmpBeanX".
1559  INFO   [main] openjpa.MetaData - Parsing package "openejb.org.apache.openejb.test.entity.cmp.BasicCmpBeanX".
1561  INFO   [main] openjpa.MetaData - Parsing query "BasicCmpBeanX.findByLastName(java.lang.String)".
1563  INFO   [main] openjpa.MetaData - Parsing query "BasicCmpBeanX.findEmptyCollection".
1571  INFO   [main] openjpa.MetaData - Parsing class "openejb.org.apache.openejb.test.entity.cmp.ComplexCmpBeanX".
1571  INFO   [main] openjpa.MetaData - Parsing class "openejb.org.apache.openejb.test.entity.cmp.ComplexCmpBeanX".
1572  INFO   [main] openjpa.MetaData - Parsing query "ComplexCmpBeanX.findByLastName(java.lang.String)".
1573  INFO   [main] openjpa.MetaData - Parsing query "ComplexCmpBeanX.findEmptyCollection".
1576  INFO   [main] openjpa.MetaData - Parsing class "openejb.org.apache.openejb.test.entity.cmp.UnknownCmpBeanX".
1577  INFO   [main] openjpa.MetaData - Parsing class "openejb.org.apache.openejb.test.entity.cmp.UnknownCmpBeanX".
1577  INFO   [main] openjpa.MetaData - Parsing query "UnknownCmpBeanX.findByLastName(java.lang.String)".
1578  INFO   [main] openjpa.MetaData - Parsing query "UnknownCmpBeanX.findEmptyCollection".
1587  INFO   [main] openjpa.MetaData - Parsing class "openejb.org.apache.openejb.test.entity.cmp.BasicCmp2Bean".
1589  INFO   [main] openjpa.MetaData - Parsing class "openejb.org.apache.openejb.test.entity.cmp.BasicCmp2Bean".
1590  INFO   [main] openjpa.MetaData - Parsing query "BasicCmp2Bean.findByLastName(java.lang.String)".
1590  INFO   [main] openjpa.MetaData - Parsing query "BasicCmp2Bean.findEmptyCollection".
1601  INFO   [main] openjpa.MetaData - Parsing class "openejb.org.apache.openejb.test.entity.cmp.ComplexCmp2Bean".
1603  INFO   [main] openjpa.MetaData - Parsing class "openejb.org.apache.openejb.test.entity.cmp.ComplexCmp2Bean".
1604  INFO   [main] openjpa.MetaData - Parsing query "ComplexCmp2Bean.findByLastName(java.lang.String)".
1604  INFO   [main] openjpa.MetaData - Parsing query "ComplexCmp2Bean.findEmptyCollection".
1612  INFO   [main] openjpa.MetaData - Parsing class "openejb.org.apache.openejb.test.entity.cmp.UnknownCmp2Bean".
1614  INFO   [main] openjpa.MetaData - Parsing class "openejb.org.apache.openejb.test.entity.cmp.UnknownCmp2Bean".
1614  INFO   [main] openjpa.MetaData - Parsing query "UnknownCmp2Bean.findByLastName(java.lang.String)".
1614  INFO   [main] openjpa.MetaData - Parsing query "UnknownCmp2Bean.findEmptyCollection".
1619  INFO   [main] openjpa.MetaData - Parsing class "openejb.org.apache.openejb.test.entity.cmp.AOBasicCmpBean".
1620  INFO   [main] openjpa.MetaData - Parsing class "openejb.org.apache.openejb.test.entity.cmp.AOBasicCmpBean".
1620  INFO   [main] openjpa.MetaData - Parsing query "AOBasicCmpBean.findByLastName(java.lang.String)".
1621  INFO   [main] openjpa.MetaData - Parsing query "AOBasicCmpBean.findEmptyCollection".
1630  INFO   [main] openjpa.MetaData - Parsing class "openejb.org.apache.openejb.test.entity.cmp.AllowedOperationsCmp2Bean".
1632  INFO   [main] openjpa.MetaData - Parsing class "openejb.org.apache.openejb.test.entity.cmp.AllowedOperationsCmp2Bean".
1633  INFO   [main] openjpa.MetaData - Parsing query "AllowedOperationsCmp2Bean.findByLastName(java.lang.String)".
1634  INFO   [main] openjpa.MetaData - Parsing query "AllowedOperationsCmp2Bean.findEmptyCollection".
1637  INFO   [main] openjpa.MetaData - Parsing class "openejb.org.apache.openejb.test.entity.cmp.EncCmpBean".
1637  INFO   [main] openjpa.MetaData - Parsing class "openejb.org.apache.openejb.test.entity.cmp.EncCmpBean".
1643  INFO   [main] openjpa.MetaData - Parsing class "openejb.org.apache.openejb.test.entity.cmp.EncCmp2Bean".
1647  INFO   [main] openjpa.MetaData - Parsing class "openejb.org.apache.openejb.test.entity.cmp.EncCmp2Bean".
1649  INFO   [main] openjpa.MetaData - Parsing class "openejb.org.apache.openejb.test.entity.cmp.ContextLookupCmpBean".
1650  INFO   [main] openjpa.MetaData - Parsing class "openejb.org.apache.openejb.test.entity.cmp.ContextLookupCmpBean".
1656  INFO   [main] openjpa.MetaData - Parsing class "openejb.org.apache.openejb.test.entity.cmp.Cmp_RMI_IIOP_Bean".
1657  INFO   [main] openjpa.MetaData - Parsing class "openejb.org.apache.openejb.test.entity.cmp.Cmp_RMI_IIOP_Bean".
1662  INFO   [main] openjpa.MetaData - Parsing class "openejb.org.apache.openejb.test.entity.cmp.Cmp2_RMI_IIOP_Bean".
1665  INFO   [main] openjpa.MetaData - Parsing class "openejb.org.apache.openejb.test.entity.cmp.Cmp2_RMI_IIOP_Bean".
1672  INFO   [main] openjpa.MetaData - Parsing class "openejb.org.apache.openejb.test.entity.cmr.onetoone.Person".
1683  INFO   [main] openjpa.MetaData - Parsing class "openejb.org.apache.openejb.test.entity.cmr.onetoone.Person".
1683  INFO   [main] openjpa.MetaData - Parsing package "openejb.org.apache.openejb.test.entity.cmr.onetoone.Person".
1685  INFO   [main] openjpa.MetaData - Parsing query "Person.findByPrimaryKey(org.apache.openejb.test.entity.cmr.onetoone.PersonPk)".
1687  INFO   [main] openjpa.MetaData - Parsing class "openejb.org.apache.openejb.test.entity.cmr.onetoone.License".
1696  INFO   [main] openjpa.MetaData - Parsing class "openejb.org.apache.openejb.test.entity.cmr.onetoone.License".
1696  INFO   [main] openjpa.MetaData - Parsing query "License.findByPrimaryKey(org.apache.openejb.test.entity.cmr.onetoone.LicensePk)".
1704  INFO   [main] openjpa.MetaData - Parsing class "openejb.org.apache.openejb.test.entity.cmr.onetomany.Artist".
1709  INFO   [main] openjpa.MetaData - Parsing class "openejb.org.apache.openejb.test.entity.cmr.onetomany.Artist".
1710  INFO   [main] openjpa.MetaData - Parsing package "openejb.org.apache.openejb.test.entity.cmr.onetomany.Artist".
1711  INFO   [main] openjpa.MetaData - Parsing query "Artist.findByPrimaryKey(org.apache.openejb.test.entity.cmr.onetomany.ArtistPk)".
1717  INFO   [main] openjpa.MetaData - Parsing class "openejb.org.apache.openejb.test.entity.cmr.onetomany.Song".
1721  INFO   [main] openjpa.MetaData - Parsing class "openejb.org.apache.openejb.test.entity.cmr.onetomany.Song".
1722  INFO   [main] openjpa.MetaData - Parsing query "Song.findByPrimaryKey(org.apache.openejb.test.entity.cmr.onetomany.SongPk)".
1727  INFO   [main] openjpa.MetaData - Parsing class "openejb.org.apache.openejb.test.entity.cmr.manytomany.Game".
1731  INFO   [main] openjpa.MetaData - Parsing class "openejb.org.apache.openejb.test.entity.cmr.manytomany.Game".
1731  INFO   [main] openjpa.MetaData - Parsing package "openejb.org.apache.openejb.test.entity.cmr.manytomany.Game".
1733  INFO   [main] openjpa.MetaData - Parsing query "Game.findByPrimaryKey(org.apache.openejb.test.entity.cmr.manytomany.GamePk)".
1741  INFO   [main] openjpa.MetaData - Parsing class "openejb.org.apache.openejb.test.entity.cmr.manytomany.Platform".
1745  INFO   [main] openjpa.MetaData - Parsing class "openejb.org.apache.openejb.test.entity.cmr.manytomany.Platform".
1746  INFO   [main] openjpa.MetaData - Parsing query "Platform.findByPrimaryKey(org.apache.openejb.test.entity.cmr.manytomany.PlatformPk)".
1749  INFO   [main] openjpa.MetaData - Parsing class "openejb.org.apache.openejb.test.entity.cmr.onetoone.ComplexPerson".
1754  INFO   [main] openjpa.MetaData - Parsing class "openejb.org.apache.openejb.test.entity.cmr.onetoone.ComplexPerson".
1754  INFO   [main] openjpa.MetaData - Parsing query "ComplexPerson.findByPrimaryKey(java.lang.Integer)".
1760  INFO   [main] openjpa.MetaData - Parsing class "openejb.org.apache.openejb.test.entity.cmr.onetoone.ComplexLicense".
1762  INFO   [main] openjpa.MetaData - Parsing class "openejb.org.apache.openejb.test.entity.cmr.onetoone.ComplexLicense".
1762  INFO   [main] openjpa.MetaData - Parsing query "ComplexLicense.findByPrimaryKey(java.lang.Integer)".
1773  INFO   [main] openjpa.MetaData - Parsing class "openejb.org.apache.openejb.test.entity.cmr.onetomany.ComplexArtist".
1774  INFO   [main] openjpa.MetaData - Parsing class "openejb.org.apache.openejb.test.entity.cmr.onetomany.ComplexArtist".
1775  INFO   [main] openjpa.MetaData - Parsing query "ComplexArtist.findByPrimaryKey(java.lang.Integer)".
1778  INFO   [main] openjpa.MetaData - Parsing class "openejb.org.apache.openejb.test.entity.cmr.onetomany.ComplexSong".
1780  INFO   [main] openjpa.MetaData - Parsing class "openejb.org.apache.openejb.test.entity.cmr.onetomany.ComplexSong".
1780  INFO   [main] openjpa.MetaData - Parsing query "ComplexSong.findByPrimaryKey(java.lang.Integer)".
1783  INFO   [main] openjpa.MetaData - Parsing class "openejb.org.apache.openejb.test.entity.cmr.manytomany.ComplexGame".
1784  INFO   [main] openjpa.MetaData - Parsing class "openejb.org.apache.openejb.test.entity.cmr.manytomany.ComplexGame".
1785  INFO   [main] openjpa.MetaData - Parsing query "ComplexGame.findByPrimaryKey(java.lang.Integer)".
1788  INFO   [main] openjpa.MetaData - Parsing class "openejb.org.apache.openejb.test.entity.cmr.manytomany.ComplexPlatform".
1789  INFO   [main] openjpa.MetaData - Parsing class "openejb.org.apache.openejb.test.entity.cmr.manytomany.ComplexPlatform".
1790  INFO   [main] openjpa.MetaData - Parsing query "ComplexPlatform.findByPrimaryKey(java.lang.Integer)".
1804  INFO   [main] openjpa.MetaData - Parsing class "openejb.org.apache.openejb.test.entity.ejbql.Query".
1807  INFO   [main] openjpa.MetaData - Parsing class "openejb.org.apache.openejb.test.entity.ejbql.Query".
1807  INFO   [main] openjpa.MetaData - Parsing package "openejb.org.apache.openejb.test.entity.ejbql.Query".
1809  INFO   [main] openjpa.MetaData - Parsing query "Query.ejbSelectSingleStringField(java.lang.String)".
1809  INFO   [main] openjpa.MetaData - Parsing query "Query.ejbSelectSingleBooleanField(boolean)".
1810  INFO   [main] openjpa.MetaData - Parsing query "Query.ejbSelectSingleCharField(char)".
1810  INFO   [main] openjpa.MetaData - Parsing query "Query.ejbSelectSingleByteField(byte)".
1810  INFO   [main] openjpa.MetaData - Parsing query "Query.ejbSelectSingleShortField(short)".
1810  INFO   [main] openjpa.MetaData - Parsing query "Query.ejbSelectSingleIntField(int)".
1811  INFO   [main] openjpa.MetaData - Parsing query "Query.ejbSelectSingleLongField(long)".
1811  INFO   [main] openjpa.MetaData - Parsing query "Query.ejbSelectSingleFloatField(float)".
1812  INFO   [main] openjpa.MetaData - Parsing query "Query.ejbSelectSingleDoubleField(double)".
1812  INFO   [main] openjpa.MetaData - Parsing query "Query.ejbSelectCollectionStringField".
1813  INFO   [main] openjpa.MetaData - Parsing query "Query.ejbSelectCollectionBooleanField".
1814  INFO   [main] openjpa.MetaData - Parsing query "Query.ejbSelectCollectionCharField".
1814  INFO   [main] openjpa.MetaData - Parsing query "Query.ejbSelectCollectionByteField".
1814  INFO   [main] openjpa.MetaData - Parsing query "Query.ejbSelectCollectionShortField".
1815  INFO   [main] openjpa.MetaData - Parsing query "Query.ejbSelectCollectionIntField".
1815  INFO   [main] openjpa.MetaData - Parsing query "Query.ejbSelectCollectionLongField".
1815  INFO   [main] openjpa.MetaData - Parsing query "Query.ejbSelectCollectionFloatField".
1816  INFO   [main] openjpa.MetaData - Parsing query "Query.ejbSelectCollectionDoubleField".
1816  INFO   [main] openjpa.MetaData - Parsing query "Query.ejbSelectSingleLocalEjb(int)".
1817  INFO   [main] openjpa.MetaData - Parsing query "Query.ejbSelectSingleRemoteEjb(int)".
1817  INFO   [main] openjpa.MetaData - Parsing query "Query.ejbSelectCollectionLocalEjb".
1817  INFO   [main] openjpa.MetaData - Parsing query "Query.ejbSelectCollectionRemoteEjb".
1822  INFO   [main] openjpa.MetaData - Parsing class "openejb.org.apache.openejb.test.entity.ejbql.QueryData".
1824  INFO   [main] openjpa.MetaData - Parsing class "openejb.org.apache.openejb.test.entity.ejbql.QueryData".
1830  INFO   [main] openjpa.MetaData - Parsing class "org.apache.openejb.test.object.OperationsPolicy".
1830  INFO   [main] openjpa.MetaData - Parsing package "org.apache.openejb.test.object.OperationsPolicy".
1851  INFO   [main] openjpa.MetaData - Parsing class "javax.ejb.EntityContext".
1851  INFO   [main] openjpa.MetaData - Parsing package "javax.ejb.EntityContext".
2607  INFO   [main] openjpa.MetaData - Parsing class "org.apache.openejb.test.entity.cmp.BasicCmp2Bean".
2666  INFO   [main] openjpa.MetaData - Parsing class "org.apache.openejb.test.entity.cmp.ComplexCmp2Bean".
2670  INFO   [main] openjpa.MetaData - Parsing class "org.apache.openejb.test.entity.cmp.ComplexCmpBeanPk".
2746  INFO   [main] openjpa.MetaData - Parsing class "org.apache.openejb.test.entity.cmp.UnknownCmp2Bean".
2898  INFO   [main] openjpa.MetaData - Parsing class "org.apache.openejb.test.entity.cmp.AllowedOperationsCmp2Bean".
3065  INFO   [main] openjpa.MetaData - Parsing class "org.apache.openejb.test.entity.cmp.EncCmp2Bean".
3322  INFO   [main] openjpa.MetaData - Parsing class "org.apache.openejb.test.entity.cmp.RmiIiopCmp2Bean".
3409  INFO   [main] openjpa.MetaData - Parsing class "org.apache.openejb.test.entity.cmr.onetoone.PersonBean".
3409  INFO   [main] openjpa.MetaData - Parsing package "org.apache.openejb.test.entity.cmr.onetoone.PersonBean".
3410  INFO   [main] openjpa.MetaData - Parsing class "org.apache.openejb.test.entity.cmr.onetoone.LicenseBean".
3519  INFO   [main] openjpa.MetaData - Parsing class "org.apache.openejb.test.entity.cmr.onetomany.ArtistBean".
3520  INFO   [main] openjpa.MetaData - Parsing package "org.apache.openejb.test.entity.cmr.onetomany.ArtistBean".
3520  INFO   [main] openjpa.MetaData - Parsing class "org.apache.openejb.test.entity.cmr.onetomany.SongBean".
3635  INFO   [main] openjpa.MetaData - Parsing class "org.apache.openejb.test.entity.cmr.manytomany.GameBean".
3635  INFO   [main] openjpa.MetaData - Parsing package "org.apache.openejb.test.entity.cmr.manytomany.GameBean".
3636  INFO   [main] openjpa.MetaData - Parsing class "org.apache.openejb.test.entity.cmr.manytomany.PlatformBean".
3737  INFO   [main] openjpa.MetaData - Parsing class "org.apache.openejb.test.entity.cmr.onetoone.PersonPk".
3765  INFO   [main] openjpa.MetaData - Parsing class "org.apache.openejb.test.entity.cmr.onetoone.LicensePk".
3818  INFO   [main] openjpa.MetaData - Parsing class "org.apache.openejb.test.entity.cmr.onetomany.ArtistPk".
3857  INFO   [main] openjpa.MetaData - Parsing class "org.apache.openejb.test.entity.cmr.onetomany.SongPk".
3911  INFO   [main] openjpa.MetaData - Parsing class "org.apache.openejb.test.entity.cmr.manytomany.GamePk".
3962  INFO   [main] openjpa.MetaData - Parsing class "org.apache.openejb.test.entity.cmr.manytomany.PlatformPk".
4063  INFO   [main] openjpa.MetaData - Parsing class "org.apache.openejb.test.entity.ejbql.QueryBean".
4063  INFO   [main] openjpa.MetaData - Parsing package "org.apache.openejb.test.entity.ejbql.QueryBean".
4110  INFO   [main] openjpa.MetaData - Parsing class "org.apache.openejb.test.entity.ejbql.QueryDataBean".
39  INFO   [main] openjpa.MetaData - Found 36 classes with metadata in 38 milliseconds.
42  INFO   [main] openjpa.MetaData - Found 1 classes with metadata in 41 milliseconds.
39  INFO   [main] openjpa.MetaData - Found 36 classes with metadata in 38 milliseconds.
30  INFO   [main] openjpa.MetaData - Found 1 classes with metadata in 29 milliseconds.
Tests run: 1, Failures: 0, Errors: 0, Skipped: 0, Time elapsed: 30.171 sec
Running org.apache.openejb.resource.SharedLocalConnectionManagerTest
Tests run: 1, Failures: 0, Errors: 0, Skipped: 0, Time elapsed: 1.192 sec
Running org.apache.openejb.assembler.classic.InterceptorBindingInfoComparatorTest
Tests run: 2, Failures: 0, Errors: 0, Skipped: 0, Time elapsed: 0.172 sec
Running org.apache.openejb.assembler.classic.MdbConfigTest
log4j:WARN No appenders could be found for logger (OpenEJB.startup.config).
log4j:WARN Please initialize the log4j system properly.
Tests run: 1, Failures: 0, Errors: 0, Skipped: 0, Time elapsed: 10.174 sec
Running org.apache.openejb.core.security.PropertiesLoginModuleTest
Path to login config: /x1/continuum/working-directory/158/target/test-classes/login.config
Path to login config: /x1/continuum/working-directory/158/target/test-classes/login.config
Path to login config: /x1/continuum/working-directory/158/target/test-classes/login.config
Tests run: 3, Failures: 0, Errors: 3, Skipped: 0, Time elapsed: 0.243 sec <<< FAILURE!
Running org.apache.openejb.assembler.classic.PersistenceUnitRefTest
Tests run: 1, Failures: 0, Errors: 0, Skipped: 0, Time elapsed: 0.236 sec
Running org.apache.openejb.resource.GeronimoConnectionManagerTest
log4j:WARN No appenders could be found for logger (org.apache.geronimo.connector.outbound.AbstractSinglePoolConnectionInterceptor).
log4j:WARN Please initialize the log4j system properly.
Tests run: 1, Failures: 0, Errors: 0, Skipped: 0, Time elapsed: 1.089 sec
Running org.apache.openejb.core.mdb.JmsTest
log4j:WARN No appenders could be found for logger (org.apache.activemq.broker.BrokerService).
log4j:WARN Please initialize the log4j system properly.
Tests run: 1, Failures: 0, Errors: 0, Skipped: 0, Time elapsed: 11.058 sec
Running org.apache.openejb.SomeoneBrokeSurefireAndThisIsADirtyHackForItTest
test server = org.apache.openejb.test.IvmTestServer
entry = java.naming.factory.initial:org.apache.openejb.client.LocalInitialContextFactory
WARN - Unable use logging config as there are 3 file references containing directories which have not been created.  See the list below.
WARN - [0] /x1/continuum/working-directory/158/target/test-classes/conf/logs/transaction.log
WARN - [1] /x1/continuum/working-directory/158/target/test-classes/conf/logs/openejb.log
WARN - [2] /x1/continuum/working-directory/158/target/test-classes/conf/logs/server.log
Apache OpenEJB 3.0-incubating-SNAPSHOT    build: 20070404-06:03
http://incubator.apache.org/openejb
INFO - openejb.home = /x1/continuum/working-directory/158/target/test-classes
INFO - openejb.base = /x1/continuum/working-directory/158/target/test-classes
INFO - Found EjbModule in classpath: /home/continuum/.m2/repository/org/apache/openejb/openejb-itests-beans/3.0-incubating-SNAPSHOT/openejb-itests-beans-3.0-incubating-SNAPSHOT.jar
WARN - Auto-linking res-ref-name 'stateless/references/Resource_manager_access' in bean client/tests/entity/cmp/allowed_operations/EntityHome to Connector(id=Default JDBC Database)
WARN - Auto-linking res-ref-name 'stateless/references/Resource_manager_access' in bean client/tests/entity/cmp2/allowed_operations/EntityHome to Connector(id=Default JDBC Database)
WARN - Auto-linking res-ref-name 'org.apache.openejb.test.stateful.AnnotatedFieldInjectionStatefulBean/daataSource' in bean AnnotatedFieldInjectionStatefulBean to Connector(id=Default JDBC Database)
WARN - Auto-linking res-ref-name 'org.apache.openejb.test.stateful.AnnotatedFieldInjectionStatefulBean/coonnectionFactory' in bean AnnotatedFieldInjectionStatefulBean to Connector(id=Default JMS Connection Factory)
WARN - Auto-linking res-ref-name 'org.apache.openejb.test.stateful.AnnotatedFieldInjectionStatefulBean/queueCoonnectionFactory' in bean AnnotatedFieldInjectionStatefulBean to Connector(id=Default JMS Connection Factory)
WARN - Auto-linking res-ref-name 'org.apache.openejb.test.stateful.AnnotatedFieldInjectionStatefulBean/topicCoonnectionFactory' in bean AnnotatedFieldInjectionStatefulBean to Connector(id=Default JMS Connection Factory)
WARN - Auto-linking res-ref-name 'org.apache.openejb.test.stateless.AnnotatedFieldInjectionStatelessBean/daataSource' in bean AnnotatedFieldInjectionStatelessBean to Connector(id=Default JDBC Database)
WARN - Auto-linking res-ref-name 'org.apache.openejb.test.stateless.AnnotatedFieldInjectionStatelessBean/coonnectionFactory' in bean AnnotatedFieldInjectionStatelessBean to Connector(id=Default JMS Connection Factory)
WARN - Auto-linking res-ref-name 'org.apache.openejb.test.stateless.AnnotatedFieldInjectionStatelessBean/queueCoonnectionFactory' in bean AnnotatedFieldInjectionStatelessBean to Connector(id=Default JMS Connection Factory)
WARN - Auto-linking res-ref-name 'org.apache.openejb.test.stateless.AnnotatedFieldInjectionStatelessBean/topicCoonnectionFactory' in bean AnnotatedFieldInjectionStatelessBean to Connector(id=Default JMS Connection Factory)
WARN - Auto-linking res-ref-name 'org.apache.openejb.test.mdb.AnnotatedFieldInjectionMdbBean/daataSource' in bean AnnotatedFieldInjectionMdbBean to Connector(id=Default JDBC Database)
WARN - Auto-linking res-ref-name 'org.apache.openejb.test.mdb.AnnotatedFieldInjectionMdbBean/coonnectionFactory' in bean AnnotatedFieldInjectionMdbBean to Connector(id=Default JMS Connection Factory)
WARN - Auto-linking res-ref-name 'org.apache.openejb.test.mdb.AnnotatedFieldInjectionMdbBean/queueCoonnectionFactory' in bean AnnotatedFieldInjectionMdbBean to Connector(id=Default JMS Connection Factory)
WARN - Auto-linking res-ref-name 'org.apache.openejb.test.mdb.AnnotatedFieldInjectionMdbBean/topicCoonnectionFactory' in bean AnnotatedFieldInjectionMdbBean to Connector(id=Default JMS Connection Factory)
log4j:WARN No appenders could be found for logger (org.apache.activemq.broker.BrokerService).
log4j:WARN Please initialize the log4j system properly.
ERROR - FATAL ERROR: Unknown error in Assembler.  Please send the following stack trace and this message to user@openejb.org :
 org.apache.xbean.recipe.MissingAccessorException: Unable to find a valid setter method: public void org.apache.openejb.core.mdb.MdbContainer.setServerUrl(java.lang.String)
	at org.apache.xbean.recipe.ObjectRecipe.findSetter(ObjectRecipe.java:692)
	at org.apache.xbean.recipe.ObjectRecipe.setProperty(ObjectRecipe.java:275)
	at org.apache.xbean.recipe.ObjectRecipe.setProperties(ObjectRecipe.java:251)
	at org.apache.xbean.recipe.ObjectRecipe.create(ObjectRecipe.java:198)
	at org.apache.xbean.recipe.AbstractRecipe.create(AbstractRecipe.java:28)
	at org.apache.openejb.assembler.classic.Assembler.createContainer(Assembler.java:603)
	at org.apache.openejb.assembler.classic.Assembler.buildContainerSystem(Assembler.java:293)
	at org.apache.openejb.assembler.classic.Assembler.build(Assembler.java:201)
	at org.apache.openejb.OpenEJB$Instance.<init>(OpenEJB.java:147)
	at org.apache.openejb.OpenEJB.init(OpenEJB.java:280)
	at org.apache.openejb.OpenEJB.init(OpenEJB.java:265)
	at sun.reflect.NativeMethodAccessorImpl.invoke0(Native Method)
	at sun.reflect.NativeMethodAccessorImpl.invoke(NativeMethodAccessorImpl.java:39)
	at sun.reflect.DelegatingMethodAccessorImpl.invoke(DelegatingMethodAccessorImpl.java:25)
	at java.lang.reflect.Method.invoke(Method.java:585)
	at org.apache.openejb.loader.OpenEJBInstance.init(OpenEJBInstance.java:36)
	at org.apache.openejb.client.LocalInitialContextFactory.init(LocalInitialContextFactory.java:56)
	at org.apache.openejb.client.LocalInitialContextFactory.getInitialContext(LocalInitialContextFactory.java:42)
	at javax.naming.spi.NamingManager.getInitialContext(NamingManager.java:667)
	at javax.naming.InitialContext.getDefaultInitCtx(InitialContext.java:247)
	at javax.naming.InitialContext.init(InitialContext.java:223)
	at javax.naming.InitialContext.<init>(InitialContext.java:197)
	at org.apache.openejb.test.HsqldbTestDatabase.start(HsqldbTestDatabase.java:180)
	at org.apache.openejb.test.TestManager.start(TestManager.java:79)
	at org.apache.openejb.iTest.setUp(iTest.java:57)
	at org.apache.openejb.test.TestSuite.run(TestSuite.java:41)
	at sun.reflect.NativeMethodAccessorImpl.invoke0(Native Method)
	at sun.reflect.NativeMethodAccessorImpl.invoke(NativeMethodAccessorImpl.java:39)
	at sun.reflect.DelegatingMethodAccessorImpl.invoke(DelegatingMethodAccessorImpl.java:25)
	at java.lang.reflect.Method.invoke(Method.java:585)
	at org.apache.maven.surefire.junit.JUnitTestSet.execute(JUnitTestSet.java:210)
	at org.apache.maven.surefire.suite.AbstractDirectoryTestSuite.executeTestSet(AbstractDirectoryTestSuite.java:135)
	at org.apache.maven.surefire.suite.AbstractDirectoryTestSuite.execute(AbstractDirectoryTestSuite.java:160)
	at org.apache.maven.surefire.Surefire.run(Surefire.java:81)
	at sun.reflect.NativeMethodAccessorImpl.invoke0(Native Method)
	at sun.reflect.NativeMethodAccessorImpl.invoke(NativeMethodAccessorImpl.java:39)
	at sun.reflect.DelegatingMethodAccessorImpl.invoke(DelegatingMethodAccessorImpl.java:25)
	at java.lang.reflect.Method.invoke(Method.java:585)
	at org.apache.maven.surefire.booter.SurefireBooter.runSuitesInProcess(SurefireBooter.java:182)
	at org.apache.maven.surefire.booter.SurefireBooter.main(SurefireBooter.java:743)

FATAL - OpenEJB has encountered a fatal error and cannot be started: Assembler failed to build the container system.
org.apache.openejb.OpenEJBException: org.apache.xbean.recipe.MissingAccessorException: Unable to find a valid setter method: public void org.apache.openejb.core.mdb.MdbContainer.setServerUrl(java.lang.String): Unable to find a valid setter method: public void org.apache.openejb.core.mdb.MdbContainer.setServerUrl(java.lang.String)
	at org.apache.openejb.assembler.classic.Assembler.build(Assembler.java:214)
	at org.apache.openejb.OpenEJB$Instance.<init>(OpenEJB.java:147)
	at org.apache.openejb.OpenEJB.init(OpenEJB.java:280)
	at org.apache.openejb.OpenEJB.init(OpenEJB.java:265)
	at sun.reflect.NativeMethodAccessorImpl.invoke0(Native Method)
	at sun.reflect.NativeMethodAccessorImpl.invoke(NativeMethodAccessorImpl.java:39)
	at sun.reflect.DelegatingMethodAccessorImpl.invoke(DelegatingMethodAccessorImpl.java:25)
	at java.lang.reflect.Method.invoke(Method.java:585)
	at org.apache.openejb.loader.OpenEJBInstance.init(OpenEJBInstance.java:36)
	at org.apache.openejb.client.LocalInitialContextFactory.init(LocalInitialContextFactory.java:56)
	at org.apache.openejb.client.LocalInitialContextFactory.getInitialContext(LocalInitialContextFactory.java:42)
	at javax.naming.spi.NamingManager.getInitialContext(NamingManager.java:667)
	at javax.naming.InitialContext.getDefaultInitCtx(InitialContext.java:247)
	at javax.naming.InitialContext.init(InitialContext.java:223)
	at javax.naming.InitialContext.<init>(InitialContext.java:197)
	at org.apache.openejb.test.HsqldbTestDatabase.start(HsqldbTestDatabase.java:180)
	at org.apache.openejb.test.TestManager.start(TestManager.java:79)
	at org.apache.openejb.iTest.setUp(iTest.java:57)
	at org.apache.openejb.test.TestSuite.run(TestSuite.java:41)
	at sun.reflect.NativeMethodAccessorImpl.invoke0(Native Method)
	at sun.reflect.NativeMethodAccessorImpl.invoke(NativeMethodAccessorImpl.java:39)
	at sun.reflect.DelegatingMethodAccessorImpl.invoke(DelegatingMethodAccessorImpl.java:25)
	at java.lang.reflect.Method.invoke(Method.java:585)
	at org.apache.maven.surefire.junit.JUnitTestSet.execute(JUnitTestSet.java:210)
	at org.apache.maven.surefire.suite.AbstractDirectoryTestSuite.executeTestSet(AbstractDirectoryTestSuite.java:135)
	at org.apache.maven.surefire.suite.AbstractDirectoryTestSuite.execute(AbstractDirectoryTestSuite.java:160)
	at org.apache.maven.surefire.Surefire.run(Surefire.java:81)
	at sun.reflect.NativeMethodAccessorImpl.invoke0(Native Method)
	at sun.reflect.NativeMethodAccessorImpl.invoke(NativeMethodAccessorImpl.java:39)
	at sun.reflect.DelegatingMethodAccessorImpl.invoke(DelegatingMethodAccessorImpl.java:25)
	at java.lang.reflect.Method.invoke(Method.java:585)
	at org.apache.maven.surefire.booter.SurefireBooter.runSuitesInProcess(SurefireBooter.java:182)
	at org.apache.maven.surefire.booter.SurefireBooter.main(SurefireBooter.java:743)
Caused by: org.apache.xbean.recipe.MissingAccessorException: Unable to find a valid setter method: public void org.apache.openejb.core.mdb.MdbContainer.setServerUrl(java.lang.String)
	at org.apache.xbean.recipe.ObjectRecipe.findSetter(ObjectRecipe.java:692)
	at org.apache.xbean.recipe.ObjectRecipe.setProperty(ObjectRecipe.java:275)
	at org.apache.xbean.recipe.ObjectRecipe.setProperties(ObjectRecipe.java:251)
	at org.apache.xbean.recipe.ObjectRecipe.create(ObjectRecipe.java:198)
	at org.apache.xbean.recipe.AbstractRecipe.create(AbstractRecipe.java:28)
	at org.apache.openejb.assembler.classic.Assembler.createContainer(Assembler.java:603)
	at org.apache.openejb.assembler.classic.Assembler.buildContainerSystem(Assembler.java:293)
	at org.apache.openejb.assembler.classic.Assembler.build(Assembler.java:201)
	... 32 more
Tests run: 1, Failures: 0, Errors: 1, Skipped: 0, Time elapsed: 15.332 sec <<< FAILURE!
Running org.apache.openejb.iTest
Tests run: 0, Failures: 0, Errors: 0, Skipped: 0, Time elapsed: 0.033 sec
Running org.apache.openejb.core.stateless.StatelessContainerTest
log4j:WARN No appenders could be found for logger (OpenEJB).
log4j:WARN Please initialize the log4j system properly.
Tests run: 3, Failures: 0, Errors: 0, Skipped: 0, Time elapsed: 0.942 sec
Running org.apache.openejb.core.TemporaryClassLoaderTest
Tests run: 1, Failures: 0, Errors: 0, Skipped: 0, Time elapsed: 0.217 sec
Running org.apache.openejb.core.security.SecurityTest
log4j:WARN No appenders could be found for logger (OpenEJB.startup.config).
log4j:WARN Please initialize the log4j system properly.
Tests run: 1, Failures: 0, Errors: 1, Skipped: 0, Time elapsed: 4.314 sec <<< FAILURE!
Running org.apache.openejb.assembler.classic.OpenEjbConfigurationValidationTest
Tests run: 1, Failures: 0, Errors: 0, Skipped: 0, Time elapsed: 0.214 sec

Results :
Tests run: 67, Failures: 0, Errors: 6, Skipped: 0

[INFO] ------------------------------------------------------------------------
[ERROR] BUILD FAILURE
[INFO] ------------------------------------------------------------------------
[INFO] There are test failures.
[INFO] ------------------------------------------------------------------------
[INFO] For more information, run Maven with the -e switch
[INFO] ------------------------------------------------------------------------
[INFO] Total time: 5 minutes 25 seconds
[INFO] Finished at: Wed Apr 04 06:08:01 PDT 2007
[INFO] Final Memory: 15M/32M
[INFO] ------------------------------------------------------------------------

****************************************************************************



Mime
View raw message