tomee-commits mailing list archives

Site index · List index
Message view « Date » · « Thread »
Top « Date » · « Thread »
From "Continuum@vmbuild.apache.org" <openejb-comm...@incubator.apache.org>
Subject [continuum] BUILD FAILURE: OpenEJB :: Container :: Core
Date Fri, 06 Apr 2007 12:57:55 GMT
Online report : http://vmbuild.apache.org/continuum/servlet/continuum/target/ProjectBuild.vm/view/ProjectBuild/id/158/buildId/102683
Build statistics:
  State: Failed
  Previous State: Failed
  Started at: Fri, 6 Apr 2007 05:52:15 -0700
  Finished at: Fri, 6 Apr 2007 05:57:55 -0700
  Total time: 5m 39s
  Build Trigger: Forced
  Exit code: 1
  Building machine hostname: vmbuild.apache.org
  Operating system : Linux(unknown)
  Java version : 1.5.0_06(Sun Microsystems Inc.)

Changes
      No files changed
  
****************************************************************************
Output:
****************************************************************************
[INFO] Scanning for projects...
[INFO] ----------------------------------------------------------------------------
[INFO] Building OpenEJB :: Container :: Core
[INFO]    task-segment: [install]
[INFO] ----------------------------------------------------------------------------
[INFO] [resources:resources]
[INFO] Using default encoding to copy filtered resources.
[INFO] [dependency:copy {execution: copy-dependencies}]
[INFO] Configured Artifact: org.apache.openejb:openejb-javaagent:null:3.0-incubating-SNAPSHOT:jar
[INFO] snapshot org.apache.openejb:openejb-javaagent:3.0-incubating-SNAPSHOT: checking for updates from codehaus-snapshot
[INFO] snapshot org.apache.openejb:openejb-javaagent:3.0-incubating-SNAPSHOT: checking for updates from apache-m2-snapshot
[INFO] snapshot org.apache.openejb:openejb-javaagent:3.0-incubating-SNAPSHOT: checking for updates from apache.snapshots
Downloading: http://people.apache.org/repo/m2-snapshot-repository/org/apache/openejb/openejb-javaagent/3.0-incubating-SNAPSHOT/openejb-javaagent-3.0-incubating-20070406.053742-113.jar
3K downloaded
[INFO] openejb-javaagent-3.0-incubating-SNAPSHOT.jar already exists.
[INFO] snapshot org.apache.openejb:openejb-loader:3.0-incubating-SNAPSHOT: checking for updates from codehaus-snapshot
[INFO] snapshot org.apache.openejb:openejb-loader:3.0-incubating-SNAPSHOT: checking for updates from apache-m2-snapshot
[INFO] snapshot org.apache.openejb:openejb-loader:3.0-incubating-SNAPSHOT: checking for updates from apache.snapshots
Downloading: http://people.apache.org/repo/m2-snapshot-repository/org/apache/openejb/openejb-loader/3.0-incubating-SNAPSHOT/openejb-loader-3.0-incubating-20070406.053742-118.pom
765b downloaded
Downloading: http://people.apache.org/repo/m2-snapshot-repository/org/apache/openejb/openejb-javaagent/3.0-incubating-SNAPSHOT/openejb-javaagent-3.0-incubating-20070406.053742-113.pom
1K downloaded
[INFO] snapshot org.apache.openejb:openejb-jee:3.0-incubating-SNAPSHOT: checking for updates from codehaus-snapshot
[INFO] snapshot org.apache.openejb:openejb-jee:3.0-incubating-SNAPSHOT: checking for updates from apache-m2-snapshot
[INFO] snapshot org.apache.openejb:openejb-jee:3.0-incubating-SNAPSHOT: checking for updates from apache.snapshots
Downloading: http://people.apache.org/repo/m2-snapshot-repository/org/apache/openejb/openejb-jee/3.0-incubating-SNAPSHOT/openejb-jee-3.0-incubating-20070406.053742-115.pom
1K downloaded
[INFO] snapshot org.apache.xbean:xbean-finder:3.0-SNAPSHOT: checking for updates from codehaus-snapshot
[INFO] snapshot org.apache.xbean:xbean-finder:3.0-SNAPSHOT: checking for updates from apache-m2-snapshot
[INFO] snapshot org.apache.xbean:xbean-finder:3.0-SNAPSHOT: checking for updates from apache.snapshots
[INFO] snapshot org.apache.xbean:xbean:3.0-SNAPSHOT: checking for updates from codehaus-snapshot
[INFO] snapshot org.apache.xbean:xbean:3.0-SNAPSHOT: checking for updates from apache-m2-snapshot
[INFO] snapshot org.apache.xbean:xbean:3.0-SNAPSHOT: checking for updates from apache.snapshots
[INFO] snapshot org.apache.geronimo.specs:geronimo-stax-api_1.0_spec:1.0-SNAPSHOT: checking for updates from codehaus-snapshot
[INFO] snapshot org.apache.geronimo.specs:geronimo-stax-api_1.0_spec:1.0-SNAPSHOT: checking for updates from apache-m2-snapshot
[INFO] snapshot org.apache.geronimo.specs:geronimo-stax-api_1.0_spec:1.0-SNAPSHOT: checking for updates from apache.snapshots
[INFO] snapshot org.apache.activemq:activemq-ra:4.1-SNAPSHOT: checking for updates from codehaus-snapshot
[INFO] snapshot org.apache.activemq:activemq-ra:4.1-SNAPSHOT: checking for updates from apache-m2-snapshot
[INFO] snapshot org.apache.activemq:activemq-ra:4.1-SNAPSHOT: checking for updates from apache.snapshots
[INFO] snapshot org.apache.activemq:activemq-parent:4.1-SNAPSHOT: checking for updates from codehaus-snapshot
[INFO] snapshot org.apache.activemq:activemq-parent:4.1-SNAPSHOT: checking for updates from apache-m2-snapshot
[INFO] snapshot org.apache.activemq:activemq-parent:4.1-SNAPSHOT: checking for updates from apache.snapshots
[INFO] snapshot org.apache.activemq:activemq-core:4.1-SNAPSHOT: checking for updates from codehaus-snapshot
[INFO] snapshot org.apache.activemq:activemq-core:4.1-SNAPSHOT: checking for updates from apache-m2-snapshot
[INFO] snapshot org.apache.activemq:activemq-core:4.1-SNAPSHOT: checking for updates from apache.snapshots
[WARNING] While downloading xerces:xerces:2.4.0
  This artifact has been relocated to xerces:xercesImpl:2.4.0.


[INFO] snapshot org.apache.openjpa:openjpa-persistence-jdbc:0.9.7-incubating-SNAPSHOT: checking for updates from codehaus-snapshot
[INFO] snapshot org.apache.openjpa:openjpa-persistence-jdbc:0.9.7-incubating-SNAPSHOT: checking for updates from apache-m2-snapshot
[INFO] snapshot org.apache.openjpa:openjpa-persistence-jdbc:0.9.7-incubating-SNAPSHOT: checking for updates from apache.snapshots
13K downloaded
[INFO] snapshot org.apache.openjpa:openjpa:0.9.7-incubating-SNAPSHOT: checking for updates from codehaus-snapshot
[INFO] snapshot org.apache.openjpa:openjpa:0.9.7-incubating-SNAPSHOT: checking for updates from apache-m2-snapshot
[INFO] snapshot org.apache.openjpa:openjpa:0.9.7-incubating-SNAPSHOT: checking for updates from apache.snapshots
11K downloaded
[INFO] snapshot org.apache.openjpa:openjpa-jdbc-5:0.9.7-incubating-SNAPSHOT: checking for updates from codehaus-snapshot
[INFO] snapshot org.apache.openjpa:openjpa-jdbc-5:0.9.7-incubating-SNAPSHOT: checking for updates from apache-m2-snapshot
[INFO] snapshot org.apache.openjpa:openjpa-jdbc-5:0.9.7-incubating-SNAPSHOT: checking for updates from apache.snapshots
1K downloaded
[INFO] snapshot org.apache.openjpa:openjpa-jdbc:0.9.7-incubating-SNAPSHOT: checking for updates from codehaus-snapshot
[INFO] snapshot org.apache.openjpa:openjpa-jdbc:0.9.7-incubating-SNAPSHOT: checking for updates from apache-m2-snapshot
[INFO] snapshot org.apache.openjpa:openjpa-jdbc:0.9.7-incubating-SNAPSHOT: checking for updates from apache.snapshots
[INFO] snapshot org.apache.openjpa:openjpa-kernel:0.9.7-incubating-SNAPSHOT: checking for updates from codehaus-snapshot
[INFO] snapshot org.apache.openjpa:openjpa-kernel:0.9.7-incubating-SNAPSHOT: checking for updates from apache-m2-snapshot
[INFO] snapshot org.apache.openjpa:openjpa-kernel:0.9.7-incubating-SNAPSHOT: checking for updates from apache.snapshots
4K downloaded
[INFO] snapshot org.apache.openjpa:openjpa-lib:0.9.7-incubating-SNAPSHOT: checking for updates from codehaus-snapshot
[INFO] snapshot org.apache.openjpa:openjpa-lib:0.9.7-incubating-SNAPSHOT: checking for updates from apache-m2-snapshot
[INFO] snapshot org.apache.openjpa:openjpa-lib:0.9.7-incubating-SNAPSHOT: checking for updates from apache.snapshots
3K downloaded
[INFO] snapshot org.apache.openjpa:openjpa-persistence:0.9.7-incubating-SNAPSHOT: checking for updates from codehaus-snapshot
[INFO] snapshot org.apache.openjpa:openjpa-persistence:0.9.7-incubating-SNAPSHOT: checking for updates from apache-m2-snapshot
[INFO] snapshot org.apache.openjpa:openjpa-persistence:0.9.7-incubating-SNAPSHOT: checking for updates from apache.snapshots
1K downloaded
[INFO] snapshot org.apache.openjpa:openjpa-kernel-5:0.9.7-incubating-SNAPSHOT: checking for updates from codehaus-snapshot
[INFO] snapshot org.apache.openjpa:openjpa-kernel-5:0.9.7-incubating-SNAPSHOT: checking for updates from apache-m2-snapshot
[INFO] snapshot org.apache.openjpa:openjpa-kernel-5:0.9.7-incubating-SNAPSHOT: checking for updates from apache.snapshots
1K downloaded
[INFO] snapshot org.apache.geronimo.modules:geronimo-connector:2.0-SNAPSHOT: checking for updates from codehaus-snapshot
[INFO] snapshot org.apache.geronimo.modules:geronimo-connector:2.0-SNAPSHOT: checking for updates from apache-m2-snapshot
[INFO] snapshot org.apache.geronimo.modules:geronimo-connector:2.0-SNAPSHOT: checking for updates from apache.snapshots
[INFO] snapshot org.apache.geronimo.modules:modules:2.0-SNAPSHOT: checking for updates from codehaus-snapshot
[INFO] snapshot org.apache.geronimo.modules:modules:2.0-SNAPSHOT: checking for updates from apache-m2-snapshot
[INFO] snapshot org.apache.geronimo.modules:modules:2.0-SNAPSHOT: checking for updates from apache.snapshots
[INFO] snapshot org.apache.geronimo:geronimo:2.0-SNAPSHOT: checking for updates from codehaus-snapshot
[INFO] snapshot org.apache.geronimo:geronimo:2.0-SNAPSHOT: checking for updates from apache-m2-snapshot
[INFO] snapshot org.apache.geronimo:geronimo:2.0-SNAPSHOT: checking for updates from apache.snapshots
[INFO] snapshot org.apache.geronimo.genesis.config:project-config:1.2-SNAPSHOT: checking for updates from apache-snapshots
[INFO] snapshot org.apache.geronimo.genesis.config:project-config:1.2-SNAPSHOT: checking for updates from codehaus-snapshot
[INFO] snapshot org.apache.geronimo.genesis.config:project-config:1.2-SNAPSHOT: checking for updates from apache-m2-snapshot
[INFO] snapshot org.apache.geronimo.genesis.config:project-config:1.2-SNAPSHOT: checking for updates from apache.snapshots
[INFO] snapshot org.apache.geronimo.genesis.config:config:1.2-SNAPSHOT: checking for updates from apache-snapshots
[INFO] snapshot org.apache.geronimo.genesis.config:config:1.2-SNAPSHOT: checking for updates from codehaus-snapshots
[INFO] snapshot org.apache.geronimo.genesis.config:config:1.2-SNAPSHOT: checking for updates from codehaus-snapshot
[INFO] snapshot org.apache.geronimo.genesis.config:config:1.2-SNAPSHOT: checking for updates from apache-m2-snapshot
[INFO] snapshot org.apache.geronimo.genesis.config:config:1.2-SNAPSHOT: checking for updates from apache.snapshots
[INFO] snapshot org.apache.geronimo.genesis:genesis:1.2-SNAPSHOT: checking for updates from apache-snapshots
[INFO] snapshot org.apache.geronimo.genesis:genesis:1.2-SNAPSHOT: checking for updates from codehaus-snapshots
[INFO] snapshot org.apache.geronimo.genesis:genesis:1.2-SNAPSHOT: checking for updates from codehaus-snapshot
[INFO] snapshot org.apache.geronimo.genesis:genesis:1.2-SNAPSHOT: checking for updates from apache-m2-snapshot
[INFO] snapshot org.apache.geronimo.genesis:genesis:1.2-SNAPSHOT: checking for updates from apache.snapshots
[INFO] snapshot org.apache.geronimo.modules:geronimo-transaction:2.0-SNAPSHOT: checking for updates from codehaus-snapshot
[INFO] snapshot org.apache.geronimo.modules:geronimo-transaction:2.0-SNAPSHOT: checking for updates from apache-m2-snapshot
[INFO] snapshot org.apache.geronimo.modules:geronimo-transaction:2.0-SNAPSHOT: checking for updates from apache.snapshots
[INFO] snapshot org.apache.geronimo.modules:geronimo-core:2.0-SNAPSHOT: checking for updates from codehaus-snapshot
[INFO] snapshot org.apache.geronimo.modules:geronimo-core:2.0-SNAPSHOT: checking for updates from apache-m2-snapshot
[INFO] snapshot org.apache.geronimo.modules:geronimo-core:2.0-SNAPSHOT: checking for updates from apache.snapshots
[INFO] snapshot org.apache.geronimo.modules:geronimo-system:2.0-SNAPSHOT: checking for updates from codehaus-snapshot
[INFO] snapshot org.apache.geronimo.modules:geronimo-system:2.0-SNAPSHOT: checking for updates from apache-m2-snapshot
[INFO] snapshot org.apache.geronimo.modules:geronimo-system:2.0-SNAPSHOT: checking for updates from apache.snapshots
[INFO] snapshot org.apache.geronimo.modules:geronimo-util:2.0-SNAPSHOT: checking for updates from codehaus-snapshot
[INFO] snapshot org.apache.geronimo.modules:geronimo-util:2.0-SNAPSHOT: checking for updates from apache-m2-snapshot
[INFO] snapshot org.apache.geronimo.modules:geronimo-util:2.0-SNAPSHOT: checking for updates from apache.snapshots
[INFO] snapshot org.apache.geronimo.modules:geronimo-kernel:2.0-SNAPSHOT: checking for updates from codehaus-snapshot
[INFO] snapshot org.apache.geronimo.modules:geronimo-kernel:2.0-SNAPSHOT: checking for updates from apache-m2-snapshot
[INFO] snapshot org.apache.geronimo.modules:geronimo-kernel:2.0-SNAPSHOT: checking for updates from apache.snapshots
[INFO] snapshot org.apache.geronimo.modules:geronimo-transaction-jta11:2.0-SNAPSHOT: checking for updates from codehaus-snapshot
[INFO] snapshot org.apache.geronimo.modules:geronimo-transaction-jta11:2.0-SNAPSHOT: checking for updates from apache-m2-snapshot
[INFO] snapshot org.apache.geronimo.modules:geronimo-transaction-jta11:2.0-SNAPSHOT: checking for updates from apache.snapshots
[INFO] snapshot org.apache.xbean:xbean-reflect:3.0-SNAPSHOT: checking for updates from codehaus-snapshot
[INFO] snapshot org.apache.xbean:xbean-reflect:3.0-SNAPSHOT: checking for updates from apache-m2-snapshot
[INFO] snapshot org.apache.xbean:xbean-reflect:3.0-SNAPSHOT: checking for updates from apache.snapshots
[INFO] snapshot org.apache.xbean:xbean-naming:3.0-SNAPSHOT: checking for updates from codehaus-snapshot
[INFO] snapshot org.apache.xbean:xbean-naming:3.0-SNAPSHOT: checking for updates from apache-m2-snapshot
[INFO] snapshot org.apache.xbean:xbean-naming:3.0-SNAPSHOT: checking for updates from apache.snapshots
[WARNING] 
	Artifact junit:junit:jar:4.1:test retains local scope 'test' overriding broader scope 'compile'
	given by a dependency. If this is not intended, modify or remove the local scope.

[WARNING] 
	Artifact hsqldb:hsqldb:jar:1.8.0.7:test retains local scope 'test' overriding broader scope 'compile'
	given by a dependency. If this is not intended, modify or remove the local scope.

[INFO] snapshot org.apache.openejb:openejb-itests-app:3.0-incubating-SNAPSHOT: checking for updates from codehaus-snapshot
[INFO] snapshot org.apache.openejb:openejb-itests-app:3.0-incubating-SNAPSHOT: checking for updates from apache-m2-snapshot
[INFO] snapshot org.apache.openejb:openejb-itests-app:3.0-incubating-SNAPSHOT: checking for updates from apache.snapshots
Downloading: http://people.apache.org/repo/m2-snapshot-repository/org/apache/openejb/openejb-itests-app/3.0-incubating-SNAPSHOT/openejb-itests-app-3.0-incubating-20070406.053742-118.pom
2K downloaded
[INFO] snapshot org.apache.openejb:itests:3.0-incubating-SNAPSHOT: checking for updates from codehaus-snapshot
[INFO] snapshot org.apache.openejb:itests:3.0-incubating-SNAPSHOT: checking for updates from apache-m2-snapshot
[INFO] snapshot org.apache.openejb:itests:3.0-incubating-SNAPSHOT: checking for updates from apache.snapshots
Downloading: http://people.apache.org/repo/m2-snapshot-repository/org/apache/openejb/itests/3.0-incubating-SNAPSHOT/itests-3.0-incubating-20070406.053742-120.pom
1K downloaded
[INFO] snapshot org.apache.openejb:openejb-itests-beans:3.0-incubating-SNAPSHOT: checking for updates from codehaus-snapshot
[INFO] snapshot org.apache.openejb:openejb-itests-beans:3.0-incubating-SNAPSHOT: checking for updates from apache-m2-snapshot
[INFO] snapshot org.apache.openejb:openejb-itests-beans:3.0-incubating-SNAPSHOT: checking for updates from apache.snapshots
Downloading: http://people.apache.org/repo/m2-snapshot-repository/org/apache/openejb/openejb-itests-beans/3.0-incubating-SNAPSHOT/openejb-itests-beans-3.0-incubating-20070406.053742-120.pom
1K downloaded
[INFO] snapshot org.apache.openejb:openejb-itests-client:3.0-incubating-SNAPSHOT: checking for updates from codehaus-snapshot
[INFO] snapshot org.apache.openejb:openejb-itests-client:3.0-incubating-SNAPSHOT: checking for updates from apache-m2-snapshot
[INFO] snapshot org.apache.openejb:openejb-itests-client:3.0-incubating-SNAPSHOT: checking for updates from apache.snapshots
Downloading: http://people.apache.org/repo/m2-snapshot-repository/org/apache/openejb/openejb-itests-client/3.0-incubating-SNAPSHOT/openejb-itests-client-3.0-incubating-20070406.053742-118.pom
1K downloaded
[INFO] snapshot org.apache.axis2:axis2-jaxws-api:SNAPSHOT: checking for updates from codehaus-snapshot
[INFO] snapshot org.apache.axis2:axis2-jaxws-api:SNAPSHOT: checking for updates from apache-m2-snapshot
[INFO] snapshot org.apache.axis2:axis2-jaxws-api:SNAPSHOT: checking for updates from apache.snapshots
Downloading: http://people.apache.org/repo/m2-snapshot-repository/org/apache/axis2/axis2-jaxws-api/SNAPSHOT/axis2-jaxws-api-20070406.111558-114.pom
2K downloaded
[INFO] snapshot org.apache.axis2:axis2-parent:SNAPSHOT: checking for updates from codehaus-snapshot
[INFO] snapshot org.apache.axis2:axis2-parent:SNAPSHOT: checking for updates from apache-m2-snapshot
[INFO] snapshot org.apache.axis2:axis2-parent:SNAPSHOT: checking for updates from apache.snapshots
Downloading: http://people.apache.org/repo/m2-snapshot-repository/org/apache/axis2/axis2-parent/SNAPSHOT/axis2-parent-20070406.111558-177.pom
25K downloaded
[INFO] snapshot org.apache.axis2:axis2-saaj-api:SNAPSHOT: checking for updates from codehaus-snapshot
[INFO] snapshot org.apache.axis2:axis2-saaj-api:SNAPSHOT: checking for updates from apache-m2-snapshot
[INFO] snapshot org.apache.axis2:axis2-saaj-api:SNAPSHOT: checking for updates from apache.snapshots
Downloading: http://people.apache.org/repo/m2-snapshot-repository/org/apache/axis2/axis2-saaj-api/SNAPSHOT/axis2-saaj-api-20070406.111558-118.pom
2K downloaded
[INFO] snapshot org.apache.geronimo.specs:geronimo-javamail_1.4_spec:1.0-SNAPSHOT: checking for updates from codehaus-snapshot
[INFO] snapshot org.apache.geronimo.specs:geronimo-javamail_1.4_spec:1.0-SNAPSHOT: checking for updates from apache-m2-snapshot
[INFO] snapshot org.apache.geronimo.specs:geronimo-javamail_1.4_spec:1.0-SNAPSHOT: checking for updates from apache.snapshots
[INFO] snapshot org.apache.geronimo.specs:geronimo-activation_1.1_spec:1.0-SNAPSHOT: checking for updates from codehaus-snapshot
[INFO] snapshot org.apache.geronimo.specs:geronimo-activation_1.1_spec:1.0-SNAPSHOT: checking for updates from apache-m2-snapshot
[INFO] snapshot org.apache.geronimo.specs:geronimo-activation_1.1_spec:1.0-SNAPSHOT: checking for updates from apache.snapshots
Downloading: http://people.apache.org/repo/m2-snapshot-repository/org/apache/openejb/openejb-loader/3.0-incubating-SNAPSHOT/openejb-loader-3.0-incubating-20070406.053742-118.jar
27K downloaded
Downloading: http://people.apache.org/repo/m2-snapshot-repository/org/apache/axis2/axis2-jaxws-api/SNAPSHOT/axis2-jaxws-api-20070406.111558-114.jar
37K downloaded
188K downloaded
Downloading: http://people.apache.org/repo/m2-snapshot-repository/org/apache/openejb/openejb-jee/3.0-incubating-SNAPSHOT/openejb-jee-3.0-incubating-20070406.053742-115.jar
569K downloaded
Downloading: http://people.apache.org/repo/m2-snapshot-repository/org/apache/axis2/axis2-saaj-api/SNAPSHOT/axis2-saaj-api-20070406.111558-118.jar
25K downloaded
18K downloaded
1050K downloaded
15K downloaded
376K downloaded
86K downloaded
[INFO] [compiler:compile]
Compiling 25 source files to /x1/continuum/working-directory/158/target/classes
Downloading: http://people.apache.org/repo/m2-incubating-repository/org/apache/axis2/axis2-jaxws-api/20070406.111558-114/axis2-jaxws-api-20070406.111558-114.pom
[WARNING] Unable to get resource 'org.apache.axis2:axis2-jaxws-api:pom:20070406.111558-114' from repository apache-incubating-repository (http://people.apache.org/repo/m2-incubating-repository)
Downloading: http://repo1.maven.org/maven2/org/apache/axis2/axis2-jaxws-api/20070406.111558-114/axis2-jaxws-api-20070406.111558-114.pom
[WARNING] Unable to get resource 'org.apache.axis2:axis2-jaxws-api:pom:20070406.111558-114' from repository central (http://repo1.maven.org/maven2)
Downloading: http://people.apache.org/repo/m2-snapshot-repository/org/apache/openejb/openejb-itests-beans/3.0-incubating-SNAPSHOT/openejb-itests-beans-3.0-incubating-20070406.053742-120.jar
275K downloaded
Downloading: http://people.apache.org/repo/m2-snapshot-repository/org/apache/openejb/openejb-itests-app/3.0-incubating-SNAPSHOT/openejb-itests-app-3.0-incubating-20070406.053742-118.jar
8971K downloaded
Downloading: http://people.apache.org/repo/m2-snapshot-repository/org/apache/openejb/openejb-itests-client/3.0-incubating-SNAPSHOT/openejb-itests-client-3.0-incubating-20070406.053742-118.jar
412K downloaded
[INFO] [antrun:run {execution: default}]
[INFO] Executing tasks
[INFO] Executed tasks
[INFO] [resources:testResources]
[INFO] Using default encoding to copy filtered resources.
[INFO] [compiler:testCompile]
Compiling 1 source file to /x1/continuum/working-directory/158/target/test-classes
[INFO] [surefire:test]
[INFO] Surefire report directory: /x1/continuum/working-directory/158/target/surefire-reports

-------------------------------------------------------
 T E S T S
-------------------------------------------------------
Running org.apache.openejb.config.OpenEjb2CmpConversionTest
log4j:WARN No appenders could be found for logger (OpenEJB).
log4j:WARN Please initialize the log4j system properly.
Tests run: 9, Failures: 0, Errors: 0, Skipped: 0, Time elapsed: 10.455 sec
Running org.apache.openejb.core.stateless.StatelessInterceptorTest
log4j:WARN No appenders could be found for logger (OpenEJB.startup.config).
log4j:WARN Please initialize the log4j system properly.
Tests run: 1, Failures: 0, Errors: 0, Skipped: 0, Time elapsed: 4.599 sec
Running org.apache.openejb.core.mdb.MdbTest
log4j:WARN No appenders could be found for logger (org.apache.activemq.broker.BrokerService).
log4j:WARN Please initialize the log4j system properly.
Tests run: 1, Failures: 0, Errors: 0, Skipped: 0, Time elapsed: 11.438 sec
Running org.apache.openejb.core.stateful.StatefulInterceptorTest
log4j:WARN No appenders could be found for logger (OpenEJB.startup.config).
log4j:WARN Please initialize the log4j system properly.
Tests run: 1, Failures: 0, Errors: 0, Skipped: 0, Time elapsed: 4.3 sec
Running org.apache.openejb.config.ConfigureServiceTest
log4j:WARN No appenders could be found for logger (OpenEJB.startup.config).
log4j:WARN Please initialize the log4j system properly.
Tests run: 4, Failures: 0, Errors: 0, Skipped: 0, Time elapsed: 1.301 sec
Running org.apache.openejb.core.mdb.SimpleJmsTest
log4j:WARN No appenders could be found for logger (org.apache.activemq.broker.BrokerService).
log4j:WARN Please initialize the log4j system properly.
Tests run: 1, Failures: 0, Errors: 0, Skipped: 0, Time elapsed: 11.234 sec
Running org.apache.openejb.config.SunQueryFilterTest
Tests run: 5, Failures: 0, Errors: 0, Skipped: 0, Time elapsed: 0.084 sec
Running org.apache.openejb.config.SunCmpConversionTest
log4j:WARN No appenders could be found for logger (OpenEJB).
log4j:WARN Please initialize the log4j system properly.
Tests run: 8, Failures: 0, Errors: 0, Skipped: 0, Time elapsed: 11.117 sec
Running org.apache.openejb.core.stateful.Compat3to2Test
log4j:WARN No appenders could be found for logger (OpenEJB.startup.config).
log4j:WARN Please initialize the log4j system properly.
Tests run: 1, Failures: 0, Errors: 0, Skipped: 0, Time elapsed: 4.501 sec
Running org.apache.openejb.ApplicationTest
test server = org.apache.openejb.test.IvmTestServer
entry = java.naming.factory.initial:org.apache.openejb.client.LocalInitialContextFactory
WARN - Unable use logging config as there are 3 file references containing directories which have not been created.  See the list below.
WARN - [0] /x1/continuum/working-directory/158/target/test-classes/conf/logs/transaction.log
WARN - [1] /x1/continuum/working-directory/158/target/test-classes/conf/logs/openejb.log
WARN - [2] /x1/continuum/working-directory/158/target/test-classes/conf/logs/server.log
Apache OpenEJB 3.0-incubating-SNAPSHOT    build: 20070406-05:52
http://incubator.apache.org/openejb
INFO - openejb.home = /x1/continuum/working-directory/158/target/test-classes
INFO - openejb.base = /x1/continuum/working-directory/158/target/test-classes
INFO - Found AppModule in classpath: /home/continuum/.m2/repository/org/apache/openejb/openejb-itests-app/3.0-incubating-SNAPSHOT/openejb-itests-app-3.0-incubating-SNAPSHOT.jar
WARN - Auto-linking res-ref-name 'org.apache.openejb.test.stateful.AnnotatedFieldInjectionStatefulBean/daataSource' in bean AnnotatedFieldInjectionStatefulBean to Connector(id=Default JDBC Database)
WARN - Auto-creating a connector with id 'Default JMS Connection Factory' of type 'javax.jms.ConnectionFactory for 'AnnotatedFieldInjectionStatefulBean'.  THERE IS LITTLE CHANCE THIS WILL WORK!
WARN - Auto-linking res-ref-name 'org.apache.openejb.test.stateful.AnnotatedFieldInjectionStatefulBean/coonnectionFactory' in bean AnnotatedFieldInjectionStatefulBean to Connector(id=Default JMS Connection Factory)
WARN - Auto-linking res-ref-name 'org.apache.openejb.test.stateful.AnnotatedFieldInjectionStatefulBean/queueCoonnectionFactory' in bean AnnotatedFieldInjectionStatefulBean to Connector(id=Default JMS Connection Factory)
WARN - Auto-linking res-ref-name 'org.apache.openejb.test.stateful.AnnotatedFieldInjectionStatefulBean/topicCoonnectionFactory' in bean AnnotatedFieldInjectionStatefulBean to Connector(id=Default JMS Connection Factory)
WARN - Auto-linking res-ref-name 'org.apache.openejb.test.stateless.AnnotatedFieldInjectionStatelessBean/daataSource' in bean AnnotatedFieldInjectionStatelessBean to Connector(id=Default JDBC Database)
WARN - Auto-linking res-ref-name 'org.apache.openejb.test.stateless.AnnotatedFieldInjectionStatelessBean/coonnectionFactory' in bean AnnotatedFieldInjectionStatelessBean to Connector(id=Default JMS Connection Factory)
WARN - Auto-linking res-ref-name 'org.apache.openejb.test.stateless.AnnotatedFieldInjectionStatelessBean/queueCoonnectionFactory' in bean AnnotatedFieldInjectionStatelessBean to Connector(id=Default JMS Connection Factory)
WARN - Auto-linking res-ref-name 'org.apache.openejb.test.stateless.AnnotatedFieldInjectionStatelessBean/topicCoonnectionFactory' in bean AnnotatedFieldInjectionStatelessBean to Connector(id=Default JMS Connection Factory)
log4j:WARN No appenders could be found for logger (org.apache.activemq.broker.BrokerService).
log4j:WARN Please initialize the log4j system properly.
ERROR - FATAL ERROR: Unknown error in Assembler.  Please send the following stack trace and this message to user@openejb.org :
 org.apache.xbean.recipe.MissingAccessorException: Unable to find a valid setter method: public void org.apache.openejb.core.mdb.MdbContainer.setServerUrl(java.lang.String)
	at org.apache.xbean.recipe.ObjectRecipe.findSetter(ObjectRecipe.java:692)
	at org.apache.xbean.recipe.ObjectRecipe.setProperty(ObjectRecipe.java:275)
	at org.apache.xbean.recipe.ObjectRecipe.setProperties(ObjectRecipe.java:251)
	at org.apache.xbean.recipe.ObjectRecipe.create(ObjectRecipe.java:198)
	at org.apache.xbean.recipe.AbstractRecipe.create(AbstractRecipe.java:28)
	at org.apache.openejb.assembler.classic.Assembler.createContainer(Assembler.java:604)
	at org.apache.openejb.assembler.classic.Assembler.buildContainerSystem(Assembler.java:293)
	at org.apache.openejb.assembler.classic.Assembler.build(Assembler.java:201)
	at org.apache.openejb.OpenEJB$Instance.<init>(OpenEJB.java:147)
	at org.apache.openejb.OpenEJB.init(OpenEJB.java:280)
	at org.apache.openejb.OpenEJB.init(OpenEJB.java:265)
	at sun.reflect.NativeMethodAccessorImpl.invoke0(Native Method)
	at sun.reflect.NativeMethodAccessorImpl.invoke(NativeMethodAccessorImpl.java:39)
	at sun.reflect.DelegatingMethodAccessorImpl.invoke(DelegatingMethodAccessorImpl.java:25)
	at java.lang.reflect.Method.invoke(Method.java:585)
	at org.apache.openejb.loader.OpenEJBInstance.init(OpenEJBInstance.java:36)
	at org.apache.openejb.client.LocalInitialContextFactory.init(LocalInitialContextFactory.java:56)
	at org.apache.openejb.client.LocalInitialContextFactory.getInitialContext(LocalInitialContextFactory.java:42)
	at javax.naming.spi.NamingManager.getInitialContext(NamingManager.java:667)
	at javax.naming.InitialContext.getDefaultInitCtx(InitialContext.java:247)
	at javax.naming.InitialContext.init(InitialContext.java:223)
	at javax.naming.InitialContext.<init>(InitialContext.java:197)
	at org.apache.openejb.test.HsqldbTestDatabase.start(HsqldbTestDatabase.java:180)
	at org.apache.openejb.test.TestManager.start(TestManager.java:79)
	at org.apache.openejb.iTest.setUp(iTest.java:57)
	at org.apache.openejb.test.TestSuite.run(TestSuite.java:41)
	at sun.reflect.NativeMethodAccessorImpl.invoke0(Native Method)
	at sun.reflect.NativeMethodAccessorImpl.invoke(NativeMethodAccessorImpl.java:39)
	at sun.reflect.DelegatingMethodAccessorImpl.invoke(DelegatingMethodAccessorImpl.java:25)
	at java.lang.reflect.Method.invoke(Method.java:585)
	at org.apache.maven.surefire.junit.JUnitTestSet.execute(JUnitTestSet.java:210)
	at org.apache.maven.surefire.suite.AbstractDirectoryTestSuite.executeTestSet(AbstractDirectoryTestSuite.java:135)
	at org.apache.maven.surefire.suite.AbstractDirectoryTestSuite.execute(AbstractDirectoryTestSuite.java:160)
	at org.apache.maven.surefire.Surefire.run(Surefire.java:81)
	at sun.reflect.NativeMethodAccessorImpl.invoke0(Native Method)
	at sun.reflect.NativeMethodAccessorImpl.invoke(NativeMethodAccessorImpl.java:39)
	at sun.reflect.DelegatingMethodAccessorImpl.invoke(DelegatingMethodAccessorImpl.java:25)
	at java.lang.reflect.Method.invoke(Method.java:585)
	at org.apache.maven.surefire.booter.SurefireBooter.runSuitesInProcess(SurefireBooter.java:182)
	at org.apache.maven.surefire.booter.SurefireBooter.main(SurefireBooter.java:743)

FATAL - OpenEJB has encountered a fatal error and cannot be started: Assembler failed to build the container system.
org.apache.openejb.OpenEJBException: org.apache.xbean.recipe.MissingAccessorException: Unable to find a valid setter method: public void org.apache.openejb.core.mdb.MdbContainer.setServerUrl(java.lang.String): Unable to find a valid setter method: public void org.apache.openejb.core.mdb.MdbContainer.setServerUrl(java.lang.String)
	at org.apache.openejb.assembler.classic.Assembler.build(Assembler.java:214)
	at org.apache.openejb.OpenEJB$Instance.<init>(OpenEJB.java:147)
	at org.apache.openejb.OpenEJB.init(OpenEJB.java:280)
	at org.apache.openejb.OpenEJB.init(OpenEJB.java:265)
	at sun.reflect.NativeMethodAccessorImpl.invoke0(Native Method)
	at sun.reflect.NativeMethodAccessorImpl.invoke(NativeMethodAccessorImpl.java:39)
	at sun.reflect.DelegatingMethodAccessorImpl.invoke(DelegatingMethodAccessorImpl.java:25)
	at java.lang.reflect.Method.invoke(Method.java:585)
	at org.apache.openejb.loader.OpenEJBInstance.init(OpenEJBInstance.java:36)
	at org.apache.openejb.client.LocalInitialContextFactory.init(LocalInitialContextFactory.java:56)
	at org.apache.openejb.client.LocalInitialContextFactory.getInitialContext(LocalInitialContextFactory.java:42)
	at javax.naming.spi.NamingManager.getInitialContext(NamingManager.java:667)
	at javax.naming.InitialContext.getDefaultInitCtx(InitialContext.java:247)
	at javax.naming.InitialContext.init(InitialContext.java:223)
	at javax.naming.InitialContext.<init>(InitialContext.java:197)
	at org.apache.openejb.test.HsqldbTestDatabase.start(HsqldbTestDatabase.java:180)
	at org.apache.openejb.test.TestManager.start(TestManager.java:79)
	at org.apache.openejb.iTest.setUp(iTest.java:57)
	at org.apache.openejb.test.TestSuite.run(TestSuite.java:41)
	at sun.reflect.NativeMethodAccessorImpl.invoke0(Native Method)
	at sun.reflect.NativeMethodAccessorImpl.invoke(NativeMethodAccessorImpl.java:39)
	at sun.reflect.DelegatingMethodAccessorImpl.invoke(DelegatingMethodAccessorImpl.java:25)
	at java.lang.reflect.Method.invoke(Method.java:585)
	at org.apache.maven.surefire.junit.JUnitTestSet.execute(JUnitTestSet.java:210)
	at org.apache.maven.surefire.suite.AbstractDirectoryTestSuite.executeTestSet(AbstractDirectoryTestSuite.java:135)
	at org.apache.maven.surefire.suite.AbstractDirectoryTestSuite.execute(AbstractDirectoryTestSuite.java:160)
	at org.apache.maven.surefire.Surefire.run(Surefire.java:81)
	at sun.reflect.NativeMethodAccessorImpl.invoke0(Native Method)
	at sun.reflect.NativeMethodAccessorImpl.invoke(NativeMethodAccessorImpl.java:39)
	at sun.reflect.DelegatingMethodAccessorImpl.invoke(DelegatingMethodAccessorImpl.java:25)
	at java.lang.reflect.Method.invoke(Method.java:585)
	at org.apache.maven.surefire.booter.SurefireBooter.runSuitesInProcess(SurefireBooter.java:182)
	at org.apache.maven.surefire.booter.SurefireBooter.main(SurefireBooter.java:743)
Caused by: org.apache.xbean.recipe.MissingAccessorException: Unable to find a valid setter method: public void org.apache.openejb.core.mdb.MdbContainer.setServerUrl(java.lang.String)
	at org.apache.xbean.recipe.ObjectRecipe.findSetter(ObjectRecipe.java:692)
	at org.apache.xbean.recipe.ObjectRecipe.setProperty(ObjectRecipe.java:275)
	at org.apache.xbean.recipe.ObjectRecipe.setProperties(ObjectRecipe.java:251)
	at org.apache.xbean.recipe.ObjectRecipe.create(ObjectRecipe.java:198)
	at org.apache.xbean.recipe.AbstractRecipe.create(AbstractRecipe.java:28)
	at org.apache.openejb.assembler.classic.Assembler.createContainer(Assembler.java:604)
	at org.apache.openejb.assembler.classic.Assembler.buildContainerSystem(Assembler.java:293)
	at org.apache.openejb.assembler.classic.Assembler.build(Assembler.java:201)
	... 32 more
Tests run: 1, Failures: 0, Errors: 1, Skipped: 0, Time elapsed: 16.143 sec <<< FAILURE!
Running org.apache.openejb.core.mdb.JmsProxyTest
log4j:WARN No appenders could be found for logger (org.apache.activemq.broker.BrokerService).
log4j:WARN Please initialize the log4j system properly.
Tests run: 1, Failures: 0, Errors: 0, Skipped: 0, Time elapsed: 11.04 sec
Running org.apache.openejb.assembler.classic.JdbcConfigTest
log4j:WARN No appenders could be found for logger (OpenEJB.startup.config).
log4j:WARN Please initialize the log4j system properly.
Tests run: 1, Failures: 0, Errors: 0, Skipped: 0, Time elapsed: 2.323 sec
Running org.apache.openejb.util.ClassesTest
Tests run: 1, Failures: 0, Errors: 0, Skipped: 0, Time elapsed: 0.064 sec
Running org.apache.openejb.core.ivm.naming.IvmContextTest
Tests run: 1, Failures: 0, Errors: 0, Skipped: 0, Time elapsed: 0.149 sec
Running org.apache.openejb.config.JaxbUnmarshallerTest
Tests run: 1, Failures: 0, Errors: 0, Skipped: 0, Time elapsed: 1.923 sec
Running org.apache.openejb.core.stateful.StatefulContainerTest
log4j:WARN No appenders could be found for logger (OpenEJB.startup.config).
log4j:WARN Please initialize the log4j system properly.
Tests run: 2, Failures: 0, Errors: 0, Skipped: 0, Time elapsed: 5.249 sec
Running org.apache.openejb.core.cmp.jpa.JpaTest
Tests run: 2, Failures: 0, Errors: 0, Skipped: 0, Time elapsed: 8.309 sec
Running org.apache.openejb.DependenceValidationTest
Tests run: 1, Failures: 0, Errors: 0, Skipped: 0, Time elapsed: 1.384 sec
Running org.apache.openejb.core.stateful.StatefulSessionBeanTest
log4j:WARN No appenders could be found for logger (OpenEJB.startup.config).
log4j:WARN Please initialize the log4j system properly.
Tests run: 1, Failures: 0, Errors: 0, Skipped: 0, Time elapsed: 4.684 sec
Running org.apache.openejb.core.stateless.CrossClassLoaderProxyTest
log4j:WARN No appenders could be found for logger (OpenEJB).
log4j:WARN Please initialize the log4j system properly.
Tests run: 4, Failures: 0, Errors: 0, Skipped: 0, Time elapsed: 1.069 sec
Running org.apache.openejb.core.stateless.ExtendedInjectionTest
log4j:WARN No appenders could be found for logger (OpenEJB).
log4j:WARN Please initialize the log4j system properly.
Tests run: 2, Failures: 0, Errors: 0, Skipped: 0, Time elapsed: 0.978 sec
Running org.apache.openejb.assembler.classic.RedeployTest
log4j:WARN No appenders could be found for logger (OpenEJB.startup.config).
log4j:WARN Please initialize the log4j system properly.
Tests run: 1, Failures: 0, Errors: 0, Skipped: 0, Time elapsed: 30.357 sec
Running org.apache.openejb.resource.SharedLocalConnectionManagerTest
Tests run: 1, Failures: 0, Errors: 0, Skipped: 0, Time elapsed: 1.2 sec
Running org.apache.openejb.assembler.classic.InterceptorBindingInfoComparatorTest
Tests run: 2, Failures: 0, Errors: 0, Skipped: 0, Time elapsed: 0.169 sec
Running org.apache.openejb.assembler.classic.MdbConfigTest
log4j:WARN No appenders could be found for logger (OpenEJB.startup.config).
log4j:WARN Please initialize the log4j system properly.
Tests run: 1, Failures: 0, Errors: 0, Skipped: 0, Time elapsed: 9.702 sec
Running org.apache.openejb.core.security.PropertiesLoginModuleTest
Path to login config: /x1/continuum/working-directory/158/target/test-classes/login.config
Path to login config: /x1/continuum/working-directory/158/target/test-classes/login.config
Path to login config: /x1/continuum/working-directory/158/target/test-classes/login.config
Tests run: 3, Failures: 0, Errors: 3, Skipped: 0, Time elapsed: 0.302 sec <<< FAILURE!
Running org.apache.openejb.assembler.classic.PersistenceUnitRefTest
Tests run: 1, Failures: 0, Errors: 0, Skipped: 0, Time elapsed: 0.229 sec
Running org.apache.openejb.config.OpenEjb2ConversionTest
log4j:WARN No appenders could be found for logger (OpenEJB).
log4j:WARN Please initialize the log4j system properly.
Tests run: 9, Failures: 0, Errors: 0, Skipped: 0, Time elapsed: 10.19 sec
Running org.apache.openejb.resource.GeronimoConnectionManagerTest
log4j:WARN No appenders could be found for logger (org.apache.geronimo.connector.outbound.AbstractSinglePoolConnectionInterceptor).
log4j:WARN Please initialize the log4j system properly.
Tests run: 1, Failures: 0, Errors: 0, Skipped: 0, Time elapsed: 1.239 sec
Running org.apache.openejb.core.mdb.JmsTest
log4j:WARN No appenders could be found for logger (org.apache.activemq.broker.BrokerService).
log4j:WARN Please initialize the log4j system properly.
Tests run: 1, Failures: 0, Errors: 0, Skipped: 0, Time elapsed: 11.273 sec
Running org.apache.openejb.SomeoneBrokeSurefireAndThisIsADirtyHackForItTest
test server = org.apache.openejb.test.IvmTestServer
entry = java.naming.factory.initial:org.apache.openejb.client.LocalInitialContextFactory
WARN - Unable use logging config as there are 3 file references containing directories which have not been created.  See the list below.
WARN - [0] /x1/continuum/working-directory/158/target/test-classes/conf/logs/transaction.log
WARN - [1] /x1/continuum/working-directory/158/target/test-classes/conf/logs/openejb.log
WARN - [2] /x1/continuum/working-directory/158/target/test-classes/conf/logs/server.log
Apache OpenEJB 3.0-incubating-SNAPSHOT    build: 20070406-05:52
http://incubator.apache.org/openejb
INFO - openejb.home = /x1/continuum/working-directory/158/target/test-classes
INFO - openejb.base = /x1/continuum/working-directory/158/target/test-classes
INFO - Found EjbModule in classpath: /home/continuum/.m2/repository/org/apache/openejb/openejb-itests-beans/3.0-incubating-SNAPSHOT/openejb-itests-beans-3.0-incubating-SNAPSHOT.jar
WARN - Auto-linking res-ref-name 'stateless/references/Resource_manager_access' in bean client/tests/entity/cmp/allowed_operations/EntityHome to Connector(id=Default JDBC Database)
WARN - Auto-linking res-ref-name 'stateless/references/Resource_manager_access' in bean client/tests/entity/cmp2/allowed_operations/EntityHome to Connector(id=Default JDBC Database)
WARN - Auto-linking res-ref-name 'org.apache.openejb.test.stateful.AnnotatedFieldInjectionStatefulBean/daataSource' in bean AnnotatedFieldInjectionStatefulBean to Connector(id=Default JDBC Database)
WARN - Auto-linking res-ref-name 'org.apache.openejb.test.stateful.AnnotatedFieldInjectionStatefulBean/coonnectionFactory' in bean AnnotatedFieldInjectionStatefulBean to Connector(id=Default JMS Connection Factory)
WARN - Auto-linking res-ref-name 'org.apache.openejb.test.stateful.AnnotatedFieldInjectionStatefulBean/queueCoonnectionFactory' in bean AnnotatedFieldInjectionStatefulBean to Connector(id=Default JMS Connection Factory)
WARN - Auto-linking res-ref-name 'org.apache.openejb.test.stateful.AnnotatedFieldInjectionStatefulBean/topicCoonnectionFactory' in bean AnnotatedFieldInjectionStatefulBean to Connector(id=Default JMS Connection Factory)
WARN - Auto-linking res-ref-name 'org.apache.openejb.test.stateless.AnnotatedFieldInjectionStatelessBean/daataSource' in bean AnnotatedFieldInjectionStatelessBean to Connector(id=Default JDBC Database)
WARN - Auto-linking res-ref-name 'org.apache.openejb.test.stateless.AnnotatedFieldInjectionStatelessBean/coonnectionFactory' in bean AnnotatedFieldInjectionStatelessBean to Connector(id=Default JMS Connection Factory)
WARN - Auto-linking res-ref-name 'org.apache.openejb.test.stateless.AnnotatedFieldInjectionStatelessBean/queueCoonnectionFactory' in bean AnnotatedFieldInjectionStatelessBean to Connector(id=Default JMS Connection Factory)
WARN - Auto-linking res-ref-name 'org.apache.openejb.test.stateless.AnnotatedFieldInjectionStatelessBean/topicCoonnectionFactory' in bean AnnotatedFieldInjectionStatelessBean to Connector(id=Default JMS Connection Factory)
WARN - Auto-linking res-ref-name 'org.apache.openejb.test.mdb.AnnotatedFieldInjectionMdbBean/daataSource' in bean AnnotatedFieldInjectionMdbBean to Connector(id=Default JDBC Database)
WARN - Auto-linking res-ref-name 'org.apache.openejb.test.mdb.AnnotatedFieldInjectionMdbBean/coonnectionFactory' in bean AnnotatedFieldInjectionMdbBean to Connector(id=Default JMS Connection Factory)
WARN - Auto-linking res-ref-name 'org.apache.openejb.test.mdb.AnnotatedFieldInjectionMdbBean/queueCoonnectionFactory' in bean AnnotatedFieldInjectionMdbBean to Connector(id=Default JMS Connection Factory)
WARN - Auto-linking res-ref-name 'org.apache.openejb.test.mdb.AnnotatedFieldInjectionMdbBean/topicCoonnectionFactory' in bean AnnotatedFieldInjectionMdbBean to Connector(id=Default JMS Connection Factory)
log4j:WARN No appenders could be found for logger (org.apache.activemq.broker.BrokerService).
log4j:WARN Please initialize the log4j system properly.
ERROR - FATAL ERROR: Unknown error in Assembler.  Please send the following stack trace and this message to user@openejb.org :
 org.apache.xbean.recipe.MissingAccessorException: Unable to find a valid setter method: public void org.apache.openejb.core.mdb.MdbContainer.setServerUrl(java.lang.String)
	at org.apache.xbean.recipe.ObjectRecipe.findSetter(ObjectRecipe.java:692)
	at org.apache.xbean.recipe.ObjectRecipe.setProperty(ObjectRecipe.java:275)
	at org.apache.xbean.recipe.ObjectRecipe.setProperties(ObjectRecipe.java:251)
	at org.apache.xbean.recipe.ObjectRecipe.create(ObjectRecipe.java:198)
	at org.apache.xbean.recipe.AbstractRecipe.create(AbstractRecipe.java:28)
	at org.apache.openejb.assembler.classic.Assembler.createContainer(Assembler.java:604)
	at org.apache.openejb.assembler.classic.Assembler.buildContainerSystem(Assembler.java:293)
	at org.apache.openejb.assembler.classic.Assembler.build(Assembler.java:201)
	at org.apache.openejb.OpenEJB$Instance.<init>(OpenEJB.java:147)
	at org.apache.openejb.OpenEJB.init(OpenEJB.java:280)
	at org.apache.openejb.OpenEJB.init(OpenEJB.java:265)
	at sun.reflect.NativeMethodAccessorImpl.invoke0(Native Method)
	at sun.reflect.NativeMethodAccessorImpl.invoke(NativeMethodAccessorImpl.java:39)
	at sun.reflect.DelegatingMethodAccessorImpl.invoke(DelegatingMethodAccessorImpl.java:25)
	at java.lang.reflect.Method.invoke(Method.java:585)
	at org.apache.openejb.loader.OpenEJBInstance.init(OpenEJBInstance.java:36)
	at org.apache.openejb.client.LocalInitialContextFactory.init(LocalInitialContextFactory.java:56)
	at org.apache.openejb.client.LocalInitialContextFactory.getInitialContext(LocalInitialContextFactory.java:42)
	at javax.naming.spi.NamingManager.getInitialContext(NamingManager.java:667)
	at javax.naming.InitialContext.getDefaultInitCtx(InitialContext.java:247)
	at javax.naming.InitialContext.init(InitialContext.java:223)
	at javax.naming.InitialContext.<init>(InitialContext.java:197)
	at org.apache.openejb.test.HsqldbTestDatabase.start(HsqldbTestDatabase.java:180)
	at org.apache.openejb.test.TestManager.start(TestManager.java:79)
	at org.apache.openejb.iTest.setUp(iTest.java:57)
	at org.apache.openejb.test.TestSuite.run(TestSuite.java:41)
	at sun.reflect.NativeMethodAccessorImpl.invoke0(Native Method)
	at sun.reflect.NativeMethodAccessorImpl.invoke(NativeMethodAccessorImpl.java:39)
	at sun.reflect.DelegatingMethodAccessorImpl.invoke(DelegatingMethodAccessorImpl.java:25)
	at java.lang.reflect.Method.invoke(Method.java:585)
	at org.apache.maven.surefire.junit.JUnitTestSet.execute(JUnitTestSet.java:210)
	at org.apache.maven.surefire.suite.AbstractDirectoryTestSuite.executeTestSet(AbstractDirectoryTestSuite.java:135)
	at org.apache.maven.surefire.suite.AbstractDirectoryTestSuite.execute(AbstractDirectoryTestSuite.java:160)
	at org.apache.maven.surefire.Surefire.run(Surefire.java:81)
	at sun.reflect.NativeMethodAccessorImpl.invoke0(Native Method)
	at sun.reflect.NativeMethodAccessorImpl.invoke(NativeMethodAccessorImpl.java:39)
	at sun.reflect.DelegatingMethodAccessorImpl.invoke(DelegatingMethodAccessorImpl.java:25)
	at java.lang.reflect.Method.invoke(Method.java:585)
	at org.apache.maven.surefire.booter.SurefireBooter.runSuitesInProcess(SurefireBooter.java:182)
	at org.apache.maven.surefire.booter.SurefireBooter.main(SurefireBooter.java:743)

FATAL - OpenEJB has encountered a fatal error and cannot be started: Assembler failed to build the container system.
org.apache.openejb.OpenEJBException: org.apache.xbean.recipe.MissingAccessorException: Unable to find a valid setter method: public void org.apache.openejb.core.mdb.MdbContainer.setServerUrl(java.lang.String): Unable to find a valid setter method: public void org.apache.openejb.core.mdb.MdbContainer.setServerUrl(java.lang.String)
	at org.apache.openejb.assembler.classic.Assembler.build(Assembler.java:214)
	at org.apache.openejb.OpenEJB$Instance.<init>(OpenEJB.java:147)
	at org.apache.openejb.OpenEJB.init(OpenEJB.java:280)
	at org.apache.openejb.OpenEJB.init(OpenEJB.java:265)
	at sun.reflect.NativeMethodAccessorImpl.invoke0(Native Method)
	at sun.reflect.NativeMethodAccessorImpl.invoke(NativeMethodAccessorImpl.java:39)
	at sun.reflect.DelegatingMethodAccessorImpl.invoke(DelegatingMethodAccessorImpl.java:25)
	at java.lang.reflect.Method.invoke(Method.java:585)
	at org.apache.openejb.loader.OpenEJBInstance.init(OpenEJBInstance.java:36)
	at org.apache.openejb.client.LocalInitialContextFactory.init(LocalInitialContextFactory.java:56)
	at org.apache.openejb.client.LocalInitialContextFactory.getInitialContext(LocalInitialContextFactory.java:42)
	at javax.naming.spi.NamingManager.getInitialContext(NamingManager.java:667)
	at javax.naming.InitialContext.getDefaultInitCtx(InitialContext.java:247)
	at javax.naming.InitialContext.init(InitialContext.java:223)
	at javax.naming.InitialContext.<init>(InitialContext.java:197)
	at org.apache.openejb.test.HsqldbTestDatabase.start(HsqldbTestDatabase.java:180)
	at org.apache.openejb.test.TestManager.start(TestManager.java:79)
	at org.apache.openejb.iTest.setUp(iTest.java:57)
	at org.apache.openejb.test.TestSuite.run(TestSuite.java:41)
	at sun.reflect.NativeMethodAccessorImpl.invoke0(Native Method)
	at sun.reflect.NativeMethodAccessorImpl.invoke(NativeMethodAccessorImpl.java:39)
	at sun.reflect.DelegatingMethodAccessorImpl.invoke(DelegatingMethodAccessorImpl.java:25)
	at java.lang.reflect.Method.invoke(Method.java:585)
	at org.apache.maven.surefire.junit.JUnitTestSet.execute(JUnitTestSet.java:210)
	at org.apache.maven.surefire.suite.AbstractDirectoryTestSuite.executeTestSet(AbstractDirectoryTestSuite.java:135)
	at org.apache.maven.surefire.suite.AbstractDirectoryTestSuite.execute(AbstractDirectoryTestSuite.java:160)
	at org.apache.maven.surefire.Surefire.run(Surefire.java:81)
	at sun.reflect.NativeMethodAccessorImpl.invoke0(Native Method)
	at sun.reflect.NativeMethodAccessorImpl.invoke(NativeMethodAccessorImpl.java:39)
	at sun.reflect.DelegatingMethodAccessorImpl.invoke(DelegatingMethodAccessorImpl.java:25)
	at java.lang.reflect.Method.invoke(Method.java:585)
	at org.apache.maven.surefire.booter.SurefireBooter.runSuitesInProcess(SurefireBooter.java:182)
	at org.apache.maven.surefire.booter.SurefireBooter.main(SurefireBooter.java:743)
Caused by: org.apache.xbean.recipe.MissingAccessorException: Unable to find a valid setter method: public void org.apache.openejb.core.mdb.MdbContainer.setServerUrl(java.lang.String)
	at org.apache.xbean.recipe.ObjectRecipe.findSetter(ObjectRecipe.java:692)
	at org.apache.xbean.recipe.ObjectRecipe.setProperty(ObjectRecipe.java:275)
	at org.apache.xbean.recipe.ObjectRecipe.setProperties(ObjectRecipe.java:251)
	at org.apache.xbean.recipe.ObjectRecipe.create(ObjectRecipe.java:198)
	at org.apache.xbean.recipe.AbstractRecipe.create(AbstractRecipe.java:28)
	at org.apache.openejb.assembler.classic.Assembler.createContainer(Assembler.java:604)
	at org.apache.openejb.assembler.classic.Assembler.buildContainerSystem(Assembler.java:293)
	at org.apache.openejb.assembler.classic.Assembler.build(Assembler.java:201)
	... 32 more
Tests run: 1, Failures: 0, Errors: 1, Skipped: 0, Time elapsed: 15.343 sec <<< FAILURE!
Running org.apache.openejb.iTest
Tests run: 0, Failures: 0, Errors: 0, Skipped: 0, Time elapsed: 0.035 sec
Running org.apache.openejb.core.stateless.StatelessContainerTest
log4j:WARN No appenders could be found for logger (OpenEJB).
log4j:WARN Please initialize the log4j system properly.
Tests run: 3, Failures: 0, Errors: 0, Skipped: 0, Time elapsed: 0.893 sec
Running org.apache.openejb.core.TemporaryClassLoaderTest
Tests run: 1, Failures: 0, Errors: 0, Skipped: 0, Time elapsed: 0.236 sec
Running org.apache.openejb.core.security.SecurityTest
log4j:WARN No appenders could be found for logger (OpenEJB.startup.config).
log4j:WARN Please initialize the log4j system properly.
Tests run: 1, Failures: 0, Errors: 1, Skipped: 0, Time elapsed: 4.329 sec <<< FAILURE!
Running org.apache.openejb.assembler.classic.OpenEjbConfigurationValidationTest
Tests run: 1, Failures: 0, Errors: 0, Skipped: 0, Time elapsed: 0.227 sec

Results :
Tests run: 76, Failures: 0, Errors: 6, Skipped: 0

[INFO] ------------------------------------------------------------------------
[ERROR] BUILD FAILURE
[INFO] ------------------------------------------------------------------------
[INFO] There are test failures.
[INFO] ------------------------------------------------------------------------
[INFO] For more information, run Maven with the -e switch
[INFO] ------------------------------------------------------------------------
[INFO] Total time: 5 minutes 36 seconds
[INFO] Finished at: Fri Apr 06 05:57:54 PDT 2007
[INFO] Final Memory: 15M/33M
[INFO] ------------------------------------------------------------------------

****************************************************************************



Mime
View raw message