tomcat-users mailing list archives

Site index · List index
Message view « Date » · « Thread »
Top « Date » · « Thread »
From "sun" <ju...@silkroute.com>
Subject flex in compiling of mod_jk.so
Date Fri, 12 Jan 2001 19:51:37 GMT
hi, 
when I compile mod_jk.so, got error 
"make[4]: flex: Command not found
make[4]: *** [ssl_expr_scan.c] Error 127
make[3]: *** [all] Error 1
make[2]: *** [subdirs] Error 1
make[2]: Leaving directory `/export/home/download/apache_1.3.14/src'
make[1]: *** [build-std] Error 2
make[1]: Leaving directory `/export/home/download/apache_1.3.14'
make: *** [build] Error 2"

where is flex? what is that?

thanks.

rgds
sun


Mime
View raw message