tomcat-dev mailing list archives

Site index · List index
Message view « Date » · « Thread »
Top « Date » · « Thread »
From Gump <bay...@apache.org>
Subject [GUMP@vmgump-vm3]: Project taglibs-standard-spec (in module tomcat-taglibs) failed
Date Thu, 30 Nov 2017 01:24:09 GMT
To whom it may engage...
        
This is an automated request, but not an unsolicited one. For 
more information please visit http://gump.apache.org/nagged.html, 
and/or contact the folk at general@gump.apache.org.

Project taglibs-standard-spec has an issue affecting its community integration.
This issue affects 1 projects,
 and has been outstanding for 140 runs.
The current state of this project is 'Failed', with reason 'Build Failed'.
For reference only, the following projects are affected by this:
    - taglibs-standard-spec :  JSP Taglibs


Full details are available at:
    http://vmgump-vm3.apache.org/tomcat-taglibs/taglibs-standard-spec/index.html

That said, some information snippets are provided here.

The following annotations (debug/informational/warning/error messages) were provided:
 -DEBUG- Sole jar output [taglibs-standard-spec-*[0-9T].jar] identifier set to project name
 -DEBUG- (Apache Gump generated) Apache Maven Settings in: /srv/gump/public/workspace/tomcat-taglibs/standard/spec/gump_mvn_settings.xml
 -INFO- Failed with reason build failed
 -DEBUG- Maven POM in: /srv/gump/public/workspace/tomcat-taglibs/standard/spec/pom.xml
 -INFO- Failed to extract fallback artifacts from Gump Repository



The following work was performed:
http://vmgump-vm3.apache.org/tomcat-taglibs/taglibs-standard-spec/gump_work/build_tomcat-taglibs_taglibs-standard-spec.html
Work Name: build_tomcat-taglibs_taglibs-standard-spec (Type: Build)
Work ended in a state of : Failed
Elapsed: 3 secs
Command Line: /opt/maven3/bin/mvn --batch-mode --settings /srv/gump/public/workspace/tomcat-taglibs/standard/spec/gump_mvn_settings.xml
install 
[Working Directory: /srv/gump/public/workspace/tomcat-taglibs/standard/spec]
M2_HOME: /opt/maven3
---------------------------------------------
[INFO] Scanning for projects...
[INFO] Downloading: http://localhost:8192/maven2/org/apache/taglibs/taglibs-parent/3/taglibs-parent-3.pom
[INFO] Downloaded: http://localhost:8192/maven2/org/apache/taglibs/taglibs-parent/3/taglibs-parent-3.pom
(8 KB at 57.6 KB/sec)
[WARNING] 
[WARNING] Some problems were encountered while building the effective model for org.apache.taglibs:taglibs-standard-spec:bundle:1.2.6-SNAPSHOT
[WARNING] 'parent.relativePath' of POM org.apache.taglibs:taglibs-standard:1.2.6-SNAPSHOT
(/srv/gump/public/workspace/tomcat-taglibs/standard/pom.xml) points at org.apache.tomcat.taglibs:taglibs-aggregator
instead of org.apache.taglibs:taglibs-parent, please verify your project structure @ org.apache.taglibs:taglibs-standard:1.2.6-SNAPSHOT,
/srv/gump/public/workspace/tomcat-taglibs/standard/pom.xml, line 23, column 11
[WARNING] 
[WARNING] It is highly recommended to fix these problems because they threaten the stability
of your build.
[WARNING] 
[WARNING] For this reason, future Maven versions might no longer support building such malformed
projects.
[WARNING] 
[INFO]                                                                         
[INFO] ------------------------------------------------------------------------
[INFO] Building Apache Standard Taglib Specification API 1.2.6-SNAPSHOT
[INFO] ------------------------------------------------------------------------
[INFO] Downloading: http://localhost:8192/maven2/org/apache/maven/plugins/maven-surefire-plugin/2.15/maven-surefire-plugin-2.15.pom
[INFO] Downloaded: http://localhost:8192/maven2/org/apache/maven/plugins/maven-surefire-plugin/2.15/maven-surefire-plugin-2.15.pom
(6 KB at 150.0 KB/sec)
[INFO] Downloading: http://localhost:8192/maven2/org/apache/maven/surefire/surefire/2.15/surefire-2.15.pom
[INFO] Downloaded: http://localhost:8192/maven2/org/apache/maven/surefire/surefire/2.15/surefire-2.15.pom
(19 KB at 465.0 KB/sec)
[INFO] Downloading: http://localhost:8192/maven2/org/apache/maven/plugins/maven-surefire-plugin/2.15/maven-surefire-plugin-2.15.jar
[INFO] Downloaded: http://localhost:8192/maven2/org/apache/maven/plugins/maven-surefire-plugin/2.15/maven-surefire-plugin-2.15.jar
(32 KB at 829.6 KB/sec)
[INFO] Downloading: http://localhost:8192/maven2/javax/servlet/jsp/jsp-api/2.1/jsp-api-2.1.pom
[INFO] Downloaded: http://localhost:8192/maven2/javax/servlet/jsp/jsp-api/2.1/jsp-api-2.1.pom
(157 B at 3.9 KB/sec)
[INFO] Downloading: http://localhost:8192/maven2/javax/el/el-api/1.0/el-api-1.0.pom
[INFO] Downloaded: http://localhost:8192/maven2/javax/el/el-api/1.0/el-api-1.0.pom (184 B
at 4.6 KB/sec)
[INFO] Downloading: http://localhost:8192/maven2/org/easymock/easymock/3.0/easymock-3.0.pom
[INFO] Downloaded: http://localhost:8192/maven2/org/easymock/easymock/3.0/easymock-3.0.pom
(6 KB at 488.9 KB/sec)
[INFO] Downloading: http://localhost:8192/maven2/javax/servlet/jsp/jsp-api/2.1/jsp-api-2.1.jar
[INFO] Downloading: http://localhost:8192/maven2/javax/el/el-api/1.0/el-api-1.0.jar
[INFO] Downloading: http://localhost:8192/maven2/org/easymock/easymock/3.0/easymock-3.0.jar
[INFO] Downloaded: http://localhost:8192/maven2/org/easymock/easymock/3.0/easymock-3.0.jar
(554 KB at 11074.4 KB/sec)
[INFO] Downloaded: http://localhost:8192/maven2/javax/servlet/jsp/jsp-api/2.1/jsp-api-2.1.jar
(99 KB at 1346.3 KB/sec)
[INFO] ------------------------------------------------------------------------
[INFO] BUILD FAILURE
[INFO] ------------------------------------------------------------------------
[INFO] Total time: 2.378 s
[INFO] Finished at: 2017-11-30T01:24:09+00:00
[INFO] Final Memory: 13M/152M
[INFO] ------------------------------------------------------------------------
[ERROR] Failed to execute goal on project taglibs-standard-spec: Could not resolve dependencies
for project org.apache.taglibs:taglibs-standard-spec:bundle:1.2.6-SNAPSHOT: Could not transfer
artifact javax.el:el-api:jar:1.0 from/to gump-central (http://localhost:8192/maven2): TransferFailedException:
ClientProtocolException: Status line contains invalid status code: HTTP/1.1 :01 :01 ->
[Help 1]
[ERROR] 
[ERROR] To see the full stack trace of the errors, re-run Maven with the -e switch.
[ERROR] Re-run Maven using the -X switch to enable full debug logging.
[ERROR] 
[ERROR] For more information about the errors and possible solutions, please read the following
articles:
[ERROR] [Help 1] http://cwiki.apache.org/confluence/display/MAVEN/DependencyResolutionException
---------------------------------------------

To subscribe to this information via syndicated feeds:
- RSS: http://vmgump-vm3.apache.org/tomcat-taglibs/taglibs-standard-spec/rss.xml
- Atom: http://vmgump-vm3.apache.org/tomcat-taglibs/taglibs-standard-spec/atom.xml

============================== Gump Tracking Only ===
Produced by Apache Gump(TM) version 2.3.
Gump Run 20171130000010, vmgump-vm3.apache.org:vmgump:20171130000010
Gump E-mail Identifier (unique within run) #3.

--
Apache Gump
http://gump.apache.org/ [Instance: vmgump-vm3]

---------------------------------------------------------------------
To unsubscribe, e-mail: dev-unsubscribe@tomcat.apache.org
For additional commands, e-mail: dev-help@tomcat.apache.org


Mime
View raw message