tomcat-dev mailing list archives

Site index · List index
Message view « Date » · « Thread »
Top « Date » · « Thread »
From Bill Barker <billbar...@apache.org>
Subject [GUMP@vmgump]: Project tomcat-tc8.0.x-test-apr (in module tomcat-8.0.x) failed
Date Tue, 01 Dec 2015 05:05:10 GMT
To whom it may engage...
        
This is an automated request, but not an unsolicited one. For 
more information please visit http://gump.apache.org/nagged.html, 
and/or contact the folk at general@gump.apache.org.

Project tomcat-tc8.0.x-test-apr has an issue affecting its community integration.
This issue affects 1 projects.
The current state of this project is 'Failed', with reason 'Build Failed'.
For reference only, the following projects are affected by this:
    - tomcat-tc8.0.x-test-apr :  Tomcat 8.x, a web server implementing the Java Servlet 3.1,
...


Full details are available at:
    http://vmgump.apache.org/gump/public/tomcat-8.0.x/tomcat-tc8.0.x-test-apr/index.html

That said, some information snippets are provided here.

The following annotations (debug/informational/warning/error messages) were provided:
 -DEBUG- Dependency on commons-daemon exists, no need to add for property commons-daemon.native.src.tgz.
 -DEBUG- Dependency on commons-daemon exists, no need to add for property tomcat-native.tar.gz.
 -INFO- Failed with reason build failed
 -INFO- Project Reports in: /srv/gump/public/workspace/tomcat-8.0.x/output/logs-APR
 -INFO- Project Reports in: /srv/gump/public/workspace/tomcat-8.0.x/output/test-tmp-APR/logs
 -WARNING- No directory [/srv/gump/public/workspace/tomcat-8.0.x/output/test-tmp-APR/logs]



The following work was performed:
http://vmgump.apache.org/gump/public/tomcat-8.0.x/tomcat-tc8.0.x-test-apr/gump_work/build_tomcat-8.0.x_tomcat-tc8.0.x-test-apr.html
Work Name: build_tomcat-8.0.x_tomcat-tc8.0.x-test-apr (Type: Build)
Work ended in a state of : Failed
Elapsed: 39 mins 12 secs
Command Line: /usr/lib/jvm/java-8-oracle/bin/java -Djava.awt.headless=true -Dbuild.sysclasspath=only
org.apache.tools.ant.Main -Dgump.merge=/srv/gump/public/gump/work/merge.xml -Djunit.jar=/srv/gump/public/workspace/junit/target/junit-4.13-SNAPSHOT.jar
-Dobjenesis.jar=/srv/gump/public/workspace/objenesis/main/target/objenesis-2.3-SNAPSHOT.jar
-Dtest.reports=output/logs-APR -Dtomcat-native.tar.gz=/srv/gump/public/workspace/apache-commons/daemon/dist/bin/commons-daemon-20151201-native-src.tar.gz
-Dexamples.sources.skip=true -Djdt.jar=/srv/gump/packages/eclipse/plugins/R-4.5-201506032000/ecj-4.5.jar
-Dtest.apr.loc=/srv/gump/public/workspace/tomcat-native/dest-20151201/lib -Dcommons-daemon.jar=/srv/gump/public/workspace/apache-commons/daemon/dist/commons-daemon-20151201.jar
-Dcommons-daemon.native.src.tgz=/srv/gump/public/workspace/apache-commons/daemon/dist/bin/commons-daemon-20151201-native-src.tar.gz
-Dtest.temp=output/test-tmp-APR -Dtest.accesslog=true -Dexecute.test.nio=false -Dtest
 .openssl.path=/srv/gump/public/workspace/openssl-1.0.2/dest-20151201/bin/openssl -Dexecute.test.bio=false
-Dexecute.test.apr=true -Dtest.excludePerformance=true -Dexecute.test.nio2=false -Deasymock.jar=/srv/gump/public/workspace/easymock/core/target/easymock-3.5-SNAPSHOT.jar
-Dhamcrest.jar=/srv/gump/packages/hamcrest/hamcrest-core-1.3.jar -Dcglib.jar=/srv/gump/packages/cglib/cglib-nodep-2.2.jar
test 
[Working Directory: /srv/gump/public/workspace/tomcat-8.0.x]
CLASSPATH: /usr/lib/jvm/java-8-oracle/lib/tools.jar:/srv/gump/public/workspace/tomcat-8.0.x/output/build/webapps/examples/WEB-INF/classes:/srv/gump/public/workspace/tomcat-8.0.x/output/testclasses:/srv/gump/public/workspace/ant/dist/lib/ant.jar:/srv/gump/public/workspace/ant/dist/lib/ant-launcher.jar:/srv/gump/public/workspace/ant/dist/lib/ant-jmf.jar:/srv/gump/public/workspace/ant/dist/lib/ant-junit.jar:/srv/gump/public/workspace/ant/dist/lib/ant-junit4.jar:/srv/gump/public/workspace/ant/dist/lib/ant-swing.jar:/srv/gump/public/workspace/ant/dist/lib/ant-apache-resolver.jar:/srv/gump/public/workspace/ant/dist/lib/ant-apache-xalan2.jar:/srv/gump/public/workspace/xml-commons/java/build/resolver.jar:/srv/gump/public/workspace/tomcat-8.0.x/output/build/bin/bootstrap.jar:/srv/gump/public/workspace/tomcat-8.0.x/output/build/bin/tomcat-juli.jar:/srv/gump/public/workspace/tomcat-8.0.x/output/build/lib/annotations-api.jar:/srv/gump/public/workspace/tomcat-8.0.x/output/build/lib/servlet-api.ja
 r:/srv/gump/public/workspace/tomcat-8.0.x/output/build/lib/jsp-api.jar:/srv/gump/public/workspace/tomcat-8.0.x/output/build/lib/el-api.jar:/srv/gump/public/workspace/tomcat-8.0.x/output/build/lib/websocket-api.jar:/srv/gump/public/workspace/tomcat-8.0.x/output/build/lib/catalina.jar:/srv/gump/public/workspace/tomcat-8.0.x/output/build/lib/catalina-ant.jar:/srv/gump/public/workspace/tomcat-8.0.x/output/build/lib/catalina-storeconfig.jar:/srv/gump/public/workspace/tomcat-8.0.x/output/build/lib/tomcat-coyote.jar:/srv/gump/public/workspace/tomcat-8.0.x/output/build/lib/jasper.jar:/srv/gump/public/workspace/tomcat-8.0.x/output/build/lib/jasper-el.jar:/srv/gump/public/workspace/tomcat-8.0.x/output/build/lib/catalina-tribes.jar:/srv/gump/public/workspace/tomcat-8.0.x/output/build/lib/catalina-ha.jar:/srv/gump/public/workspace/tomcat-8.0.x/output/build/lib/tomcat-api.jar:/srv/gump/public/workspace/tomcat-8.0.x/output/build/lib/tomcat-jni.jar:/srv/gump/public/workspace/tomcat-8.0.x/output/bu
 ild/lib/tomcat-util.jar:/srv/gump/public/workspace/tomcat-8.0.x/output/build/lib/tomcat-util-scan.jar:/srv/gump/public/workspace/tomcat-8.0.x/output/build/lib/tomcat-websocket.jar:/srv/gump/public/workspace/tomcat-8.0.x/output/build/lib/tomcat-i18n-es.jar:/srv/gump/public/workspace/tomcat-8.0.x/output/build/lib/tomcat-i18n-fr.jar:/srv/gump/public/workspace/tomcat-8.0.x/output/build/lib/tomcat-i18n-ja.jar:/srv/gump/packages/eclipse/plugins/R-4.5-201506032000/ecj-4.5.jar:/srv/gump/public/workspace/apache-commons/daemon/dist/commons-daemon-20151201.jar:/srv/gump/public/workspace/junit/target/junit-4.13-SNAPSHOT.jar:/srv/gump/packages/hamcrest/hamcrest-core-1.3.jar:/srv/gump/packages/cglib/cglib-nodep-2.2.jar:/srv/gump/public/workspace/objenesis/main/target/objenesis-2.3-SNAPSHOT.jar:/srv/gump/public/workspace/easymock/core/target/easymock-3.5-SNAPSHOT.jar
---------------------------------------------
    [junit] 	at java.util.concurrent.FutureTask.run(FutureTask.java:266)
    [junit] 	at java.util.concurrent.ThreadPoolExecutor.runWorker(ThreadPoolExecutor.java:1142)
    [junit] 	at java.util.concurrent.ThreadPoolExecutor$Worker.run(ThreadPoolExecutor.java:617)
    [junit] 	at java.lang.Thread.run(Thread.java:745)
    [junit] Caused by: java.util.concurrent.ExecutionException: java.io.IOException: Unable
to write the complete message as the WebSocket connection has been closed
    [junit] 	at org.apache.tomcat.websocket.FutureToSendHandler.get(FutureToSendHandler.java:102)
    [junit] 	at org.apache.tomcat.websocket.WsRemoteEndpointImplBase.startMessageBlock(WsRemoteEndpointImplBase.java:275)
    [junit] 	... 15 more
    [junit] Caused by: java.io.IOException: Unable to write the complete message as the WebSocket
connection has been closed
    [junit] 	at org.apache.tomcat.websocket.WsSession.registerFuture(WsSession.java:658)
    [junit] 	at org.apache.tomcat.websocket.FutureToSendHandler.get(FutureToSendHandler.java:92)
    [junit] 	... 16 more
    [junit] 
    [junit] 01-Dec-2015 05:05:07.305 INFO [main] org.apache.coyote.AbstractProtocol.stop Stopping
ProtocolHandler ["http-apr-127.0.0.1-auto-2-47395"]
    [junit] 01-Dec-2015 05:05:07.359 INFO [main] org.apache.coyote.AbstractProtocol.destroy
Destroying ProtocolHandler ["http-apr-127.0.0.1-auto-2-47395"]
    [junit] 01-Dec-2015 05:05:07.365 INFO [main] org.apache.catalina.startup.LoggingBaseTest.setUp
Starting test case [testSpecExample3]
    [junit] 01-Dec-2015 05:05:07.376 INFO [main] org.apache.coyote.AbstractProtocol.destroy
Destroying ProtocolHandler ["http-apr-127.0.0.1-auto-3"]
    [junit] 01-Dec-2015 05:05:07.381 INFO [main] org.apache.catalina.startup.LoggingBaseTest.setUp
Starting test case [testSpecExample4]
    [junit] 01-Dec-2015 05:05:07.387 INFO [main] org.apache.coyote.AbstractProtocol.destroy
Destroying ProtocolHandler ["http-apr-127.0.0.1-auto-4"]
    [junit] 01-Dec-2015 05:05:07.390 INFO [main] org.apache.catalina.startup.LoggingBaseTest.setUp
Starting test case [testDuplicatePaths_01]
    [junit] Tests run: 8, Failures: 0, Errors: 0, Skipped: 0, Time elapsed: 4.059 sec
    [junit] 01-Dec-2015 05:05:07.396 INFO [main] org.apache.coyote.AbstractProtocol.destroy
Destroying ProtocolHandler ["http-apr-127.0.0.1-auto-5"]
    [junit] 01-Dec-2015 05:05:07.397 INFO [main] org.apache.catalina.startup.LoggingBaseTest.setUp
Starting test case [testDuplicatePaths_02]
    [junit] 01-Dec-2015 05:05:07.403 INFO [main] org.apache.coyote.AbstractProtocol.destroy
Destroying ProtocolHandler ["http-apr-127.0.0.1-auto-6"]
    [junit] 01-Dec-2015 05:05:07.404 INFO [main] org.apache.catalina.startup.LoggingBaseTest.setUp
Starting test case [testDuplicatePaths_03]
    [junit] 01-Dec-2015 05:05:07.407 INFO [main] org.apache.coyote.AbstractProtocol.destroy
Destroying ProtocolHandler ["http-apr-127.0.0.1-auto-7"]
    [junit] 01-Dec-2015 05:05:07.408 INFO [main] org.apache.catalina.startup.LoggingBaseTest.setUp
Starting test case [testDuplicatePaths_04]
    [junit] 01-Dec-2015 05:05:07.412 INFO [main] org.apache.coyote.AbstractProtocol.destroy
Destroying ProtocolHandler ["http-apr-127.0.0.1-auto-8"]
    [junit] Running util.TestCookieFilter
    [junit] Tests run: 10, Failures: 0, Errors: 0, Skipped: 0, Time elapsed: 0.092 sec

cobertura-report:

test:
   [concat] Testsuites with skipped tests:
   [concat] TEST-org.apache.catalina.connector.TestRequest.APR.txt
   [concat] TEST-org.apache.catalina.loader.TestWebappClassLoaderThreadLocalMemoryLeak.APR.txt
   [concat] TEST-org.apache.tomcat.util.net.TestClientCert.APR.txt
   [concat] TEST-org.apache.tomcat.util.net.TestCustomSsl.APR.txt
   [concat] TEST-org.apache.tomcat.util.net.TestSsl.APR.txt
   [concat] TEST-org.apache.tomcat.util.net.jsse.openssl.TestOpenSSLCipherConfigurationParser.APR.txt
   [concat] TEST-org.apache.tomcat.websocket.TestWsWebSocketContainerWithProxy.APR.txt
   [concat] TEST-org.apache.tomcat.websocket.server.TestWsRemoteEndpointImplServer.APR.txt
   [concat] Testsuites with failed tests:
   [concat] TEST-org.apache.catalina.core.TestAsyncContextImpl.APR.txt

BUILD FAILED
/srv/gump/public/workspace/tomcat-8.0.x/build.xml:1368: Some tests completed with a Failure.
See /srv/gump/public/workspace/tomcat-8.0.x/output/build/logs for details, search for "FAILED".

Total time: 39 minutes 12 seconds
---------------------------------------------

To subscribe to this information via syndicated feeds:
- RSS: http://vmgump.apache.org/gump/public/tomcat-8.0.x/tomcat-tc8.0.x-test-apr/rss.xml
- Atom: http://vmgump.apache.org/gump/public/tomcat-8.0.x/tomcat-tc8.0.x-test-apr/atom.xml

============================== Gump Tracking Only ===
Produced by Apache Gump(TM) version 2.3.
Gump Run 20151201000010, vmgump.apache.org:vmgump:20151201000010
Gump E-mail Identifier (unique within run) #3.

--
Apache Gump
http://gump.apache.org/ [Instance: vmgump]

---------------------------------------------------------------------
To unsubscribe, e-mail: dev-unsubscribe@tomcat.apache.org
For additional commands, e-mail: dev-help@tomcat.apache.org


Mime
View raw message