tomcat-dev mailing list archives

Site index · List index
Message view « Date » · « Thread »
Top « Date » · « Thread »
From Bill Barker <billbar...@apache.org>
Subject [GUMP@vmgump]: Project tomcat-trunk-test (in module tomcat-trunk) failed
Date Fri, 27 May 2011 09:06:16 GMT
To whom it may engage...
        
This is an automated request, but not an unsolicited one. For 
more information please visit http://gump.apache.org/nagged.html, 
and/or contact the folk at general@gump.apache.org.

Project tomcat-trunk-test has an issue affecting its community integration.
This issue affects 1 projects.
The current state of this project is 'Failed', with reason 'Build Failed'.
For reference only, the following projects are affected by this:
    - tomcat-trunk-test :  Tomcat 7.x, a web server implementing Java Servlet 3.0,
    ...


Full details are available at:
    http://vmgump.apache.org/gump/public/tomcat-trunk/tomcat-trunk-test/index.html

That said, some information snippets are provided here.

The following annotations (debug/informational/warning/error messages) were provided:
 -DEBUG- Dependency on tomcat-trunk-dbcp exists, no need to add for property tomcat-dbcp-src.jar.
 -DEBUG- Dependency on commons-daemon exists, no need to add for property commons-daemon.native.src.tgz.
 -DEBUG- Dependency on commons-daemon exists, no need to add for property tomcat-native.tar.gz.
 -DEBUG- Dependency on tomcat-trunk-dbcp exists, no need to add for property tomcat-dbcp.home.
 -INFO- Failed with reason build failed
 -INFO- Project Reports in: /srv/gump/public/workspace/tomcat-trunk/output/build/logs



The following work was performed:
http://vmgump.apache.org/gump/public/tomcat-trunk/tomcat-trunk-test/gump_work/build_tomcat-trunk_tomcat-trunk-test.html
Work Name: build_tomcat-trunk_tomcat-trunk-test (Type: Build)
Work ended in a state of : Failed
Elapsed: 1 min 32 secs
Command Line: /usr/lib/jvm/java-6-openjdk/bin/java -Djava.awt.headless=true -Dbuild.sysclasspath=only
org.apache.tools.ant.Main -Dgump.merge=/srv/gump/public/gump/work/merge.xml -Djunit.jar=/srv/gump/public/workspace/junit/dist/junit-27052011.jar
-Dcommons-daemon.native.src.tgz=/srv/gump/public/workspace/apache-commons/daemon/dist/bin/commons-daemon-27052011-native-src.tar.gz
-Dtomcat-native.tar.gz=/srv/gump/public/workspace/apache-commons/daemon/dist/bin/commons-daemon-27052011-native-src.tar.gz
-Dexamples.sources.skip=true -Dtomcat-dbcp.home=/srv/gump/public/workspace/tomcat-trunk/tomcat-deps
-Djdt.jar=/srv/gump/packages/eclipse/plugins/org.eclipse.jdt.core_3.4.2/jdtcore.jar -Dcommons-daemon.jar=/srv/gump/public/workspace/apache-commons/daemon/dist/commons-daemon-27052011.jar
-Dtomcat-dbcp-src.jar=/srv/gump/public/workspace/tomcat-trunk/tomcat-deps/tomcat-dbcp-src.jar
-Dcommons-pool.home=/srv/gump/public/workspace/commons-pool-1.x -Dcommons-dbcp.home=/srv/gump/public/worksp
 ace/commons-dbcp-1.x -Dcheckstyle.jar=/srv/gump/public/workspace/checkstyle/target/checkstyle-*[0-9T].jar
-Dtomcat-dbcp.jar=/srv/gump/public/workspace/tomcat-trunk/tomcat-deps/tomcat-dbcp-27052011.jar
test 
[Working Directory: /srv/gump/public/workspace/tomcat-trunk]
CLASSPATH: /usr/lib/jvm/java-6-openjdk/lib/tools.jar:/srv/gump/public/workspace/tomcat-trunk/output/build/webapps/examples/WEB-INF/classes:/srv/gump/public/workspace/tomcat-trunk/output/testclasses:/srv/gump/public/workspace/ant/dist/lib/ant.jar:/srv/gump/public/workspace/ant/dist/lib/ant-launcher.jar:/srv/gump/public/workspace/ant/dist/lib/ant-jmf.jar:/srv/gump/public/workspace/ant/dist/lib/ant-junit.jar:/srv/gump/public/workspace/ant/dist/lib/ant-swing.jar:/srv/gump/public/workspace/ant/dist/lib/ant-apache-resolver.jar:/srv/gump/public/workspace/ant/dist/lib/ant-apache-xalan2.jar:/srv/gump/packages/junit3.8.1/junit.jar:/srv/gump/public/workspace/xml-commons/java/build/resolver.jar:/srv/gump/public/workspace/tomcat-trunk/output/build/bin/bootstrap.jar:/srv/gump/public/workspace/tomcat-trunk/output/build/bin/tomcat-juli.jar:/srv/gump/public/workspace/tomcat-trunk/output/build/lib/annotations-api.jar:/srv/gump/public/workspace/tomcat-trunk/output/build/lib/servlet-api.jar:/srv
 /gump/public/workspace/tomcat-trunk/output/build/lib/jsp-api.jar:/srv/gump/public/workspace/tomcat-trunk/output/build/lib/el-api.jar:/srv/gump/public/workspace/tomcat-trunk/output/build/lib/catalina.jar:/srv/gump/public/workspace/tomcat-trunk/output/build/lib/catalina-ant.jar:/srv/gump/public/workspace/tomcat-trunk/output/build/lib/tomcat-coyote.jar:/srv/gump/public/workspace/tomcat-trunk/output/build/lib/jasper.jar:/srv/gump/public/workspace/tomcat-trunk/output/build/lib/jasper-el.jar:/srv/gump/public/workspace/tomcat-trunk/output/build/lib/catalina-tribes.jar:/srv/gump/public/workspace/tomcat-trunk/output/build/lib/catalina-ha.jar:/srv/gump/public/workspace/tomcat-trunk/output/build/lib/tomcat-api.jar:/srv/gump/public/workspace/tomcat-trunk/output/build/lib/tomcat-util.jar:/srv/gump/packages/javamail-1.4/mail.jar:/srv/gump/packages/javamail-1.4/lib/mailapi.jar:/srv/gump/packages/jaf-1.1ea/activation.jar:/srv/gump/packages/eclipse/plugins/org.eclipse.jdt.core_3.4.2/jdtcore.
 jar:/srv/gump/public/workspace/tomcat-trunk/tomcat-deps/tomcat-dbcp-27052011.jar:/srv/gump/public/workspace/apache-commons/daemon/dist/commons-daemon-27052011.jar:/srv/gump/public/workspace/junit/dist/junit-27052011.jar
---------------------------------------------
    [junit] SEVERE: Protocol handler instantiation failed
    [junit] Tests run: 4, Failures: 0, Errors: 4, Time elapsed: 1.065 sec
    [junit] May 27, 2011 9:06:06 AM org.apache.catalina.connector.Connector <init>
    [junit] SEVERE: Protocol handler instantiation failed
    [junit] May 27, 2011 9:06:06 AM org.apache.catalina.connector.Connector <init>
    [junit] SEVERE: Protocol handler instantiation failed
    [junit] May 27, 2011 9:06:06 AM org.apache.catalina.connector.Connector <init>
    [junit] SEVERE: Protocol handler instantiation failed
    [junit] Test org.apache.tomcat.util.net.TestClientCert FAILED
    [junit] Running org.apache.tomcat.util.net.TestCustomSsl
    [junit] Tests run: 3, Failures: 0, Errors: 3, Time elapsed: 0.205 sec
    [junit] May 27, 2011 9:06:07 AM org.apache.catalina.connector.Connector <init>
    [junit] SEVERE: Protocol handler instantiation failed
    [junit] May 27, 2011 9:06:07 AM org.apache.catalina.connector.Connector <init>
    [junit] SEVERE: Protocol handler instantiation failed
    [junit] May 27, 2011 9:06:07 AM org.apache.catalina.connector.Connector <init>
    [junit] SEVERE: Protocol handler instantiation failed
    [junit] Test org.apache.tomcat.util.net.TestCustomSsl FAILED
    [junit] Running org.apache.tomcat.util.net.TestSsl
    [junit] May 27, 2011 9:06:08 AM org.apache.catalina.connector.Connector <init>
    [junit] SEVERE: Protocol handler instantiation failed
    [junit] May 27, 2011 9:06:08 AM org.apache.catalina.connector.Connector <init>
    [junit] SEVERE: Protocol handler instantiation failed
    [junit] May 27, 2011 9:06:08 AM org.apache.catalina.connector.Connector <init>
    [junit] SEVERE: Protocol handler instantiation failed
    [junit] May 27, 2011 9:06:08 AM org.apache.catalina.connector.Connector <init>
    [junit] SEVERE: Protocol handler instantiation failed
    [junit] Tests run: 4, Failures: 0, Errors: 4, Time elapsed: 0.737 sec
    [junit] Test org.apache.tomcat.util.net.TestSsl FAILED
    [junit] Running org.apache.tomcat.util.net.TestXxxEndpoint
    [junit] Tests run: 2, Failures: 0, Errors: 2, Time elapsed: 0.203 sec
    [junit] May 27, 2011 9:06:09 AM org.apache.catalina.connector.Connector <init>
    [junit] SEVERE: Protocol handler instantiation failed
    [junit] May 27, 2011 9:06:09 AM org.apache.catalina.connector.Connector <init>
    [junit] SEVERE: Protocol handler instantiation failed
    [junit] Test org.apache.tomcat.util.net.TestXxxEndpoint FAILED
    [junit] Running org.apache.tomcat.util.res.TestStringManager
    [junit] Tests run: 2, Failures: 0, Errors: 0, Time elapsed: 0.023 sec
    [junit] Running org.apache.tomcat.util.threads.TestLimitLatch
    [junit] Exception in thread "Thread-1" java.lang.NullPointerException
    [junit] 	at org.apache.tomcat.util.threads.TestLimitLatch$TestThread.run(TestLimitLatch.java:122)
    [junit] Exception in thread "Thread-2" java.lang.NullPointerException
    [junit] 	at org.apache.tomcat.util.threads.TestLimitLatch$TestThread.run(TestLimitLatch.java:122)
    [junit] Tests run: 5, Failures: 0, Errors: 0, Time elapsed: 2.424 sec

BUILD FAILED
/srv/gump/public/workspace/tomcat-trunk/build.xml:1035: The following error occurred while
executing this line:
/srv/gump/public/workspace/tomcat-trunk/build.xml:1096: Some tests completed with an Error.
See /srv/gump/public/workspace/tomcat-trunk/output/build/logs for details.

Total time: 1 minute 32 seconds
---------------------------------------------

To subscribe to this information via syndicated feeds:
- RSS: http://vmgump.apache.org/gump/public/tomcat-trunk/tomcat-trunk-test/rss.xml
- Atom: http://vmgump.apache.org/gump/public/tomcat-trunk/tomcat-trunk-test/atom.xml

============================== Gump Tracking Only ===
Produced by Apache Gump(TM) version 2.3.
Gump Run 05000627052011, vmgump.apache.org:vmgump:05000627052011
Gump E-mail Identifier (unique within run) #16.

--
Apache Gump
http://gump.apache.org/ [Instance: vmgump]

---------------------------------------------------------------------
To unsubscribe, e-mail: dev-unsubscribe@tomcat.apache.org
For additional commands, e-mail: dev-help@tomcat.apache.org


Mime
View raw message