tomcat-dev mailing list archives

Site index · List index
Message view « Date » · « Thread »
Top « Date » · « Thread »
From Gump <bay...@apache.org>
Subject [GUMP@vmgump]: Project tomcat-taglibs-standard (in module tomcat-taglibs) failed
Date Thu, 17 Feb 2011 15:12:37 GMT
To whom it may engage...
        
This is an automated request, but not an unsolicited one. For 
more information please visit http://gump.apache.org/nagged.html, 
and/or contact the folk at general@gump.apache.org.

Project tomcat-taglibs-standard has an issue affecting its community integration.
This issue affects 2 projects,
 and has been outstanding for 89 runs.
The current state of this project is 'Failed', with reason 'Build Failed'.
For reference only, the following projects are affected by this:
    - tomcat-taglibs-standard :  Standard Taglib
    - tomcat-taglibs-standard-install :  JSP Taglibs


Full details are available at:
    http://vmgump.apache.org/gump/public/tomcat-taglibs/tomcat-taglibs-standard/index.html

That said, some information snippets are provided here.

The following annotations (debug/informational/warning/error messages) were provided:
 -INFO- Optional dependency httpunit failed with reason build failed
 -DEBUG- (Apache Gump generated) Apache Maven Settings in: /srv/gump/public/workspace/tomcat-taglibs/standard/gump_mvn_settings.xml
 -INFO- Failed with reason build failed
 -DEBUG- Maven POM in: /srv/gump/public/workspace/tomcat-taglibs/standard/pom.xml
 -INFO- Failed to extract fallback artifacts from Gump Repository



The following work was performed:
http://vmgump.apache.org/gump/public/tomcat-taglibs/tomcat-taglibs-standard/gump_work/build_tomcat-taglibs_tomcat-taglibs-standard.html
Work Name: build_tomcat-taglibs_tomcat-taglibs-standard (Type: Build)
Work ended in a state of : Failed
Elapsed: 1 min 3 secs
Command Line: /opt/maven2/bin/mvn --batch-mode -DskipTests=true --settings /srv/gump/public/workspace/tomcat-taglibs/standard/gump_mvn_settings.xml
install 
[Working Directory: /srv/gump/public/workspace/tomcat-taglibs/standard]
M2_HOME: /opt/maven2
---------------------------------------------
[INFO] Copying 3 resources
[INFO] [compiler:compile {execution: default-compile}]
[INFO] Nothing to compile - all classes are up to date
[INFO] [resources:testResources {execution: default-testResources}]
[INFO] Using 'UTF-8' encoding to copy filtered resources.
[INFO] skip non existing resourceDirectory /srv/gump/public/workspace/tomcat-taglibs/standard/spec/src/test/resources
[INFO] Copying 3 resources
[INFO] [compiler:testCompile {execution: default-testCompile}]
[INFO] No sources to compile
[INFO] [surefire:test {execution: default-test}]
[INFO] Tests are skipped.
[INFO] [bundle:bundle {execution: default-bundle}]
[INFO] [install:install {execution: default-install}]
[INFO] Installing /srv/gump/public/workspace/tomcat-taglibs/standard/spec/target/taglibs-standard-spec-1.2-SNAPSHOT.jar
to /srv/gump/public/workspace/mvnlocalrepo/shared/org/apache/taglibs/taglibs-standard-spec/1.2-SNAPSHOT/taglibs-standard-spec-1.2-SNAPSHOT.jar
[INFO] [bundle:install {execution: default-install}]
[INFO] Parsing file:/srv/gump/public/workspace/mvnlocalrepo/shared/repository.xml
[INFO] Installing org/apache/taglibs/taglibs-standard-spec/1.2-SNAPSHOT/taglibs-standard-spec-1.2-SNAPSHOT.jar
[INFO] Writing OBR metadata
[INFO] ------------------------------------------------------------------------
[INFO] Building Apache Standard Taglib - JSTL Implementation
[INFO]    task-segment: [install]
[INFO] ------------------------------------------------------------------------
[INFO] [remote-resources:process {execution: default}]
[INFO] snapshot org.apache.taglibs:taglibs-standard-spec:1.2-SNAPSHOT: checking for updates
from apache.snapshots
[WARNING] *** CHECKSUM FAILED - Checksum failed on download: local = '41e8402b5b2bbecd9b89b2dd62ed903da669bd31';
remote = '<html>
<head>
' - RETRYING
[WARNING] *** CHECKSUM FAILED - Checksum failed on download: local = '41e8402b5b2bbecd9b89b2dd62ed903da669bd31';
remote = '<html>
<head>
' - IGNORING
[INFO] ------------------------------------------------------------------------
[ERROR] BUILD ERROR
[INFO] ------------------------------------------------------------------------
[INFO] Failed to resolve dependencies for one or more projects in the reactor. Reason: Unable
to read local copy of metadata: Cannot read metadata from '/srv/gump/public/workspace/mvnlocalrepo/shared/org/apache/taglibs/taglibs-standard-spec/1.2-SNAPSHOT/maven-metadata-apache.snapshots.xml':
end tag name </p> must match start tag name <br> from line 6 (position: TEXT seen
...<a href="/">home page</a>.\n</p>... @8:5) 
  org.apache.taglibs:taglibs-standard-spec:jar:1.2-SNAPSHOT


Path to dependency: 
	1) org.apache.taglibs:taglibs-standard-impl:bundle:1.2-SNAPSHOT
	2) org.apache.taglibs:taglibs-standard-spec:jar:1.2-SNAPSHOT



[INFO] ------------------------------------------------------------------------
[INFO] For more information, run Maven with the -e switch
[INFO] ------------------------------------------------------------------------
[INFO] Total time: 1 minute 2 seconds
[INFO] Finished at: Thu Feb 17 15:12:36 UTC 2011
[INFO] Final Memory: 22M/54M
[INFO] ------------------------------------------------------------------------
---------------------------------------------

To subscribe to this information via syndicated feeds:
- RSS: http://vmgump.apache.org/gump/public/tomcat-taglibs/tomcat-taglibs-standard/rss.xml
- Atom: http://vmgump.apache.org/gump/public/tomcat-taglibs/tomcat-taglibs-standard/atom.xml

============================== Gump Tracking Only ===
Produced by Apache Gump(TM) version 2.3.
Gump Run 06000617022011, vmgump.apache.org:vmgump:06000617022011
Gump E-mail Identifier (unique within run) #54.

--
Apache Gump
http://gump.apache.org/ [Instance: vmgump]

---------------------------------------------------------------------
To unsubscribe, e-mail: dev-unsubscribe@tomcat.apache.org
For additional commands, e-mail: dev-help@tomcat.apache.org


Mime
View raw message