tomcat-dev mailing list archives

Site index · List index
Message view « Date » · « Thread »
Top « Date » · « Thread »
From dun...@hyperreal.org
Subject Unix Standalone Build 1999-11-12
Date Fri, 12 Nov 1999 17:14:13 GMT
<build-report>
<build-id>1999-11-12</build-id>
<hostname></hostname>
<hosttype></hosttype>
<ostype></ostype>


<checkout>
cvs checkout: warning: unrecognized response `cvs: setgroups: Operation not permitted' from cvs server
</checkout>


<build name="jakarta-tomcat">
Buildfile: build.xml
Detected Java Version: 1.1
Project base dir set to: /export/home/duncan/ws/jakarta-tomcat
Executing Target: prepare
Created dir: /export/home/duncan/ws/build/tomcat
Created dir: /export/home/duncan/ws/build/tomcat/classes
Created dir: /export/home/duncan/ws/build/tomcat/etc
Created dir: /export/home/duncan/ws/build/tomcat/src
Created dir: /export/home/duncan/ws/build/tomcat/lib
Copying 114 files to /export/home/duncan/ws/build/tomcat/webpages
Copying 98 files to /export/home/duncan/ws/build/tomcat/examples
Copying 42 files to /export/home/duncan/ws/build/tomcat/src/javax
Copying 6 files to /export/home/duncan/ws/build/tomcat
Executing Target: main
Compiling 269 source files to /export/home/duncan/ws/build/tomcat/classes
Copying 28 support files to /export/home/duncan/ws/build/tomcat/classes
Compiling 22 source files to /export/home/duncan/ws/build/tomcat/examples/WEB-INF/classes
Compiling 1 source files to /export/home/duncan/ws/build/tomcat/webpages/WEB-INF/classes
Compiling 1 source files to /export/home/duncan/ws/build/tomcat/examples/jsp/plugin/applet
Executing Target: dist
Created dir: /export/home/duncan/ws/dist/tomcat
Created dir: /export/home/duncan/ws/dist/tomcat/lib
Created dir: /export/home/duncan/ws/dist/tomcat/etc
Created dir: /export/home/duncan/ws/dist/tomcat/src
Created dir: /export/home/duncan/ws/dist/tomcat/examples
Created dir: /export/home/duncan/ws/dist/tomcat/webpages
Copying 42 files to /export/home/duncan/ws/dist/tomcat/src/javax
Copying 6 files to /export/home/duncan/ws/dist/tomcat
Copying 115 files to /export/home/duncan/ws/dist/tomcat/webpages
Copying 121 files to /export/home/duncan/ws/dist/tomcat/examples
Building jar: /export/home/duncan/ws/dist/tomcat/webserver.jar
Building jar: /export/home/duncan/ws/dist/tomcat/lib/servlet.jar
Building jar: /export/home/duncan/ws/dist/tomcat/lib/jasper.jar
Completed in 168 seconds
</build>


<build name="jakarta-tomcat-test">
Buildfile: build.xml
Detected Java Version: 1.1
Project base dir set to: /export/home/duncan/ws/jakarta-tomcat
Executing Target: prepare
Executing Target: main
Compiling 4 source files to /export/home/duncan/ws/build/tomcat/examples/WEB-INF/classes
Executing Target: test
Created dir: /export/home/duncan/ws/build/tomcat/test
Created dir: /export/home/duncan/ws/build/tomcat/test/classes
Created dir: /export/home/duncan/ws/build/tomcat/test/lib
Created dir: /export/home/duncan/ws/build/tomcat/test/webpages
Copying 86 files to /export/home/duncan/ws/build/tomcat/test/webpages
Copying 2 files to /export/home/duncan/ws/build/tomcat/test
Compiling 24 source files to /export/home/duncan/ws/build/tomcat/test/classes
Copying 30 support files to /export/home/duncan/ws/build/tomcat/test/classes
Compiling 26 source files to /export/home/duncan/ws/build/tomcat/test/webpages/WEB-INF/classes
Completed in 24 seconds
</build>
<build name="jakarta-watchdog">
/export/home/duncan/ws/jakarta-watchdog .....
Building with classpath ../build/tomcat/classes:../jakarta-tools/ant.jar:../jakarta-tools/moo.jar:../jakarta-tools/projectx-tr2.jar:../build/tomcat/lib/servlet.jar:../build/tomcat/lib/jasper.jar:../build/tomcat/lib/xml.jar
Buildfile: build.xml
Detected Java Version: 1.1
Project base dir set to: /export/home/duncan/ws/jakarta-watchdog
Executing Target: prepare
Created dir: /export/home/duncan/ws/build/watchdog
Created dir: /export/home/duncan/ws/build/watchdog/clients
Created dir: /export/home/duncan/ws/build/watchdog/conf
Created dir: /export/home/duncan/ws/build/watchdog/lib
Created dir: /export/home/duncan/ws/build/watchdog/webapps/servlet-tests/WEB-INF/classes
Created dir: /export/home/duncan/ws/build/watchdog/webapps/servlet-tests/WEB-INF/lib
Created dir: /export/home/duncan/ws/build/watchdog/webapps/jsp-tests/WEB-INF/lib
Copying 552 files to /export/home/duncan/ws/build/watchdog/webapps/jsp-tests
Copying 4 files to /export/home/duncan/ws/build/watchdog
Copying 4 files to /export/home/duncan/ws/build/watchdog/conf
Executing Target: main
Compiling 15 source files to /export/home/duncan/ws/build/watchdog/webapps/jsp-tests/WEB-INF/classes
Compiling 3 source files to /export/home/duncan/ws/build/watchdog/webapps/jsp-tests/WEB-INF/classes
/export/home/duncan/ws/jakarta-tools/moo/src/share/org/apache/tools/moo/servlet/GenericClientTest.java:315: Note: The constructor java.io.PrintStream(java.io.OutputStream) has been deprecated.
      e.printStackTrace(new PrintStream(Logger.getLogger().getOutputStream()));
                        ^
/export/home/duncan/ws/jakarta-tools/moo/src/share/org/apache/tools/moo/servlet/GenericClientTest.java:319: Note: The constructor java.io.PrintStream(java.io.OutputStream) has been deprecated.
      e.printStackTrace(new PrintStream(Logger.getLogger().getOutputStream()));
                        ^
Note: /export/home/duncan/ws/jakarta-tools/moo/src/share/org/apache/tools/moo/servlet/GenericClientTest.java uses a deprecated API.  Please consult the documentation for a better alternative.
3 warnings
Compiling 25 source files to /export/home/duncan/ws/build/watchdog/webapps/servlet-tests/WEB-INF/classes
/export/home/duncan/ws/jakarta-tools/moo/src/share/org/apache/tools/moo/cookie/RfcDateParser.java:173: Note: The constructor java.util.Date(java.lang.String) has been deprecated.
	    fInternalDate  = new Date(dateString);
	                     ^
/export/home/duncan/ws/jakarta-tools/moo/src/share/org/apache/tools/moo/cookie/RfcDateParser.java:229: Note: The constructor java.util.Date(java.lang.String) has been deprecated.
		    fInternalDate  = new Date(newString);
		                     ^
/export/home/duncan/ws/jakarta-tools/moo/src/share/org/apache/tools/moo/servlet/ClientTest.java:422: Note: The constructor java.io.PrintStream(java.io.OutputStream) has been deprecated.
            e.printStackTrace(new PrintStream(Logger.getLogger().getOutputStream()));
                              ^
/export/home/duncan/ws/jakarta-tools/moo/src/share/org/apache/tools/moo/servlet/ClientTest.java:426: Note: The constructor java.io.PrintStream(java.io.OutputStream) has been deprecated.
            e.printStackTrace(new PrintStream(Logger.getLogger().getOutputStream()));
                              ^
/export/home/duncan/ws/jakarta-tools/moo/src/share/org/apache/tools/moo/servlet/GenericClientTest.java:315: Note: The constructor java.io.PrintStream(java.io.OutputStream) has been deprecated.
      e.printStackTrace(new PrintStream(Logger.getLogger().getOutputStream()));
                        ^
/export/home/duncan/ws/jakarta-tools/moo/src/share/org/apache/tools/moo/servlet/GenericClientTest.java:319: Note: The constructor java.io.PrintStream(java.io.OutputStream) has been deprecated.
      e.printStackTrace(new PrintStream(Logger.getLogger().getOutputStream()));
                        ^
Note: 3 files use deprecated APIs.  Please consult the documentation for a better alternative in each case.
7 warnings
Copying 1 support files to /export/home/duncan/ws/build/watchdog/webapps/servlet-tests/WEB-INF/classes
Compiling 500 source files to /export/home/duncan/ws/build/watchdog/clients
/export/home/duncan/ws/jakarta-watchdog/src/clients/org/apache/jcheck/servlet/client/javax_servlet_http/HttpServletResponse/SetDateHeader_1Test.java:97: Note: The method long parse(java.lang.String) in class java.util.Date has been deprecated.
					java.util.Date.parse(ate);
					                    ^
Note: /export/home/duncan/ws/jakarta-watchdog/src/clients/org/apache/jcheck/servlet/client/javax_servlet_http/HttpServletResponse/SetDateHeader_1Test.java uses a deprecated API.  Please consult the documentation for a better alternative.
2 warnings
Copying 10 support files to /export/home/duncan/ws/build/watchdog/clients
Executing Target: dist
Created dir: /export/home/duncan/ws/dist/watchdog
Created dir: /export/home/duncan/ws/dist/watchdog/conf
Created dir: /export/home/duncan/ws/dist/watchdog/lib
Created dir: /export/home/duncan/ws/dist/watchdog/webapps
Copying 4 files to /export/home/duncan/ws/dist/watchdog
Copying 4 files to /export/home/duncan/ws/dist/watchdog/conf
Building jar: /export/home/duncan/ws/dist/watchdog/lib/client.jar
Building jar: /export/home/duncan/ws/dist/watchdog/webapps/servlet-tests.war
Building jar: /export/home/duncan/ws/dist/watchdog/webapps/jsp-tests.war
Created dir: /export/home/duncan/ws/build/watchdog/tmp
Created dir: /export/home/duncan/ws/build/watchdog/tmp/META-INF
Building jar: /export/home/duncan/ws/dist/watchdog/jcheck.ear
Completed in 191 seconds
</build>


<build name="apache-1.3">
Configuring for Apache, Version 1.3.10-dev
 + using installation path layout: Apache (config.layout)
 + on-the-fly added and activated ajp23 module (modules/extra/mod_ajp23.o)
Creating Makefile
Creating Configuration.apaci in src
 + enabling mod_so for DSO support
Creating Makefile in src
 + configured for Solaris 270 platform
 + setting C compiler to gcc
 + setting C pre-processor to gcc -E
 + checking for system header files
 + adding selected modules
    o rewrite_module uses ConfigStart/End
      enabling DBM support for mod_rewrite
    o dbm_auth_module uses ConfigStart/End
 + enabling generation of Apache core as DSO
 + using -ldl for vendor DSO support
 + checking sizeof various data types
 + doing sanity check on compiler and options
Creating Makefile in src/support
Creating Makefile in src/os/unix
Creating Makefile in src/ap
Creating Makefile in src/main
Creating Makefile in src/lib/expat-lite
Creating Makefile in src/modules/standard
Creating Makefile in src/modules/proxy
Creating Makefile in src/modules/extra
===> src
make[1]: Entering directory `/export/home/duncan/ws/apache-1.3'
make[2]: Entering directory `/export/home/duncan/ws/apache-1.3/src'
===> src/os/unix
gcc -c  -I../../os/unix -I../../include   -DSOLARIS2=270 -DUSE_EXPAT -I../../lib/expat-lite -fPIC -DSHARED_CORE `../../apaci` os.c
gcc -c  -I../../os/unix -I../../include   -DSOLARIS2=270 -DUSE_EXPAT -I../../lib/expat-lite -fPIC -DSHARED_CORE `../../apaci` os-inline.c
rm -f libos.a
ar cr libos.a os.o os-inline.o
make[2]: Leaving directory `/export/home/duncan/ws/apache-1.3/src'
make[1]: Leaving directory `/export/home/duncan/ws/apache-1.3'
make[1]: Entering directory `/export/home/duncan/ws/apache-1.3'
===> src
make[2]: Entering directory `/export/home/duncan/ws/apache-1.3'
make[3]: Entering directory `/export/home/duncan/ws/apache-1.3/src'
===> src/os/unix
rm -f libos.a
ar cr libos.a os.o os-inline.o
make[3]: Leaving directory `/export/home/duncan/ws/apache-1.3/src'
make[2]: Leaving directory `/export/home/duncan/ws/apache-1.3'
make[1]: Leaving directory `/export/home/duncan/ws/apache-1.3'
</build>


<test name="jakarta-tomcat">
..
Using classpath: ../classes:/lib/tools.jar:../webpages/WEB-INF/classes/jsp/beans:../lib/xml.jar:../lib/jasper.jar:../lib/servlet.jar:../webserver.jar:.:classes:lib/moo.jar

Tomcat Web Server Version 2.2
Loaded configuration from: file:/export/home/duncan/ws/build/tomcat/test/server.xml
Configuring web service using "default"
Configuring web service using "file:/export/home/duncan/ws/build/tomcat/test/webpages/WEB-INF/web.xml"
Starting tcp endpoint on 8080 with org.apache.tomcat.service.http.HttpConnectionHandler
Starting tcp endpoint on 8007 with org.apache.tomcat.service.Ajp11ConnectionHandler
Starting tcp endpoint on 8008 with org.apache.tomcat.service.connector.Ajp23ConnectionHandler

testing 19 modules

    File Length Test                    : OK
    Content Type Test                   : OK
    File Integrity Test                 : OK
    Welcome Test                        : OK
    Simple Forwarding Test              : OK
    Forwarding With Query String Test   : OK
    Simple Inclusion Test               : OK
    File Inclusion Test                 : OK
    Mismatch1 Test                      : OK
    Mismatch2 Test                      : OK
    IncludeMismatch1 Test               : OK
    IncludeMismatch2 Test               : OK
    Simple Redirect Test                : OK
    PrintWriterTest Test                : OK
    Http Date y2k Test                  : OK
Get.test: unexpected result 
Request: GET /servlet/jsp HTTP/1.0
Not Expecting: HTTP/1.0 200 OK
Got: HTTP/1.0 200 OK
Date: Fri, 12 Nov 1999 16:54:10 GMT
Status: 200
Content-Type: text/html
Server: null
Servlet-Engine: Tomcat Web Server/2.2 (JSP 1.1; Servlet 2.2; Java 1.1.7; Solaris 2.7 sparc; java.vendor=Sun Microsystems Inc.)
Set-Cookie2: JSESSIONID=To1010mC5606622143566085At;Version=1;Discard;Path="/"
Set-Cookie: JSESSIONID=To1010mC5606622143566085At;Path=/

<title>Directory Listing</title>
<base href="file://localhost/export/home/duncan/ws/build/tomcat/test/webpages/jsp/"><h1>/export/home/duncan/ws/build/tomcat/test/webpages/jsp</h1>
<hr>
<img align=middle src="doc:/lib/images/ftp/file.gif" width=32 height=32>
<a href="beanScopePage.jsp">beanScopePage.jsp</a><br><img align=middle src="doc:/lib/images/ftp/file.gif" width=32 height=32>
<a href="beanScopeSession.jsp">beanScopeSession.jsp</a><br><img align=middle src="doc:/lib/images/ftp/file.gif" width=32 height=32>
<a href="beanScopeTarget.jsp">beanScopeTarget.jsp</a><br><img align=middle src="doc:/lib/images/ftp/file.gif" width=32 height=32>
<a href="beanSer.jsp">beanSer.jsp</a><br><img align=middle src="doc:/lib/images/ftp/file.gif" width=32 height=32>
<a href="beanTest1.jsp">beanTest1.jsp</a><br><img align=middle src="doc:/lib/images/ftp/file.gif" width=32 height=32>
<a href="beanTest2.jsp">beanTest2.jsp</a><br><img align=middle src="doc:/lib/images/ftp/file.gif" width=32 height=32>
<a href="buffer.jsp">buffer.jsp</a><br><img align=middle src="doc:/lib/images/ftp/file.gif" width=32 height=32>
<a href="buffer1.jsp">buffer1.jsp</a><br><img align=middle src="doc:/lib/images/ftp/file.gif" width=32 height=32>
<a href="buffer2.jsp">buffer2.jsp</a><br><img align=middle src="doc:/lib/images/ftp/file.gif" width=32 height=32>
<a href="buffer3.jsp">buffer3.jsp</a><br><img align=middle src="doc:/lib/images/ftp/file.gif" width=32 height=32>
<a href="buffer4.jsp">buffer4.jsp</a><br><img align=middle src="doc:/lib/images/ftp/file.gif" width=32 height=32>
<a href="classTest.jsp">classTest.jsp</a><br><img align=middle src="doc:/lib/images/ftp/file.gif" width=32 height=32>
<a href="comments.jsp">comments.jsp</a><br><img align=middle src="doc:/lib/images/ftp/directory.gif" width=32 height=32>
<a href="declaration">declaration</a><br><img align=middle src="doc:/lib/images/ftp/directory.gif" width=32 height=32>
<a href="error">error</a><br><img align=middle src="doc:/lib/images/ftp/directory.gif" width=32 height=32>
<a href="forward">forward</a><br><img align=middle src="doc:/lib/images/ftp/file.gif" width=32 height=32>
<a href="HelloWorld.jsp">HelloWorld.jsp</a><br><img align=middle src="doc:/lib/images/ftp/file.gif" width=32 height=32>
<a href="implicitConfig.jsp">implicitConfig.jsp</a><br><img align=middle src="doc:/lib/images/ftp/file.gif" width=32 height=32>
<a href="implicitContext.jsp">implicitContext.jsp</a><br><img align=middle src="doc:/lib/images/ftp/file.gif" width=32 height=32>
<a href="implicitException.jsp">implicitException.jsp</a><br><img align=middle src="doc:/lib/images/ftp/file.gif" width=32 height=32>
<a href="implicitOut.jsp">implicitOut.jsp</a><br><img align=middle src="doc:/lib/images/ftp/file.gif" width=32 height=32>
<a href="implicitPage.jsp">implicitPage.jsp</a><br><img align=middle src="doc:/lib/images/ftp/file.gif" width=32 height=32>
<a href="implicitPageContext.jsp">implicitPageContext.jsp</a><br><img align=middle src="doc:/lib/images/ftp/file.gif" width=32 height=32>
<a href="implicitRequest.jsp">implicitRequest.jsp</a><br><img align=middle src="doc:/lib/images/ftp/file.gif" width=32 height=32>
<a href="implicitResponse.jsp">implicitResponse.jsp</a><br><img align=middle src="doc:/lib/images/ftp/file.gif" width=32 height=32>
<a href="implicitSession.jsp">implicitSession.jsp</a><br><img align=middle src="doc:/lib/images/ftp/file.gif" width=32 height=32>
<a href="import.jsp">import.jsp</a><br><img align=middle src="doc:/lib/images/ftp/directory.gif" width=32 height=32>
<a href="include">include</a><br><img align=middle src="doc:/lib/images/ftp/html.gif" width=32 height=32>
<a href="index.html">index.html</a><br><img align=middle src="doc:/lib/images/ftp/file.gif" width=32 height=32>
<a href="initDestroy.jsp">initDestroy.jsp</a><br><img align=middle src="doc:/lib/images/ftp/directory.gif" width=32 height=32>
<a href="jsptoserv">jsptoserv</a><br><img align=middle src="doc:/lib/images/ftp/file.gif" width=32 height=32>
<a href="pageAutoFlush.jsp">pageAutoFlush.jsp</a><br><img align=middle src="doc:/lib/images/ftp/file.gif" width=32 height=32>
<a href="pageContent3.jsp">pageContent3.jsp</a><br><img align=middle src="doc:/lib/images/ftp/file.gif" width=32 height=32>
<a href="pageContentType.jsp">pageContentType.jsp</a><br><img align=middle src="doc:/lib/images/ftp/file.gif" width=32 height=32>
<a href="pageDouble.jsp">pageDouble.jsp</a><br><img align=middle src="doc:/lib/images/ftp/file.gif" width=32 height=32>
<a href="pageError.jsp">pageError.jsp</a><br><img align=middle src="doc:/lib/images/ftp/file.gif" width=32 height=32>
<a href="pageExtends.jsp">pageExtends.jsp</a><br><img align=middle src="doc:/lib/images/ftp/file.gif" width=32 height=32>
<a href="pageImport.jsp">pageImport.jsp</a><br><img align=middle src="doc:/lib/images/ftp/file.gif" width=32 height=32>
<a href="pageImport2.jsp">pageImport2.jsp</a><br><img align=middle src="doc:/lib/images/ftp/file.gif" width=32 height=32>
<a href="pageInfo.jsp">pageInfo.jsp</a><br><img align=middle src="doc:/lib/images/ftp/file.gif" width=32 height=32>
<a href="pageInvalid.jsp">pageInvalid.jsp</a><br><img align=middle src="doc:/lib/images/ftp/file.gif" width=32 height=32>
<a href="pageIsErrorPage.jsp">pageIsErrorPage.jsp</a><br><img align=middle src="doc:/lib/images/ftp/file.gif" width=32 height=32>
<a href="pageIsThreadSafe.jsp">pageIsThreadSafe.jsp</a><br><img align=middle src="doc:/lib/images/ftp/file.gif" width=32 height=32>
<a href="pageLanguage.jsp">pageLanguage.jsp</a><br><img align=middle src="doc:/lib/images/ftp/file.gif" width=32 height=32>
<a href="pageSession.jsp">pageSession.jsp</a><br><img align=middle src="doc:/lib/images/ftp/file.gif" width=32 height=32>
<a href="parse.jsp">parse.jsp</a><br><img align=middle src="doc:/lib/images/ftp/file.gif" width=32 height=32>
<a href="xml.jsp">xml.jsp</a><br>

    Method GET Test                     : FAIL - 	Test 21 : /servlet/jsp : 1.0 : 404
    Method POST Test                    : OK
    URI Request Map Test                : OK
Testing GET /jsp/HelloWorld.jsp HTTP/1.0
Testing GET /doesNotExist.jsp HTTP/1.0
Testing GET /jsp/ HTTP/1.0
Testing GET /jsp HTTP/1.0
Testing GET /.jsp HTTP/1.0
Testing GET /*.jsp HTTP/1.0
Testing GET *jsp HTTP/1.0
Testing GET HelloWorld.jsp
Testing GET /jsp/HelloWorld.jsp HTTP
Testing GET /jsp/HelloWorld.jsp 1.0
Testing GET /jsp/HelloWorld.jsp /1.0
Testing GET /jsp/HelloWorld.jsp?????? HTTP/1.0
Testing GET /jsp/HelloWorld.jsp?a=b&c=d HTTP/1.0
Testing GET /jsp/HelloWorld.jsp?&& HTTP/1.0
Testing GET /jsp/declaration/IntegerOverflow.jsp HTTP/1.0
Testing GET /jsp/error/err.jsp HTTP/1.0
Error in : 16
Expected: 
<html>
<!--
-->
        
    <h1> The exception / by zero 
            occured. 
    </h1>
</body>
</html>


Got:
<h1>Error: 500</h1>
<b>Internal Servlet Error:</b><br>
<pre>
org.apache.jasper.JasperException: Unable to compile class for JSPwork/8080/_0002fjsp_0002ferror_0002ferr_0002ejsperr_jsp_0.java:66: Arithmetic exception.
                        int i = 10/0;
                                  ^
1 error

	at java.lang.Throwable.<init>(Compiled Code)
	at java.lang.Exception.<init>(Compiled Code)
	at javax.servlet.ServletException.<init>(Compiled Code)
	at org.apache.jasper.JasperException.<init>(Compiled Code)
	at org.apache.jasper.compiler.Compiler.compile(Compiled Code)
	at org.apache.jasper.runtime.JspLoader.loadJSP(Compiled Code)
	at org.apache.jasper.runtime.JspServlet$JspServletWrapper.loadIfNecessary(Compiled Code)
	at org.apache.jasper.runtime.JspServlet$JspServletWrapper.service(Compiled Code)
	at org.apache.jasper.runtime.JspServlet.serviceJspFile(Compiled Code)
	at org.apache.jasper.runtime.JspServlet.service(Compiled Code)
	at javax.servlet.http.HttpServlet.service(Compiled Code)
	at org.apache.tomcat.core.ServiceInvocationHandler.method(Compiled Code)
	at org.apache.tomcat.core.ServletWrapper.handleInvocation(Compiled Code)
	at org.apache.tomcat.core.ServletWrapper.handleRequest(Compiled Code)
	at org.apache.tomcat.core.Context.handleRequest(Compiled Code)
	at org.apache.tomcat.core.ContextManager.service(Compiled Code)
	at org.apache.tomcat.service.http.HttpConnectionHandler.processConnection(Compiled Code)
	at org.apache.tomcat.service.TcpConnectionThread.run(Compiled Code)
	at java.lang.Thread.run(Compiled Code)
</pre>


Testing GET /jsp/forward/forward.jsp HTTP/1.0
Testing GET /jsp/include/include.jsp HTTP/1.0
Testing GET /jsp/jsptoserv/jsptoservlet.jsp HTTP/1.0
Testing GET /jsp/initDestroy.jsp HTTP/1.0
Testing GET /jsp/classTest.jsp HTTP/1.0
Error in : 21
Expected: 
<html>
<head>
    <title>Class test</title>
</head>

<body>
Base name: JSPTest
, Inner name: Inner

</body>
</html>


Got:
<h1>Error: 500</h1>
<b>Internal Servlet Error:</b><br>
<pre>
org.apache.jasper.JasperException: Unable to compile class for JSPwork/8080/_0002fjsp_0002fclassTest_0002ejspclassTest_jsp_0.java:77: Attempt to reference field new in a jsp._0002fjsp_0002fclassTest_0002ejspclassTest_jsp_0.
                 out.println((new JSPTest()).getName()); out.println(", Inner name: " + ((new JSPTest()).new Inner()).getName()); 
                                                                                          ^
1 error

	at java.lang.Throwable.<init>(Compiled Code)
	at java.lang.Exception.<init>(Compiled Code)
	at javax.servlet.ServletException.<init>(Compiled Code)
	at org.apache.jasper.JasperException.<init>(Compiled Code)
	at org.apache.jasper.compiler.Compiler.compile(Compiled Code)
	at org.apache.jasper.runtime.JspLoader.loadJSP(Compiled Code)
	at org.apache.jasper.runtime.JspServlet$JspServletWrapper.loadIfNecessary(Compiled Code)
	at org.apache.jasper.runtime.JspServlet$JspServletWrapper.service(Compiled Code)
	at org.apache.jasper.runtime.JspServlet.serviceJspFile(Compiled Code)
	at org.apache.jasper.runtime.JspServlet.service(Compiled Code)
	at javax.servlet.http.HttpServlet.service(Compiled Code)
	at org.apache.tomcat.core.ServiceInvocationHandler.method(Compiled Code)
	at org.apache.tomcat.core.ServletWrapper.handleInvocation(Compiled Code)
	at org.apache.tomcat.core.ServletWrapper.handleRequest(Compiled Code)
	at org.apache.tomcat.core.Context.handleRequest(Compiled Code)
	at org.apache.tomcat.core.ContextManager.service(Compiled Code)
	at org.apache.tomcat.service.http.HttpConnectionHandler.processConnection(Compiled Code)
	at org.apache.tomcat.service.TcpConnectionThread.run(Compiled Code)
	at java.lang.Thread.run(Compiled Code)
</pre>


Testing GET /jsp/import.jsp HTTP/1.0
Error in : 22
Expected: 
<html>

  <body>
Hashtable get("key 1") : Value 1

  </body>
</html>


Got:
<h1>Error: 500</h1>
<b>Internal Servlet Error:</b><br>
<pre>
org.apache.jasper.JasperException: Unable to compile class for JSPwork/8080/_0002fjsp_0002fimport_0002ejspimport_jsp_0.java:68: Method add(java.lang.String) not found in class java.util.Vector.
                    vector.add("Value 1");
                              ^
1 error

	at java.lang.Throwable.<init>(Compiled Code)
	at java.lang.Exception.<init>(Compiled Code)
	at javax.servlet.ServletException.<init>(Compiled Code)
	at org.apache.jasper.JasperException.<init>(Compiled Code)
	at org.apache.jasper.compiler.Compiler.compile(Compiled Code)
	at org.apache.jasper.runtime.JspLoader.loadJSP(Compiled Code)
	at org.apache.jasper.runtime.JspServlet$JspServletWrapper.loadIfNecessary(Compiled Code)
	at org.apache.jasper.runtime.JspServlet$JspServletWrapper.service(Compiled Code)
	at org.apache.jasper.runtime.JspServlet.serviceJspFile(Compiled Code)
	at org.apache.jasper.runtime.JspServlet.service(Compiled Code)
	at javax.servlet.http.HttpServlet.service(Compiled Code)
	at org.apache.tomcat.core.ServiceInvocationHandler.method(Compiled Code)
	at org.apache.tomcat.core.ServletWrapper.handleInvocation(Compiled Code)
	at org.apache.tomcat.core.ServletWrapper.handleRequest(Compiled Code)
	at org.apache.tomcat.core.Context.handleRequest(Compiled Code)
	at org.apache.tomcat.core.ContextManager.service(Compiled Code)
	at org.apache.tomcat.service.http.HttpConnectionHandler.processConnection(Compiled Code)
	at org.apache.tomcat.service.TcpConnectionThread.run(Compiled Code)
	at java.lang.Thread.run(Compiled Code)
</pre>


Testing GET /jsp/buffer.jsp HTTP/1.0
Testing GET /jsp/buffer1.jsp HTTP/1.0
Testing GET /jsp/buffer2.jsp HTTP/1.0
Testing GET /jsp/buffer3.jsp HTTP/1.0
Testing GET /jsp/buffer4.jsp HTTP/1.0
Testing GET /jsp/comments.jsp HTTP/1.0
Testing GET /jsp/parse.jsp HTTP/1.0
Testing GET /jsp/pageInfo.jsp HTTP/1.0
Testing GET /jsp/pageLanguage.jsp HTTP/1.0
Testing GET /jsp/pageIsThreadSafe.jsp HTTP/1.0
Testing GET /jsp/pageSession.jsp HTTP/1.0
Testing GET /jsp/pageAutoFlush.jsp HTTP/1.0
Testing GET /jsp/pageError.jsp HTTP/1.0
Testing GET /jsp/pageExtends.jsp HTTP/1.0
Testing GET /jsp/pageIsErrorPage.jsp HTTP/1.0
Testing GET /jsp/pageContentType.jsp HTTP/1.0
Testing GET /jsp/pageImport2.jsp HTTP/1.0
Testing GET /jsp/pageImport.jsp HTTP/1.0
Testing GET /jsp/beanTest1.jsp HTTP/1.0
Testing GET /jsp/beanTest2.jsp HTTP/1.0
Testing GET /jsp/beanScopePage.jsp HTTP/1.0
Testing GET /jsp/beanScopeSession.jsp HTTP/1.0
Testing GET /jsp/implicitOut.jsp HTTP/1.0
Testing GET /jsp/implicitConfig.jsp HTTP/1.0
Testing GET /jsp/implicitException.jsp HTTP/1.0
Testing GET /jsp/implicitPageContext.jsp HTTP/1.0
Testing GET /jsp/implicitContext.jsp HTTP/1.0
Testing GET /jsp/implicitRequest.jsp HTTP/1.0
Testing GET /jsp/implicitResponse.jsp HTTP/1.0
Testing GET /jsp/implicitSession.jsp HTTP/1.0
Testing GET /jsp/implicitPageContext.jsp HTTP/1.0
Testing GET /jsp/pageInvalid.jsp HTTP/1.0
Testing GET /jsp/pageDouble.jsp HTTP/1.0
Testing GET /jsp/pageContent3.jsp HTTP/1.0
Testing GET /jsp/xml.jsp HTTP/1.0
Testing GET /servlet/servletParam1 HTTP/1.0
Testing GET /servlet/servletParam2 HTTP/1.0
Testing GET /servlet/ServletParam HTTP/1.0
    JSP Tests                           : FAIL - 
      	Test 16 : GET /jsp/error/err.jsp HTTP/1.0
	Test 21 : GET /jsp/classTest.jsp HTTP/1.0
	Test 22 : GET /jsp/import.jsp HTTP/1.0


<<< FAIL >>>
Number of tests Passed: 17
Number of tests Failed: 2

complete in : 80.264 seconds

Tomcat Web Server Version 2.2
Loaded configuration from: file:/export/home/duncan/ws/build/tomcat/test/server.xml
Shutting down Http Server
Taking down context: 
</test>
<test name="jakarta-watchdog">
../tomcat
Using classpath: ../tomcat/classes:/lib/tools.jar:../tomcat/webpages/WEB-INF/classes/jsp/beans:../tomcat/lib/xml.jar:../tomcat/lib/jasper.jar:../tomcat/lib/servlet.jar:../tomcat/webserver.jar:.:./clients:./lib/xml.jar:./lib/moo.jar:/lib/tools.jar

Tomcat Web Server Version 2.2
Loaded configuration from: file:/export/home/duncan/ws/build/watchdog/conf/server-test.xml
Context: org.apache.tomcat.core.Context@1fa4f654 down
Tomcat WebServer Version 2.2 - shutdown
Configuring web service using "default"
Configuring web service using "default"
Configuring web service using "file:/export/home/duncan/ws/build/watchdog/webapps/jsp-tests/WEB-INF/web.xml"
Configuring web service using "default"
Configuring web service using "default"
Starting tcp endpoint on 8080 with org.apache.tomcat.service.http.HttpConnectionHandler
Starting tcp endpoint on 8008 with org.apache.tomcat.service.Ajp11ConnectionHandler
Starting tcp endpoint on 8009 with org.apache.tomcat.service.connector.Ajp12ConnectionHandler
Starting tcp endpoint on 8007 with org.apache.tomcat.service.connector.Ajp23ConnectionHandler

testing 164 modules

    HelloWorld                          : OK
    positiveGetBufferSize               : OK
    positiveGetBufferSizeUnBuffered     : OK
    positiveGetRemaining                : OK
    positiveForward                     : OK
    positiveJSPInitExtends              : OK
    positiveIncludeRel                  : OK
    positiveContenttype                 : OK
    positiveDoubleQuotes                : OK

testing 210 modules

    ServletContext.GetRequestDispatcher : FAIL - 
      org.apache.jcheck.servlet.client.javax_servlet.ServletRequest.GetRequestDispatcherTest exception: java.io.FileNotFoundException: http://localhost:8080/servlet-tests/GetRequestDispatcherTest
    HttpSession.getAttributeTest        : FAIL - 
      org.apache.jcheck.servlet.client.javax_servlet_http.HttpSession.GetAttributeTest exception: java.io.FileNotFoundException: http://localhost:8080/servlet-tests/GetAttributeTest
    Negative1:HttpSession.getAttribu... : FAIL - 
      org.apache.jcheck.servlet.client.javax_servlet_http.HttpSession.GetAttribute_01Test exception: java.io.FileNotFoundException: http://localhost:8080/servlet-tests/GetAttribute_01Test
    Negative2:HttpSession.getAttribu... : FAIL - 
      org.apache.jcheck.servlet.client.javax_servlet_http.HttpSession.GetAttribute_02Test exception: java.io.FileNotFoundException: http://localhost:8080/servlet-tests/GetAttribute_02Test
    Negative1:HttpSession.getAttribu... : FAIL - 
      org.apache.jcheck.servlet.client.javax_servlet_http.HttpSession.GetAttributeNames_01Test exception: java.io.FileNotFoundException: http://localhost:8080/servlet-tests/GetAttributeNames_01Test
    HttpSession.getAttributeNamesTest   : FAIL - 
      org.apache.jcheck.servlet.client.javax_servlet_http.HttpSession.GetAttributeNamesTest exception: java.io.FileNotFoundException: http://localhost:8080/servlet-tests/GetAttributeNamesTest
    HttpSession.removeAttributeTest     : FAIL - 
      org.apache.jcheck.servlet.client.javax_servlet_http.HttpSession.RemoveAttributeTest exception: java.io.FileNotFoundException: http://localhost:8080/servlet-tests/RemoveAttributeTest
    Negative1:HttpSession.removeAttr... : FAIL - 
      org.apache.jcheck.servlet.client.javax_servlet_http.HttpSession.RemoveAttribute_01Test exception: java.io.FileNotFoundException: http://localhost:8080/servlet-tests/RemoveAttribute_01Test
    Negative2:HttpSession.removeAttr... : FAIL - 
      org.apache.jcheck.servlet.client.javax_servlet_http.HttpSession.RemoveAttribute_02Test exception: java.io.FileNotFoundException: http://localhost:8080/servlet-tests/RemoveAttribute_02Test
    HttpSession.setAttributeTest        : FAIL - 
      org.apache.jcheck.servlet.client.javax_servlet_http.HttpSession.SetAttributeTest exception: java.io.FileNotFoundException: http://localhost:8080/servlet-tests/SetAttributeTest
    Negative1:HttpSession.setAttribu... : FAIL - 
      org.apache.jcheck.servlet.client.javax_servlet_http.HttpSession.SetAttribute_01Test exception: java.io.FileNotFoundException: http://localhost:8080/servlet-tests/SetAttribute_01Test
    Negative Test:getHeadersTest        : FAIL - 
      org.apache.jcheck.servlet.client.javax_servlet_http.HttpServletRequest.GetHeaders_01Test exception: java.io.FileNotFoundException: http://localhost:8080/servlet-tests/GetHeaders_01Test
    getContextPath                      : FAIL - 
      org.apache.jcheck.servlet.client.javax_servlet_http.HttpServletRequest.GetContextPathTest exception: java.io.FileNotFoundException: http://localhost:8080/servlet-tests/GetContextPathTest
    setHeaderTest                       : FAIL - 
      org.apache.jcheck.servlet.client.javax_servlet_http.HttpServletResponse.SetHeaderTest exception: java.lang.Exception: problem setting Header
    addHeaderTest1                      : FAIL - 
      org.apache.jcheck.servlet.client.javax_servlet_http.HttpServletResponse.AddHeaderTest exception: java.lang.Exception: problem adding Header to the Response
    "addHeader:Does addHeaderTest cr... : FAIL - 
      org.apache.jcheck.servlet.client.javax_servlet_http.HttpServletResponse.AddHeader_1Test exception: java.lang.Exception: problem adding Header to the Response
    addIntHeaderTest1                   : FAIL - 
      org.apache.jcheck.servlet.client.javax_servlet_http.HttpServletResponse.AddIntHeaderTest exception: java.lang.Exception: Problem adding IntHeader
    "addIntHeader:Does addIntHeaderT... : FAIL - 
      org.apache.jcheck.servlet.client.javax_servlet_http.HttpServletResponse.AddIntHeader_1Test exception: java.lang.Exception: Problem adding IntHeader
    addDateHeaderTest1                  : FAIL - 
      org.apache.jcheck.servlet.client.javax_servlet_http.HttpServletResponse.AddDateHeaderTest exception: java.lang.Exception: Value wrong
    "addDateHeader:Does addDateHeade... : FAIL - 
      org.apache.jcheck.servlet.client.javax_servlet_http.HttpServletResponse.AddDateHeader_1Test exception: java.lang.Exception: Value wrong
    "setHeaderTest:Does it flush old... : FAIL - 
      org.apache.jcheck.servlet.client.javax_servlet_http.HttpServletResponse.SetHeader_1Test exception: java.lang.NullPointerException
    "setIntHeaderTest:Does it flush ... : FAIL - 
      org.apache.jcheck.servlet.client.javax_servlet_http.HttpServletResponse.SetIntHeader_1Test exception: java.lang.Exception: failed to set int header value
    "setDateHeaderTest:Does it flush... : FAIL - 
      org.apache.jcheck.servlet.client.javax_servlet_http.HttpServletResponse.SetDateHeader_1Test exception: java.lang.Exception: Value wrong
    "Negative Test:getUnavailableSec... : FAIL - 
      org.apache.jcheck.servlet.client.javax_servlet.UnavailableException.GetUnavailableSeconds_3Test exception: java.io.FileNotFoundException: http://localhost:8080/servlet-tests/GetUnavailableSeconds_3Test
    "Negative Test:getUnavailableSec... : FAIL - 
      org.apache.jcheck.servlet.client.javax_servlet.UnavailableException.GetUnavailableSeconds_4Test exception: java.io.FileNotFoundException: http://localhost:8080/servlet-tests/GetUnavailableSeconds_4Test
    UnavailableException.isPermanant... : FAIL - 
      org.apache.jcheck.servlet.client.javax_servlet.UnavailableException.IsPermanent_1Test exception: java.io.FileNotFoundException: http://localhost:8080/servlet-tests/IsPermanent_1Test
    "Cloning Cookie Object"             : FAIL - 
      org.apache.jcheck.servlet.client.javax_servlet_http.Cookie.CookieCloneTest exception: java.io.FileNotFoundException: http://localhost:8080/servlet-tests/CookieCloneTest
    GetComment                          : FAIL - 
      org.apache.jcheck.servlet.client.javax_servlet_http.Cookie.GetCommentTest exception: java.io.FileNotFoundException: http://localhost:8080/servlet-tests/GetCommentTest
    GetVersion                          : FAIL - 
      org.apache.jcheck.servlet.client.javax_servlet_http.Cookie.GetVersionTest exception: java.io.FileNotFoundException: http://localhost:8080/servlet-tests/GetVersionTest
    SetVersion                          : FAIL - 
      org.apache.jcheck.servlet.client.javax_servlet_http.Cookie.SetVersionTest exception: java.io.FileNotFoundException: http://localhost:8080/servlet-tests/SetVersionTest
    "Setting Cookie Domain"             : FAIL - 
      org.apache.jcheck.servlet.client.javax_servlet_http.Cookie.SetDomainTest exception: java.io.FileNotFoundException: http://localhost:8080/servlet-tests/SetDomainTest
    "Negative Cookie Constructor Test"  : FAIL - 
      org.apache.jcheck.servlet.client.javax_servlet_http.Cookie.Constructor_1Test exception: java.io.FileNotFoundException: http://localhost:8080/servlet-tests/Constructor_1Test
    SetSecure                           : FAIL - 
      org.apache.jcheck.servlet.client.javax_servlet_http.Cookie.SetSecureTest exception: java.lang.NullPointerException
    "Test for Cookie Path"              : FAIL - 
      org.apache.jcheck.servlet.client.javax_servlet_http.Cookie.SetPathTest exception: java.io.FileNotFoundException: http://localhost:8080/servlet-tests/SetPathTest
    "Test for Getting Cookie Path"      : FAIL - 
      org.apache.jcheck.servlet.client.javax_servlet_http.Cookie.GetPathTest exception: java.io.FileNotFoundException: http://localhost:8080/servlet-tests/GetPathTest
    "Constructing Cookie"               : FAIL - 
      org.apache.jcheck.servlet.client.javax_servlet_http.Cookie.ConstructorTest exception: java.io.FileNotFoundException: http://localhost:8080/servlet-tests/ConstructorTest
    "A Negative Test getMaxAge of th... : FAIL - 
      org.apache.jcheck.servlet.client.javax_servlet_http.Cookie.GetMaxAge_1Test exception: java.io.FileNotFoundException: http://localhost:8080/servlet-tests/GetMaxAge_1Test
    SetComment                          : FAIL - 
      org.apache.jcheck.servlet.client.javax_servlet_http.Cookie.SetCommentTest exception: java.io.FileNotFoundException: http://localhost:8080/servlet-tests/SetCommentTest
    GetSecureTest                       : FAIL - 
      org.apache.jcheck.servlet.client.javax_servlet_http.Cookie.GetSecureTest exception: java.io.FileNotFoundException: http://localhost:8080/servlet-tests/GetSecureTest
    "Getting Cookies Name"              : FAIL - 
      org.apache.jcheck.servlet.client.javax_servlet_http.Cookie.GetNameTest exception: java.io.FileNotFoundException: http://localhost:8080/servlet-tests/GetNameTest
    "A Negative Test for GetComment "   : FAIL - 
      org.apache.jcheck.servlet.client.javax_servlet_http.Cookie.GetComment_1Test exception: java.io.FileNotFoundException: http://localhost:8080/servlet-tests/GetComment_1Test
    "Setting max age for Cookie";       : FAIL - 
      org.apache.jcheck.servlet.client.javax_servlet_http.Cookie.SetMaxAgeTest exception: java.io.FileNotFoundException: http://localhost:8080/servlet-tests/SetMaxAgeTest
    "Getting Cookies Value"             : FAIL - 
      org.apache.jcheck.servlet.client.javax_servlet_http.Cookie.GetValueTest exception: java.io.FileNotFoundException: http://localhost:8080/servlet-tests/GetValueTest
    "Setting Cookie Value"              : FAIL - 
      org.apache.jcheck.servlet.client.javax_servlet_http.Cookie.SetValueTest exception: java.io.FileNotFoundException: http://localhost:8080/servlet-tests/SetValueTest
    "Getting Cookies Domain"            : FAIL - 
      org.apache.jcheck.servlet.client.javax_servlet_http.Cookie.GetDomainTest exception: java.io.FileNotFoundException: http://localhost:8080/servlet-tests/GetDomainTest
    "Negative Test for getPath"         : FAIL - 
      org.apache.jcheck.servlet.client.javax_servlet_http.Cookie.GetPath_1Test exception: java.io.FileNotFoundException: http://localhost:8080/servlet-tests/GetPath_1Test
    "Negative Test for getDomain"       : FAIL - 
      org.apache.jcheck.servlet.client.javax_servlet_http.Cookie.GetDomain_1Test exception: java.io.FileNotFoundException: http://localhost:8080/servlet-tests/GetDomain_1Test
    "Getting Attribute"                 : FAIL - 
      org.apache.jcheck.servlet.client.javax_servlet.ServletRequest.GetAttributeTest exception: java.io.FileNotFoundException: http://localhost:8080/servlet-tests/SRGetAttributeTest
    GetAttributeNames                   : FAIL - 
      org.apache.jcheck.servlet.client.javax_servlet.ServletRequest.GetAttributeNamesTest exception: java.io.FileNotFoundException: http://localhost:8080/servlet-tests/SRGetAttributeNamesTest
    "Getting char encoding of the Re... : FAIL - 
      org.apache.jcheck.servlet.client.javax_servlet.ServletRequest.GetCharacterEncodingTest exception: java.io.FileNotFoundException: http://localhost:8080/servlet-tests/SRGetCharacterEncodingTest
    "Negative test for getCharacterE... : FAIL - 
      org.apache.jcheck.servlet.client.javax_servlet.ServletRequest.GetCharacterEncoding_1Test exception: java.io.FileNotFoundException: http://localhost:8080/servlet-tests/GetCharacterEncoding_1Test
    "Negative test for getContentLen... : FAIL - 
      org.apache.jcheck.servlet.client.javax_servlet.ServletRequest.GetContentLength_1Test exception: java.io.FileNotFoundException: http://localhost:8080/servlet-tests/GetContentLength_1Test
    GetContentTypeTest                  : FAIL - 
      org.apache.jcheck.servlet.client.javax_servlet.ServletRequest.GetContentTypeTest exception: java.io.FileNotFoundException: http://localhost:8080/servlet-tests/GetContentTypeTest
    GetRealPathTest                     : FAIL - 
      org.apache.jcheck.servlet.client.javax_servlet.ServletRequest.GetRealPathTest exception: java.io.FileNotFoundException: http://localhost:8080/servlet-tests/SRGetRealPathTest
    GetRemoteHost                       : FAIL - 
      org.apache.jcheck.servlet.client.javax_servlet.ServletRequest.GetRemoteHostTest exception: java.io.FileNotFoundException: http://localhost:8080/servlet-tests/GetRemoteHostTest
    "Getting Server's  Host Name"       : FAIL - 
      org.apache.jcheck.servlet.client.javax_servlet.ServletRequest.GetServerNameTest exception: java.io.FileNotFoundException: http://localhost:8080/servlet-tests/GetServerNameTest
    "Getting Request Protocol"          : FAIL - 
      org.apache.jcheck.servlet.client.javax_servlet.ServletRequest.GetProtocolTest exception: java.io.FileNotFoundException: http://localhost:8080/servlet-tests/GetProtocolTest
    GetInputStreamTest                  : FAIL - 
      org.apache.jcheck.servlet.client.javax_servlet.ServletRequest.GetInputStreamTest exception: java.io.FileNotFoundException: http://localhost:8080/servlet-tests/GetInputStreamTest
    "Negative Test for GetInputStream"  : FAIL - 
      org.apache.jcheck.servlet.client.javax_servlet.ServletRequest.GetInputStream_1Test exception: java.io.FileNotFoundException: http://localhost:8080/servlet-tests/GetInputStream_1Test
    GetRemoteAddress                    : FAIL - 
      org.apache.jcheck.servlet.client.javax_servlet.ServletRequest.GetRemoteAddrTest exception: java.io.FileNotFoundException: http://localhost:8080/servlet-tests/GetRemoteAddrTest
    "getting Parameter"                 : FAIL - 
      org.apache.jcheck.servlet.client.javax_servlet.ServletRequest.GetParameterTest exception: java.io.FileNotFoundException: http://localhost:8080/servlet-tests/GetParameterTest?org=sun&loc=cal
    "Negative Test for getParameter"    : FAIL - 
      org.apache.jcheck.servlet.client.javax_servlet.ServletRequest.GetParameter_1Test exception: java.io.FileNotFoundException: http://localhost:8080/servlet-tests/GetParameter_1Test
    "getting the scheme used for the... : FAIL - 
      org.apache.jcheck.servlet.client.javax_servlet.ServletRequest.GetSchemeTest exception: java.io.FileNotFoundException: http://localhost:8080/servlet-tests/GetSchemeTest
    GetParameterNames                   : FAIL - 
      org.apache.jcheck.servlet.client.javax_servlet.ServletRequest.GetParameterNamesTest exception: java.io.FileNotFoundException: http://localhost:8080/servlet-tests/GetParameterNamesTest?org=sun&loc=cal
    "Negative Test for GetParameterN... : FAIL - 
      org.apache.jcheck.servlet.client.javax_servlet.ServletRequest.GetParameterNames_1Test exception: java.io.FileNotFoundException: http://localhost:8080/servlet-tests/GetParameterNames_1Test
    GetServerPort                       : FAIL - 
      org.apache.jcheck.servlet.client.javax_servlet.ServletRequest.GetServerPortTest exception: java.io.FileNotFoundException: http://localhost:8080/servlet-tests/GetServerPortTest
    GetParameterValues                  : FAIL - 
      org.apache.jcheck.servlet.client.javax_servlet.ServletRequest.GetParameterValuesTest exception: java.io.FileNotFoundException: http://localhost:8080/servlet-tests/GetParameterValuesTest?org=sun&org=javasoft
    "Negative test for GetParameterV... : FAIL - 
      org.apache.jcheck.servlet.client.javax_servlet.ServletRequest.GetParameterValues_1Test exception: java.io.FileNotFoundException: http://localhost:8080/servlet-tests/GetParameterValues_1Test
    GetWriterTest                       : FAIL - 
      org.apache.jcheck.servlet.client.javax_servlet.ServletRequest.GetReaderTest exception: java.io.FileNotFoundException: http://localhost:8080/servlet-tests/GetReaderTest
    GetReader_1Test                     : FAIL - 
      org.apache.jcheck.servlet.client.javax_servlet.ServletRequest.GetReader_1Test exception: java.io.FileNotFoundException: http://localhost:8080/servlet-tests/GetReader_1Test
    SetAttributeTest                    : FAIL - 
      org.apache.jcheck.servlet.client.javax_servlet.ServletRequest.SetAttributeTest exception: java.io.FileNotFoundException: http://localhost:8080/servlet-tests/SRSetAttributeTest
    "Getting Locale"                    : FAIL - 
      org.apache.jcheck.servlet.client.javax_servlet.ServletRequest.GetLocaleTest exception: java.io.FileNotFoundException: http://localhost:8080/servlet-tests/GetLocaleTest
    "Getting Locales"                   : FAIL - 
      org.apache.jcheck.servlet.client.javax_servlet.ServletRequest.GetLocalesTest exception: java.io.FileNotFoundException: http://localhost:8080/servlet-tests/GetLocalesTest
    "Getting Locales"                   : FAIL - 
      org.apache.jcheck.servlet.client.javax_servlet.ServletRequest.GetLocales_1Test exception: java.io.FileNotFoundException: http://localhost:8080/servlet-tests/GetLocales_1Test
    getServletContext                   : FAIL - 
      org.apache.jcheck.servlet.client.javax_servlet.GenericServlet.GetServletContextTest exception: java.io.FileNotFoundException: http://localhost:8080/servlet-tests/GetServletContextTest
    GetServletConfigTest                : FAIL - 
      org.apache.jcheck.servlet.client.javax_servlet.GenericServlet.GetServletConfigTest exception: java.io.FileNotFoundException: http://localhost:8080/servlet-tests/GetServletConfigTest
    checking destroy method             : FAIL - 
      org.apache.jcheck.servlet.client.javax_servlet.GenericServlet.DestroyTest exception: java.io.FileNotFoundException: http://localhost:8080/servlet-tests/DestroyTest
    GetServletInfoTest                  : FAIL - 
      org.apache.jcheck.servlet.client.javax_servlet.GenericServlet.GetServletInfoTest exception: java.io.FileNotFoundException: http://localhost:8080/servlet-tests/GetServletInfoTest
    "Life cycle test:destroy Method"    : FAIL - 
      org.apache.jcheck.servlet.client.javax_servlet.Servlet.DoDestroyedTest exception: java.io.FileNotFoundException: http://localhost:8080/servlet-tests/DoDestroyedTest
    "Life Cycle Test:init method"       : FAIL - 
      org.apache.jcheck.servlet.client.javax_servlet.Servlet.DoInit2Test exception: java.io.FileNotFoundException: http://localhost:8080/servlet-tests/DoInit2Test
    "Life Cycle Test:Service Method"    : FAIL - 
      org.apache.jcheck.servlet.client.javax_servlet.Servlet.DoServiceTest exception: java.io.FileNotFoundException: http://localhost:8080/servlet-tests/DoServiceTest
    GetServletConfigTest                : FAIL - 
      org.apache.jcheck.servlet.client.javax_servlet.Servlet.DoServletConfigTest exception: java.io.FileNotFoundException: http://localhost:8080/servlet-tests/DoServletConfigTest
    GetServletInfoTest                  : FAIL - 
      org.apache.jcheck.servlet.client.javax_servlet.Servlet.DoServletInfoTest exception: java.io.FileNotFoundException: http://localhost:8080/servlet-tests/DoServletInfoTest
    getAttributeTest                    : FAIL - 
      org.apache.jcheck.servlet.client.javax_servlet.ServletContext.GetAttributeTest exception: java.io.FileNotFoundException: http://localhost:8080/servlet-tests/SCGetAttributeTest
    "Negative Test for getAttributeN... : FAIL - 
      org.apache.jcheck.servlet.client.javax_servlet.ServletContext.GetAttribute_1Test exception: java.io.FileNotFoundException: http://localhost:8080/servlet-tests/SCGetAttribute_1Test
    setAttributeTest                    : FAIL - 
      org.apache.jcheck.servlet.client.javax_servlet.ServletContext.SetAttributeTest exception: java.io.FileNotFoundException: http://localhost:8080/servlet-tests/SCSetAttributeTest
    getAttributeNamesTest               : FAIL - 
      org.apache.jcheck.servlet.client.javax_servlet.ServletContext.GetAttributeNamesTest exception: java.io.FileNotFoundException: http://localhost:8080/servlet-tests/SCGetAttributeNamesTest
    getContextTest                      : FAIL - 
      org.apache.jcheck.servlet.client.javax_servlet.ServletContext.GetContextTest exception: java.io.FileNotFoundException: http://localhost:8080/servlet-tests/GetContextTest
    "Negative Test for getContext"      : FAIL - 
      org.apache.jcheck.servlet.client.javax_servlet.ServletContext.GetContext_1Test exception: java.io.FileNotFoundException: http://localhost:8080/servlet-tests/GetContext_1Test
    getMajorVersionTest                 : FAIL - 
      org.apache.jcheck.servlet.client.javax_servlet.ServletContext.GetMajorVersionTest exception: java.io.FileNotFoundException: http://localhost:8080/servlet-tests/GetMajorVersionTest
    getMinorVersionTest                 : FAIL - 
      org.apache.jcheck.servlet.client.javax_servlet.ServletContext.GetMinorVersionTest exception: java.io.FileNotFoundException: http://localhost:8080/servlet-tests/GetMinorVersionTest
    getMimeType                         : FAIL - 
      org.apache.jcheck.servlet.client.javax_servlet.ServletContext.GetMimeTypeTest exception: java.io.FileNotFoundException: http://localhost:8080/servlet-tests/GetMimeTypeTest
    "Negative Test for getMimeType"     : FAIL - 
      org.apache.jcheck.servlet.client.javax_servlet.ServletContext.GetMimeType_1Test exception: java.io.FileNotFoundException: http://localhost:8080/servlet-tests/GetMimeType_1Test
    getRealPathTest                     : FAIL - 
      org.apache.jcheck.servlet.client.javax_servlet.ServletContext.GetRealPathTest exception: java.io.FileNotFoundException: http://localhost:8080/servlet-tests/GetRealPathTest
    getResourceTest                     : FAIL - 
      org.apache.jcheck.servlet.client.javax_servlet.ServletContext.GetResourceTest exception: java.io.FileNotFoundException: http://localhost:8080/servlet-tests/GetResourceTest
    ServletContext.GetInitParameterN... : FAIL - 
      org.apache.jcheck.servlet.client.javax_servlet.ServletContext.GetInitParameterNamesTest exception: java.io.FileNotFoundException: http://localhost:8080/servlet-tests/GetInitParameterNamesTest
    ServletContext.GetInitParameter     : FAIL - 
      org.apache.jcheck.servlet.client.javax_servlet.ServletContext.GetInitParameterTest exception: java.io.FileNotFoundException: http://localhost:8080/servlet-tests/GetInitParameterTest
    "Negative Test:ServletContext.Ge... : FAIL - 
      org.apache.jcheck.servlet.client.javax_servlet.ServletContext.GetInitParameter_1Test exception: java.io.FileNotFoundException: http://localhost:8080/servlet-tests/GetInitParameter_1Test
    getResourceAsStreamTest             : FAIL - 
      org.apache.jcheck.servlet.client.javax_servlet.ServletContext.GetResourceAsStreamTest exception: java.io.FileNotFoundException: http://localhost:8080/servlet-tests/GetResourceAsStreamTest
    "Negative Test forgetAsStreamRes... : FAIL - 
      org.apache.jcheck.servlet.client.javax_servlet.ServletContext.GetResourceAsStream_1Test exception: java.io.FileNotFoundException: http://localhost:8080/servlet-tests/GetResourceAsStream_1Test
    getRequestDispatcher                : FAIL - 
      org.apache.jcheck.servlet.client.javax_servlet.ServletContext.GetRequestDispatcherTest exception: java.io.FileNotFoundException: http://localhost:8080/servlet-tests/SCGetRequestDispatcherTest
    Negative test fotrgetRequestDisp... : FAIL - 
      org.apache.jcheck.servlet.client.javax_servlet.ServletContext.GetRequestDispatcher_1Test exception: java.io.FileNotFoundException: http://localhost:8080/servlet-tests/GetRequestDispatcher_1Test
    log(String)                         : FAIL - 
      org.apache.jcheck.servlet.client.javax_servlet.ServletContext.Log_1Test exception: java.io.FileNotFoundException: http://localhost:8080/servlet-tests/Log_1Test
    log(String,Throwable)               : FAIL - 
      org.apache.jcheck.servlet.client.javax_servlet.ServletContext.Log_2Test exception: java.io.FileNotFoundException: http://localhost:8080/servlet-tests/Log_2Test
    getServletNames                     : FAIL - 
      org.apache.jcheck.servlet.client.javax_servlet.ServletContext.GetServletNamesTest exception: java.io.FileNotFoundException: http://localhost:8080/servlet-tests/GetServletNamesTest
    getServlets                         : FAIL - 
      org.apache.jcheck.servlet.client.javax_servlet.ServletContext.GetServletsTest exception: java.io.FileNotFoundException: http://localhost:8080/servlet-tests/GetServletsTest
    getServerinfo                       : FAIL - 
      org.apache.jcheck.servlet.client.javax_servlet.ServletContext.GetServerInfoTest exception: java.io.FileNotFoundException: http://localhost:8080/servlet-tests/GetServerInfoTest
    getServlet                          : FAIL - 
      org.apache.jcheck.servlet.client.javax_servlet.ServletContext.GetServletTest exception: java.io.FileNotFoundException: http://localhost:8080/servlet-tests/GetServletTest
    RemoveAttributeTest                 : FAIL - 
      org.apache.jcheck.servlet.client.javax_servlet.ServletContext.RemoveAttributeTest exception: java.io.FileNotFoundException: http://localhost:8080/servlet-tests/RemoveAttributeTest
    getNamedDispatcherTest              : FAIL - 
      org.apache.jcheck.servlet.client.javax_servlet.ServletContext.GetNamedDispatcherTest exception: java.io.FileNotFoundException: http://localhost:8080/servlet-tests/GetNamedDispatcherTest
    "Negative Test:getNamedDispatche... : FAIL - 
      org.apache.jcheck.servlet.client.javax_servlet.ServletContext.GetNamedDispatcher_1Test exception: java.io.FileNotFoundException: http://localhost:8080/servlet-tests/GetNamedDispatcher_1Test
    setMaxInactiveIntervalTest          : FAIL - 
      org.apache.jcheck.servlet.client.javax_servlet_http.HttpSession.SetMaxInactiveIntervalTest exception: java.io.FileNotFoundException: http://localhost:8080/servlet-tests/SetMaxInactiveIntervalTest
    HttpSession.getIdTest               : FAIL - 
      org.apache.jcheck.servlet.client.javax_servlet_http.HttpSession.GetIdTest exception: java.io.FileNotFoundException: http://localhost:8080/servlet-tests/HSGetIdTest
    HttpSession.getValueTest            : FAIL - 
      org.apache.jcheck.servlet.client.javax_servlet_http.HttpSession.GetValueTest exception: java.io.FileNotFoundException: http://localhost:8080/servlet-tests/HSGetValueTest
    Negative test1 for HttpSession.g... : FAIL - 
      org.apache.jcheck.servlet.client.javax_servlet_http.HttpSession.GetValue_01Test exception: java.io.FileNotFoundException: http://localhost:8080/servlet-tests/GetValue_01Test
    Negative test2 for HttpSession.g... : FAIL - 
      org.apache.jcheck.servlet.client.javax_servlet_http.HttpSession.GetValue_02Test exception: java.io.FileNotFoundException: http://localhost:8080/servlet-tests/GetValue_02Test
    getValueNames                       : FAIL - 
      org.apache.jcheck.servlet.client.javax_servlet_http.HttpSession.GetValueNamesTest exception: java.io.FileNotFoundException: http://localhost:8080/servlet-tests/GetValueNamesTest
    Negative Test:getValueNames         : FAIL - 
      org.apache.jcheck.servlet.client.javax_servlet_http.HttpSession.GetValueNames_01Test exception: java.io.FileNotFoundException: http://localhost:8080/servlet-tests/GetValueNames_01Test
    HttpSession.RemoveValueTest         : FAIL - 
      org.apache.jcheck.servlet.client.javax_servlet_http.HttpSession.RemoveValueTest exception: java.io.FileNotFoundException: http://localhost:8080/servlet-tests/RemoveValueTest
    "Negative Test1 for HttpSession.... : FAIL - 
      org.apache.jcheck.servlet.client.javax_servlet_http.HttpSession.RemoveValue_01Test exception: java.io.FileNotFoundException: http://localhost:8080/servlet-tests/RemoveValue_01Test
    "Negative Test2 For Remove Value"   : FAIL - 
      org.apache.jcheck.servlet.client.javax_servlet_http.HttpSession.RemoveValue_02Test exception: java.io.FileNotFoundException: http://localhost:8080/servlet-tests/RemoveValue_02Test
    invalidateTest                      : FAIL - 
      org.apache.jcheck.servlet.client.javax_servlet_http.HttpSession.InvalidateTest exception: java.io.FileNotFoundException: http://localhost:8080/servlet-tests/InvalidateTest
    HttpSession.putValueTest            : FAIL - 
      org.apache.jcheck.servlet.client.javax_servlet_http.HttpSession.PutValueTest exception: java.io.FileNotFoundException: http://localhost:8080/servlet-tests/PutValueTest
    NegativeTest1 for putValue          : FAIL - 
      org.apache.jcheck.servlet.client.javax_servlet_http.HttpSession.PutValue_01Test exception: java.io.FileNotFoundException: http://localhost:8080/servlet-tests/PutValue_01Test
    NegativeTest2 for putValue          : FAIL - 
      org.apache.jcheck.servlet.client.javax_servlet_http.HttpSession.PutValue_02Test exception: java.io.FileNotFoundException: http://localhost:8080/servlet-tests/PutValue_02Test
    Negative Test for getMaxInactive... : FAIL - 
      org.apache.jcheck.servlet.client.javax_servlet_http.HttpSession.GetMaxInactiveInterval_01Test exception: java.io.FileNotFoundException: http://localhost:8080/servlet-tests/GetMaxInactiveInterval_01Test
    getValueNames                       : FAIL - 
      org.apache.jcheck.servlet.client.javax_servlet_http.HttpSession.GetValueNamesTest exception: java.io.FileNotFoundException: http://localhost:8080/servlet-tests/GetValueNamesTest
    getCreationTime                     : FAIL - 
      org.apache.jcheck.servlet.client.javax_servlet_http.HttpSession.GetCreationTimeTest exception: java.io.FileNotFoundException: http://localhost:8080/servlet-tests/GetCreationTimeTest
    getMaxInactiveInterval              : FAIL - 
      org.apache.jcheck.servlet.client.javax_servlet_http.HttpSession.GetMaxInactiveIntervalTest exception: java.io.FileNotFoundException: http://localhost:8080/servlet-tests/GetMaxInactiveIntervalTest
    isNewTest                           : FAIL - 
      org.apache.jcheck.servlet.client.javax_servlet_http.HttpSession.IsNewTest exception: java.io.FileNotFoundException: http://localhost:8080/servlet-tests/IsNewTest
    Negative IsNew Test                 : FAIL - 
      org.apache.jcheck.servlet.client.javax_servlet_http.HttpSession.IsNew_01Test exception: java.io.FileNotFoundException: http://localhost:8080/servlet-tests/IsNew_01Test
    Negative Test:ParsePostData         : FAIL - 
      org.apache.jcheck.servlet.client.javax_servlet_http.HttpUtils.ParsePostData_01Test exception: java.io.FileNotFoundException: http://localhost:8080/servlet-tests/ParsePostData_01Test
    Negative Test:parseQueryString      : FAIL - 
      org.apache.jcheck.servlet.client.javax_servlet_http.HttpUtils.ParseQueryStringTest exception: java.io.FileNotFoundException: http://localhost:8080/servlet-tests/ParseQueryStringTest
    parseQueryString                    : FAIL - 
      org.apache.jcheck.servlet.client.javax_servlet_http.HttpUtils.ParseQueryString_01Test exception: java.io.FileNotFoundException: http://localhost:8080/servlet-tests/ParseQueryString_01Test
    getRequestURLTest                   : FAIL - 
      org.apache.jcheck.servlet.client.javax_servlet_http.HttpUtils.GetRequestURLTest exception: java.io.FileNotFoundException: http://localhost:8080/servlet-tests/GetRequestURLTest
    Parsing Post Data                   : FAIL - 
      org.apache.jcheck.servlet.client.javax_servlet_http.HttpUtils.ParsePostDataTest exception: java.io.FileNotFoundException: http://localhost:8080/servlet-tests/ParsePostDataTest
    getRequestedSessionIdTest           : FAIL - 
      org.apache.jcheck.servlet.client.javax_servlet_http.HttpServletRequest.GetRequestedSessionIdTest exception: java.io.FileNotFoundException: http://localhost:8080/servlet-tests/GetRequestedSessionIdTest
    getIntHeaderTest                    : FAIL - 
      org.apache.jcheck.servlet.client.javax_servlet_http.HttpServletRequest.GetIntHeaderTest exception: java.io.FileNotFoundException: http://localhost:8080/servlet-tests/GetIntHeaderTest
    getRequestURITest                   : FAIL - 
      org.apache.jcheck.servlet.client.javax_servlet_http.HttpServletRequest.GetRequestURITest exception: java.io.FileNotFoundException: http://localhost:8080/servlet-tests/GetRequestURITest
    Negative Test:getHeaderTest         : FAIL - 
      org.apache.jcheck.servlet.client.javax_servlet_http.HttpServletRequest.GetHeader_01Test exception: java.io.FileNotFoundException: http://localhost:8080/servlet-tests/GetHeader_01Test
    Negative Test:getDateHeader         : FAIL - 
      org.apache.jcheck.servlet.client.javax_servlet_http.HttpServletRequest.GetDateHeader_01Test exception: java.io.FileNotFoundException: http://localhost:8080/servlet-tests/GetDateHeader_01Test
    getHeaderTest                       : FAIL - 
      org.apache.jcheck.servlet.client.javax_servlet_http.HttpServletRequest.GetHeaderTest exception: java.io.FileNotFoundException: http://localhost:8080/servlet-tests/GetHeaderTest
    getSessionTest                      : FAIL - 
      org.apache.jcheck.servlet.client.javax_servlet_http.HttpServletRequest.GetSession_01Test exception: java.io.FileNotFoundException: http://localhost:8080/servlet-tests/GetSession_01Test
    getDateHeaderTest                   : FAIL - 
      org.apache.jcheck.servlet.client.javax_servlet_http.HttpServletRequest.GetDateHeaderTest exception: java.io.FileNotFoundException: http://localhost:8080/servlet-tests/GetDateHeaderTest
    getServletPathTest                  : FAIL - 
      org.apache.jcheck.servlet.client.javax_servlet_http.HttpServletRequest.GetServletPathTest exception: java.io.FileNotFoundException: http://localhost:8080/servlet-tests/GetServletPathTest
    getHeaderNames                      : FAIL - 
      org.apache.jcheck.servlet.client.javax_servlet_http.HttpServletRequest.GetHeaderNamesTest exception: java.io.FileNotFoundException: http://localhost:8080/servlet-tests/GetHeaderNamesTest
    getPathTranslatedTest               : FAIL - 
      org.apache.jcheck.servlet.client.javax_servlet_http.HttpServletRequest.GetPathTranslatedTest exception: java.io.FileNotFoundException: http://localhost:8080/servlet-tests/GetPathTranslatedTest/maybeValid
    getPathInfoTest                     : FAIL - 
      org.apache.jcheck.servlet.client.javax_servlet_http.HttpServletRequest.GetPathInfoTest exception: java.io.FileNotFoundException: http://localhost:8080/servlet-tests/GetPathInfoTest/SOMEPATH
    Negative Test:getPathInfoTest       : FAIL - 
      org.apache.jcheck.servlet.client.javax_servlet_http.HttpServletRequest.GetPathInfo_01Test exception: java.io.FileNotFoundException: http://localhost:8080/servlet-tests/GetPathInfo_01Test
    Negative Test1:getIntHeader         : FAIL - 
      org.apache.jcheck.servlet.client.javax_servlet_http.HttpServletRequest.GetIntHeader_1Test exception: java.io.FileNotFoundException: http://localhost:8080/servlet-tests/GetIntHeader_1Test
    getCookiesTest                      : FAIL - 
      org.apache.jcheck.servlet.client.javax_servlet_http.HttpServletRequest.GetCookiesTest exception: java.io.FileNotFoundException: http://localhost:8080/servlet-tests/GetCookiesTest
    Negative Test:getCookies            : FAIL - 
      org.apache.jcheck.servlet.client.javax_servlet_http.HttpServletRequest.GetCookies_01Test exception: java.io.FileNotFoundException: http://localhost:8080/servlet-tests/GetCookies_01Test
    IsRequestedSessionIdFromURLTest     : FAIL - 
      org.apache.jcheck.servlet.client.javax_servlet_http.HttpServletRequest.IsRequestedSessionIdFromURLTest exception: java.io.FileNotFoundException: http://localhost:8080/servlet-tests/IsRequestedSessionIdFromURLTest
    Negative Test2:getIntHeader         : FAIL - 
      org.apache.jcheck.servlet.client.javax_servlet_http.HttpServletRequest.GetIntHeader_2Test exception: java.io.FileNotFoundException: http://localhost:8080/servlet-tests/GetIntHeader_2Test
    Negative Test:getDateHeader         : FAIL - 
      org.apache.jcheck.servlet.client.javax_servlet_http.HttpServletRequest.GetDateHeader_01Test exception: java.io.FileNotFoundException: http://localhost:8080/servlet-tests/GetDateHeader_01Test
    "getting Query String"              : FAIL - 
      org.apache.jcheck.servlet.client.javax_servlet_http.HttpServletRequest.GetQueryStringTest exception: java.io.FileNotFoundException: http://localhost:8080/servlet-tests/GetQueryStringTest?pet=cat
    Negative Test:getQueryString        : FAIL - 
      org.apache.jcheck.servlet.client.javax_servlet_http.HttpServletRequest.GetQueryString_01Test exception: java.io.FileNotFoundException: http://localhost:8080/servlet-tests/GetQueryString_01Test
    IsRequestedSessionIdValidTest       : FAIL - 
      org.apache.jcheck.servlet.client.javax_servlet_http.HttpServletRequest.IsRequestedSessionIdValidTest exception: java.io.FileNotFoundException: http://localhost:8080/servlet-tests/IsRequestedSessionIdValidTest
    getMethod(GET)                      : FAIL - 
      org.apache.jcheck.servlet.client.javax_servlet_http.HttpServletRequest.GetMethodTest exception: java.io.FileNotFoundException: http://localhost:8080/servlet-tests/GetMethodTest
    getMethod(POST)                     : FAIL - 
      org.apache.jcheck.servlet.client.javax_servlet_http.HttpServletRequest.GetMethod_POSTTest exception: java.io.FileNotFoundException: http://localhost:8080/servlet-tests/GetMethod_POSTTest
    getMethod(HEAD)                     : OK - Not Found
    AddCookie                           : FAIL - 
      org.apache.jcheck.servlet.client.javax_servlet_http.HttpServletResponse.AddCookieTest exception: java.lang.Exception: Add cookie failed to add cookies to the Http Header
    ContainsHeader                      : FAIL - 
      org.apache.jcheck.servlet.client.javax_servlet_http.HttpServletResponse.ContainsHeaderTest exception: java.io.FileNotFoundException: http://localhost:8080/servlet-tests/ContainsHeaderTest
    ContainsHeader                      : FAIL - 
      org.apache.jcheck.servlet.client.javax_servlet_http.HttpServletResponse.ContainsHeader_01Test exception: java.io.FileNotFoundException: http://localhost:8080/servlet-tests/ContainsHeader_01Test
    encodeRedirectURLTest               : FAIL - 
      org.apache.jcheck.servlet.client.javax_servlet_http.HttpServletResponse.EncodeRedirectURLTest exception: java.io.FileNotFoundException: http://localhost:8080/servlet-tests/EncodeRedirectURLTest
    setDateHeaderTest                   : FAIL - 
      org.apache.jcheck.servlet.client.javax_servlet_http.HttpServletResponse.SetDateHeaderTest exception: java.lang.Exception: Value wrong
    encodeURLTest                       : FAIL - 
      org.apache.jcheck.servlet.client.javax_servlet_http.HttpServletResponse.EncodeURLTest exception: java.io.FileNotFoundException: http://localhost:8080/servlet-tests/EncodeURLTest
    setIntHeaderTest                    : FAIL - 
      org.apache.jcheck.servlet.client.javax_servlet_http.HttpServletResponse.SetIntHeaderTest exception: java.lang.Exception: failed to set int header value
    setStatus(int)                      : FAIL - 
      org.apache.jcheck.servlet.client.javax_servlet_http.HttpServletResponse.SetStatusTest exception: java.io.FileNotFoundException: http://localhost:8080/servlet-tests/SetStatusTest
    setStatus(int,String)               : FAIL - 
      org.apache.jcheck.servlet.client.javax_servlet_http.HttpServletResponse.SetStatus_1Test exception: java.io.FileNotFoundException: http://localhost:8080/servlet-tests/SetStatus_1Test
    HttpSessionContext.getSession       : FAIL - 
      org.apache.jcheck.servlet.client.javax_servlet_http.HttpSessionContext.GetSessionTest exception: java.io.FileNotFoundException: http://localhost:8080/servlet-tests/GetSessionTest
    HttpSessionContext.getIds           : FAIL - 
      org.apache.jcheck.servlet.client.javax_servlet_http.HttpSessionContext.GetIdsTest exception: java.io.FileNotFoundException: http://localhost:8080/servlet-tests/GetIdsTest
    HttpSessionBindingEvent.getName     : FAIL - 
      org.apache.jcheck.servlet.client.javax_servlet_http.HttpSessionBindingEvent.GetNameTest exception: java.io.FileNotFoundException: http://localhost:8080/servlet-tests/HSBEGetNameTest
    HttpSessionBindingEvent.getSession  : FAIL - 
      org.apache.jcheck.servlet.client.javax_servlet_http.HttpSessionBindingEvent.GetSessionTest exception: java.io.FileNotFoundException: http://localhost:8080/servlet-tests/HSBGetSessionTest
    valueTest                           : FAIL - 
      org.apache.jcheck.servlet.client.javax_servlet_http.HttpSessionBindingListener.ValueBoundTest exception: java.io.FileNotFoundException: http://localhost:8080/servlet-tests/ValueBoundTest
    valueUnboundTest                    : FAIL - 
      org.apache.jcheck.servlet.client.javax_servlet_http.HttpSessionBindingListener.ValueUnboundTest exception: java.io.FileNotFoundException: http://localhost:8080/servlet-tests/ValueUnboundTest
    getCharacterEncoding                : FAIL - 
      org.apache.jcheck.servlet.client.javax_servlet.ServletResponse.GetCharacterEncodingTest exception: java.io.FileNotFoundException: http://localhost:8080/servlet-tests/GetCharacterEncodingTest
    setContentLengthTest                : FAIL - 
      org.apache.jcheck.servlet.client.javax_servlet.ServletResponse.SetContentLengthTest exception: java.lang.Exception: problem getting ContentLength
    setContentTypeTest                  : FAIL - 
      org.apache.jcheck.servlet.client.javax_servlet.ServletResponse.SetContentTypeTest exception: java.net.SocketException: Socket closed
    "Resetting Buffer"                  : FAIL - 
      org.apache.jcheck.servlet.client.javax_servlet.ServletResponse.ResetTest exception: java.io.FileNotFoundException: http://localhost:8080/servlet-tests/ResetTest
    "Negative Test:Reset"               : FAIL - 
      org.apache.jcheck.servlet.client.javax_servlet.ServletResponse.Reset_1Test exception: java.io.FileNotFoundException: http://localhost:8080/servlet-tests/Reset_1Test
    "Getting BUfferSize"                : FAIL - 
      org.apache.jcheck.servlet.client.javax_servlet.ServletResponse.GetBufferSizeTest exception: java.io.FileNotFoundException: http://localhost:8080/servlet-tests/GetBufferSizeTest
    "FlushBufferTest"                   : FAIL - 
      org.apache.jcheck.servlet.client.javax_servlet.ServletResponse.FlushBufferTest exception: java.io.FileNotFoundException: http://localhost:8080/servlet-tests/FlushBufferTest
    "Setting BufferSize"                : FAIL - 
      org.apache.jcheck.servlet.client.javax_servlet.ServletResponse.SetBufferSizeTest exception: java.io.FileNotFoundException: http://localhost:8080/servlet-tests/SetBufferSizeTest
    "NegativeTest3:setBufferSize"       : FAIL - 
      org.apache.jcheck.servlet.client.javax_servlet.ServletResponse.SetBufferSize_2Test exception: java.io.FileNotFoundException: http://localhost:8080/servlet-tests/SetBufferSize_2Test
    "Setting Locale"                    : FAIL - 
      org.apache.jcheck.servlet.client.javax_servlet.ServletResponse.SetLocaleTest exception: java.lang.NullPointerException
    "IsCommittedTest"                   : FAIL - 
      org.apache.jcheck.servlet.client.javax_servlet.ServletResponse.IsCommittedTest exception: java.io.FileNotFoundException: http://localhost:8080/servlet-tests/IsCommittedTest
    getWriterTest                       : FAIL - 
      org.apache.jcheck.servlet.client.javax_servlet.ServletResponse.GetWriter_1Test exception: java.io.FileNotFoundException: http://localhost:8080/servlet-tests/GetWriter_1Test
    SingleThreadModelTest               : FAIL - 
      org.apache.jcheck.servlet.client.javax_servlet.SingleThreadModel.SingleModelTest exception: java.io.FileNotFoundException: http://localhost:8080/servlet-tests/SingleModelTest
HANDLER THREAD PROBLEM: java.io.IOException: Broken pipe
    "ServletException() constructor ... : FAIL - 
      org.apache.jcheck.servlet.client.javax_servlet.ServletException.Constructor1Test exception: java.io.FileNotFoundException: http://localhost:8080/servlet-tests/SEConstructor1Test
    "ServletException(String) constr... : FAIL - 
      org.apache.jcheck.servlet.client.javax_servlet.ServletException.Constructor2Test exception: java.io.FileNotFoundException: http://localhost:8080/servlet-tests/SEConstructor2Test
    "ServletException(Throwable) con... : FAIL - 
      org.apache.jcheck.servlet.client.javax_servlet.ServletException.Constructor3Test exception: java.io.FileNotFoundException: http://localhost:8080/servlet-tests/Constructor3Test
    "ServletException(String,Throwab... : FAIL - 
      org.apache.jcheck.servlet.client.javax_servlet.ServletException.Constructor4Test exception: java.io.FileNotFoundException: http://localhost:8080/servlet-tests/Constructor4Test
    getRootCauseTest                    : FAIL - 
      org.apache.jcheck.servlet.client.javax_servlet.ServletException.GetRootCauseTest exception: java.io.FileNotFoundException: http://localhost:8080/servlet-tests/GetRootCauseTest
    "Negative Test for getRootCause"    : FAIL - 
      org.apache.jcheck.servlet.client.javax_servlet.ServletException.GetRootCause_1Test exception: java.io.FileNotFoundException: http://localhost:8080/servlet-tests/GetRootCause_1Test
    getUnavailableSeconds               : FAIL - 
      org.apache.jcheck.servlet.client.javax_servlet.UnavailableException.GetUnavailableSecondsTest exception: java.io.FileNotFoundException: http://localhost:8080/servlet-tests/GetUnavailableSecondsTest
    "Negative Test:getUnavailableSec... : FAIL - 
      org.apache.jcheck.servlet.client.javax_servlet.UnavailableException.GetUnavailableSeconds_1Test exception: java.io.FileNotFoundException: http://localhost:8080/servlet-tests/GetUnavailableSeconds_1Test
    "UnvailableException(Servlet,Str... : FAIL - 
      org.apache.jcheck.servlet.client.javax_servlet.UnavailableException.Constructor1Test exception: java.io.FileNotFoundException: http://localhost:8080/servlet-tests/UEConstructor1Test
    "UnavailableException(int,Servle... : FAIL - 
      org.apache.jcheck.servlet.client.javax_servlet.UnavailableException.Constructor2Test exception: java.io.FileNotFoundException: http://localhost:8080/servlet-tests/UEConstructor2Test
    UnavailableException.isPermanant... : FAIL - 
      org.apache.jcheck.servlet.client.javax_servlet.UnavailableException.IsPermanentTest exception: java.io.FileNotFoundException: http://localhost:8080/servlet-tests/IsPermanentTest
    UnavailableException.getServletTest : FAIL - 
      org.apache.jcheck.servlet.client.javax_servlet.UnavailableException.GetServletTest exception: java.io.FileNotFoundException: http://localhost:8080/servlet-tests/UEGetServletTest
    getServletContext                   : FAIL - 
      org.apache.jcheck.servlet.client.javax_servlet.ServletConfig.GetServletContextTest exception: java.io.FileNotFoundException: http://localhost:8080/servlet-tests/SCGetServletContextTest
    GetServletNameTest                  : FAIL - 
      org.apache.jcheck.servlet.client.javax_servlet.ServletConfig.GetServletNameTest exception: java.io.FileNotFoundException: http://localhost:8080/servlet-tests/GetServletNameTest
    "checking error-code"               : OK - OK
    "checking error-code"               : OK - OK
    "checking session-timeout"          : FAIL - 
      org.apache.jcheck.servlet.client.deployment_descriptor.SessionTimeOutTest exception: java.io.FileNotFoundException: http://localhost:8080/servlet-tests/SessionTimeOutTest
    "checking /foo/bar/String1"         : FAIL - 
      org.apache.jcheck.servlet.client.deployment_descriptor.UrlPatternTest exception: java.io.FileNotFoundException: http://localhost:8080/servlet-tests/UrlPatternTest/checking/pond
    "checking /bar/*"                   : FAIL - 
      org.apache.jcheck.servlet.client.deployment_descriptor.UrlPattern_1Test exception: java.io.FileNotFoundException: http://localhost:8080/servlet-tests/UrlPattern_1Test/boo
    "checking /*.ext"                   : FAIL - 
      org.apache.jcheck.servlet.client.deployment_descriptor.UrlPattern_2Test exception: java.io.FileNotFoundException: http://localhost:8080/servlet-tests/*.doc
    "checking /foo/bar/String2"         : FAIL - 
      org.apache.jcheck.servlet.client.deployment_descriptor.UrlPattern_3Test exception: java.io.FileNotFoundException: http://localhost:8080/servlet-tests/UrlPatternTest/checking/well

<<< FAIL >>>
Number of tests Passed: 3
Number of tests Failed: 207

complete in : 61.179 seconds

HANDLER THREAD PROBLEM: java.io.IOException: Broken pipe
Tomcat Web Server Version 2.2
</test>
ShPACKAGE:
wn Http Server
Taking down context: 
Context: org.apache.tomcat.core.Context@1fa4fa2b down
Taking down context: /jsp-tests
Context: org.apache.tomcat.core.Context@1fa4f8dd down
Taking down context: /examples
Context: org.apache.tomcat.core.Context@1fa4f982 down
Taking down context: /servlet-tests
Context: org.apache.tomcat.core.Context@1fa4f9c8 down
Tomcat WebServer Version 2.2 - shutdown

Mime
View raw message