tiles-dev mailing list archives

Site index · List index
Message view « Date » · « Thread »
Top « Date » · « Thread »
From Apache Jenkins Server <jenk...@builds.apache.org>
Subject Build failed in Jenkins: Tiles-Framework-3.0.x #36
Date Tue, 07 Nov 2017 11:39:36 GMT
See <https://builds.apache.org/job/Tiles-Framework-3.0.x/36/display/redirect?page=changes>

Changes:

[mck] svn merge -c1814482 ^/tiles/framework/tags/tiles-parent-3.0.8

------------------------------------------
Started by an SCM change
[EnvInject] - Loading node environment variables.
Building remotely on H15 (couchdbtest ubuntu xenial) in workspace <https://builds.apache.org/job/Tiles-Framework-3.0.x/ws/>
Updating https://svn.apache.org/repos/asf/tiles/framework/branches/TILES_3_0_X at revision
'2017-11-07T11:38:22.758 +0000'
U         assembly/pom.xml
U         src/site/apt/dev/release.apt
 U        .
At revision 1814486

Parsing POMs
Established TCP socket on 45454
maven33-agent.jar already up to date
maven33-interceptor.jar already up to date
maven3-interceptor-commons.jar already up to date
[Tiles-Framework-3.0.x] $ /home/jenkins/tools/java/latest1.7/bin/java -Xmx2g -Xms256m -cp
/home/jenkins/jenkins-slave/maven33-agent.jar:/home/jenkins/tools/maven/apache-maven-3.3.9/boot/plexus-classworlds-2.5.2.jar:/home/jenkins/tools/maven/apache-maven-3.3.9/conf/logging
jenkins.maven3.agent.Maven33Main /home/jenkins/tools/maven/apache-maven-3.3.9 /home/jenkins/jenkins-slave/slave.jar
/home/jenkins/jenkins-slave/maven33-interceptor.jar /home/jenkins/jenkins-slave/maven3-interceptor-commons.jar
45454
<===[JENKINS REMOTING CAPACITY]===>   channel started
ERROR: ================================================================================
ERROR: Invalid project setup: jenkins/security/MasterToSlaveCallable : Unsupported major.minor
version 52.0
ERROR: [JENKINS-18403][JENKINS-28294] JDK 'JDK 1.7 (latest)' not supported to run Maven projects.
ERROR: Maven projects have to be launched with a Java version greater or equal to the minimum
version required by the master.
ERROR: Use the Maven JDK Toolchains (plugin) to build your maven project with an older JDK.
ERROR: Retrying with slave Java and setting compile/test properties to point to /home/jenkins/tools/java/latest1.7.
ERROR: ================================================================================
Established TCP socket on 34710
maven33-agent.jar already up to date
maven33-interceptor.jar already up to date
maven3-interceptor-commons.jar already up to date
[Tiles-Framework-3.0.x] $ /usr/local/asfpackages/java/jdk1.8.0_131/jre/bin/java -Xmx2g -Xms256m
-cp /home/jenkins/jenkins-slave/maven33-agent.jar:/home/jenkins/tools/maven/apache-maven-3.3.9/boot/plexus-classworlds-2.5.2.jar:/home/jenkins/tools/maven/apache-maven-3.3.9/conf/logging
jenkins.maven3.agent.Maven33Main /home/jenkins/tools/maven/apache-maven-3.3.9 /home/jenkins/jenkins-slave/slave.jar
/home/jenkins/jenkins-slave/maven33-interceptor.jar /home/jenkins/jenkins-slave/maven3-interceptor-commons.jar
34710
<===[JENKINS REMOTING CAPACITY]===>   channel started
Executing Maven:  -B -f <https://builds.apache.org/job/Tiles-Framework-3.0.x/ws/pom.xml>
-Dmaven.repo.local=/home/jenkins/jenkins-slave/maven-repositories/1 clean install
[INFO] Scanning for projects...
[INFO] ------------------------------------------------------------------------
[INFO] Reactor Build Order:
[INFO] 
[INFO] Tiles 3
[INFO] Tiles - API
[INFO] Tiles - Core Library
[INFO] Tiles - Template Technologies Support
[INFO] Tiles - Servlet support
[INFO] Tiles - JSP support
[INFO] Tiles - FreeMarker Support
[INFO] Tiles - Velocity Support
[INFO] Tiles - EL support
[INFO] Tiles - MVEL support
[INFO] Tiles - OGNL support
[INFO] Tiles - Compatibility
[INFO] Tiles - Extras
[INFO] Tiles test webapp module collector
[INFO] Tiles - Test webapp common classes
[INFO] Tiles - Test webapp alternate configuration
[INFO] Tiles - Test webapp database configuration
[INFO] Tiles - Apps - Test
[INFO] Tiles Assembly
[INFO]                                                                         
[INFO] ------------------------------------------------------------------------
[INFO] Building Tiles 3 3.0.9-SNAPSHOT
[INFO] ------------------------------------------------------------------------
[INFO] 
[INFO] --- maven-clean-plugin:2.5:clean (default-clean) @ tiles-parent ---
[INFO] 
[INFO] --- maven-enforcer-plugin:1.2:enforce (enforce-java) @ tiles-parent ---
[WARNING] Rule 0: org.apache.maven.plugins.enforcer.RequireJavaVersion failed with message:
Detected JDK Version: 1.8.0-131 is not in the allowed range [1.7.0-45,1.8).
[INFO] ------------------------------------------------------------------------
[INFO] Reactor Summary:
[INFO] 
[INFO] Tiles 3 ............................................ FAILURE [  4.452 s]
[INFO] Tiles - API ........................................ SKIPPED
[INFO] Tiles - Core Library ............................... SKIPPED
[INFO] Tiles - Template Technologies Support .............. SKIPPED
[INFO] Tiles - Servlet support ............................ SKIPPED
[INFO] Tiles - JSP support ................................ SKIPPED
[INFO] Tiles - FreeMarker Support ......................... SKIPPED
[INFO] Tiles - Velocity Support ........................... SKIPPED
[INFO] Tiles - EL support ................................. SKIPPED
[INFO] Tiles - MVEL support ............................... SKIPPED
[INFO] Tiles - OGNL support ............................... SKIPPED
[INFO] Tiles - Compatibility .............................. SKIPPED
[INFO] Tiles - Extras ..................................... SKIPPED
[INFO] Tiles test webapp module collector ................. SKIPPED
[INFO] Tiles - Test webapp common classes ................. SKIPPED
[INFO] Tiles - Test webapp alternate configuration ........ SKIPPED
[INFO] Tiles - Test webapp database configuration ......... SKIPPED
[INFO] Tiles - Apps - Test ................................ SKIPPED
[INFO] Tiles Assembly ..................................... SKIPPED
[INFO] ------------------------------------------------------------------------
[INFO] BUILD FAILURE
[INFO] ------------------------------------------------------------------------
[INFO] Total time: 26.172 s
[INFO] Finished at: 2017-11-07T11:39:19+00:00
[INFO] Final Memory: 22M/309M
[INFO] ------------------------------------------------------------------------
Waiting for Jenkins to finish collecting data
[ERROR] Failed to execute goal org.apache.maven.plugins:maven-enforcer-plugin:1.2:enforce
(enforce-java) on project tiles-parent: Some Enforcer rules have failed. Look above for specific
messages explaining why the rule failed. -> [Help 1]
[ERROR] 
[ERROR] To see the full stack trace of the errors, re-run Maven with the -e switch.
[ERROR] Re-run Maven using the -X switch to enable full debug logging.
[ERROR] 
[ERROR] For more information about the errors and possible solutions, please read the following
articles:
[ERROR] [Help 1] http://cwiki.apache.org/confluence/display/MAVEN/MojoExecutionException
[JENKINS] Archiving <https://builds.apache.org/job/Tiles-Framework-3.0.x/ws/tiles-compat/pom.xml>
to org.apache.tiles/tiles-compat/3.0.9-SNAPSHOT/tiles-compat-3.0.9-SNAPSHOT.pom
[JENKINS] Archiving <https://builds.apache.org/job/Tiles-Framework-3.0.x/ws/pom.xml>
to org.apache.tiles/tiles-parent/3.0.9-SNAPSHOT/tiles-parent-3.0.9-SNAPSHOT.pom
[JENKINS] Archiving <https://builds.apache.org/job/Tiles-Framework-3.0.x/ws/tiles-velocity/pom.xml>
to org.apache.tiles/tiles-velocity/3.0.9-SNAPSHOT/tiles-velocity-3.0.9-SNAPSHOT.pom
[JENKINS] Archiving <https://builds.apache.org/job/Tiles-Framework-3.0.x/ws/tiles-test-pom/tiles-test-common/pom.xml>
to org.apache.tiles/tiles-test-common/3.0.9-SNAPSHOT/tiles-test-common-3.0.9-SNAPSHOT.pom
[JENKINS] Archiving <https://builds.apache.org/job/Tiles-Framework-3.0.x/ws/tiles-jsp/pom.xml>
to org.apache.tiles/tiles-jsp/3.0.9-SNAPSHOT/tiles-jsp-3.0.9-SNAPSHOT.pom
[JENKINS] Archiving <https://builds.apache.org/job/Tiles-Framework-3.0.x/ws/tiles-servlet/pom.xml>
to org.apache.tiles/tiles-servlet/3.0.9-SNAPSHOT/tiles-servlet-3.0.9-SNAPSHOT.pom
[JENKINS] Archiving <https://builds.apache.org/job/Tiles-Framework-3.0.x/ws/tiles-template/pom.xml>
to org.apache.tiles/tiles-template/3.0.9-SNAPSHOT/tiles-template-3.0.9-SNAPSHOT.pom
[JENKINS] Archiving <https://builds.apache.org/job/Tiles-Framework-3.0.x/ws/tiles-test-pom/tiles-test-db/pom.xml>
to org.apache.tiles/tiles-test-db/3.0.9-SNAPSHOT/tiles-test-db-3.0.9-SNAPSHOT.pom
[JENKINS] Archiving <https://builds.apache.org/job/Tiles-Framework-3.0.x/ws/tiles-core/pom.xml>
to org.apache.tiles/tiles-core/3.0.9-SNAPSHOT/tiles-core-3.0.9-SNAPSHOT.pom
[JENKINS] Archiving <https://builds.apache.org/job/Tiles-Framework-3.0.x/ws/tiles-freemarker/pom.xml>
to org.apache.tiles/tiles-freemarker/3.0.9-SNAPSHOT/tiles-freemarker-3.0.9-SNAPSHOT.pom
[JENKINS] Archiving <https://builds.apache.org/job/Tiles-Framework-3.0.x/ws/tiles-extras/pom.xml>
to org.apache.tiles/tiles-extras/3.0.9-SNAPSHOT/tiles-extras-3.0.9-SNAPSHOT.pom
[JENKINS] Archiving <https://builds.apache.org/job/Tiles-Framework-3.0.x/ws/tiles-test-pom/pom.xml>
to org.apache.tiles/tiles-test-pom/3.0.9-SNAPSHOT/tiles-test-pom-3.0.9-SNAPSHOT.pom
[JENKINS] Archiving <https://builds.apache.org/job/Tiles-Framework-3.0.x/ws/tiles-api/pom.xml>
to org.apache.tiles/tiles-api/3.0.9-SNAPSHOT/tiles-api-3.0.9-SNAPSHOT.pom
[JENKINS] Archiving <https://builds.apache.org/job/Tiles-Framework-3.0.x/ws/tiles-mvel/pom.xml>
to org.apache.tiles/tiles-mvel/3.0.9-SNAPSHOT/tiles-mvel-3.0.9-SNAPSHOT.pom
[JENKINS] Archiving <https://builds.apache.org/job/Tiles-Framework-3.0.x/ws/assembly/pom.xml>
to org.apache.tiles/tiles-assembly/3.0.9-SNAPSHOT/tiles-assembly-3.0.9-SNAPSHOT.pom
[JENKINS] Archiving <https://builds.apache.org/job/Tiles-Framework-3.0.x/ws/tiles-test-pom/tiles-test-alt/pom.xml>
to org.apache.tiles/tiles-test-alt/3.0.9-SNAPSHOT/tiles-test-alt-3.0.9-SNAPSHOT.pom
[JENKINS] Archiving <https://builds.apache.org/job/Tiles-Framework-3.0.x/ws/tiles-ognl/pom.xml>
to org.apache.tiles/tiles-ognl/3.0.9-SNAPSHOT/tiles-ognl-3.0.9-SNAPSHOT.pom
[JENKINS] Archiving <https://builds.apache.org/job/Tiles-Framework-3.0.x/ws/tiles-el/pom.xml>
to org.apache.tiles/tiles-el/3.0.9-SNAPSHOT/tiles-el-3.0.9-SNAPSHOT.pom
[JENKINS] Archiving <https://builds.apache.org/job/Tiles-Framework-3.0.x/ws/tiles-test-pom/tiles-test/pom.xml>
to org.apache.tiles/tiles-test/3.0.9-SNAPSHOT/tiles-test-3.0.9-SNAPSHOT.pom
channel stopped

Mime
View raw message