tiles-dev mailing list archives

Site index · List index
Message view « Date » · « Thread »
Top « Date » · « Thread »
From Apache Jenkins Server <jenk...@builds.apache.org>
Subject Build failed in Jenkins: Tiles-Request-1.0.x (Java6) #1
Date Thu, 29 May 2014 09:06:36 GMT
See <https://builds.apache.org/job/Tiles-Request-1.0.x%20(Java6)/1/>

------------------------------------------
[...truncated 448 lines...]
AU        tiles-request-api\src\test\java\org\apache\tiles\request\AbstractRequestTest.java
AU        tiles-request-api\src\test\java\org\apache\tiles\request\NotAvailableFeatureExceptionTest.java
AU        tiles-request-api\src\test\java\org\apache\tiles\request\DefaultRequestWrapperTest.java
A         tiles-request-api\src\test\java\org\apache\tiles\request\locale
A         tiles-request-api\src\test\java\org\apache\tiles\request\locale\LocaleUtilTest.java
A         tiles-request-api\src\test\java\org\apache\tiles\request\locale\URLApplicationResourceTest.java
A         tiles-request-api\src\test\java\org\apache\tiles\request\locale\PostfixedApplicationResourceTest.java
A         tiles-request-api\src\test\java\org\apache\tiles\request\render
AU        tiles-request-api\src\test\java\org\apache\tiles\request\render\ChainedDelegateRendererTest.java
AU        tiles-request-api\src\test\java\org\apache\tiles\request\render\StringRendererTest.java
AU        tiles-request-api\src\test\java\org\apache\tiles\request\render\BasicRendererFactoryTest.java
AU        tiles-request-api\src\test\java\org\apache\tiles\request\render\PublisherRendererTest.java
AU        tiles-request-api\src\test\java\org\apache\tiles\request\render\NoSuchRendererExceptionTest.java
AU        tiles-request-api\src\test\java\org\apache\tiles\request\render\DispatchRendererTest.java
A         tiles-request-api\src\test\resources
AU        tiles-request-api\pom.xml
A         tiles-request-mustache
A         tiles-request-mustache\src
A         tiles-request-mustache\src\test
A         tiles-request-mustache\src\test\resources
A         tiles-request-mustache\src\test\resources\test.html
A         tiles-request-mustache\src\test\java
A         tiles-request-mustache\src\test\java\org
A         tiles-request-mustache\src\test\java\org\apache
A         tiles-request-mustache\src\test\java\org\apache\tiles
A         tiles-request-mustache\src\test\java\org\apache\tiles\request
A         tiles-request-mustache\src\test\java\org\apache\tiles\request\mustache
A         tiles-request-mustache\src\test\java\org\apache\tiles\request\mustache\MustacheRendererTest.java
A         tiles-request-mustache\src\test\java\org\apache\tiles\request\render
A         tiles-request-mustache\src\main
A         tiles-request-mustache\src\main\java
A         tiles-request-mustache\src\main\java\org
A         tiles-request-mustache\src\main\java\org\apache
A         tiles-request-mustache\src\main\java\org\apache\tiles
A         tiles-request-mustache\src\main\java\org\apache\tiles\request
A         tiles-request-mustache\src\main\java\org\apache\tiles\request\mustache
A         tiles-request-mustache\src\main\java\org\apache\tiles\request\mustache\MustacheScopeExtractor.java
A         tiles-request-mustache\src\main\java\org\apache\tiles\request\mustache\MustacheRenderer.java
A         tiles-request-mustache\src\main\java\org\apache\tiles\request\mustache\package-info.java
A         tiles-request-mustache\src\site
A         tiles-request-mustache\src\site\site.xml
A         tiles-request-mustache\pom.xml
 U        .
At revision 1598221
Parsing POMs
Downloaded artifact http://repo.maven.apache.org/maven2/org/apache/tiles/tiles-master/6/tiles-master-6.pom
Discovered a new module org.apache.tiles:tiles-request Tiles Request Framework
Discovered a new module org.apache.tiles:tiles-request-api Tiles request - API
Discovered a new module org.apache.tiles:tiles-request-servlet Tiles request - Servlet support
Discovered a new module org.apache.tiles:tiles-request-servlet-wildcard Tiles Request - Wildcard
file loading in Servlets
Discovered a new module org.apache.tiles:tiles-request-portlet Tiles - Portlet support
Discovered a new module org.apache.tiles:tiles-request-portlet-wildcard Tiles - Wildcard file
loading in Portlets
Discovered a new module org.apache.tiles:tiles-request-jsp Tiles Request - JSP support
Discovered a new module org.apache.tiles:tiles-request-freemarker Tiles Request - Freemarker
support
Discovered a new module org.apache.tiles:tiles-request-velocity Tiles Request - Velocity support
Discovered a new module org.apache.tiles:tiles-request-mustache Tiles request - Mustache support
Discovered a new module org.apache.tiles:tiles-request-assembly Tiles Request Assembly
Modules changed, recalculating dependency graph
maven31-agent.jar already up to date
maven31-interceptor.jar already up to date
maven3-interceptor-commons.jar already up to date
[Tiles-Request-1.0.x (Java6)] $ f:\jenkins\tools\java\latest-1.6-64/bin/java -cp f:\jenkins\jenkins-slave\maven31-agent.jar;f:\jenkins\jenkins-slave\tools\hudson.tasks.Maven_MavenInstallation\maven-3.1.0\boot\plexus-classworlds-2.4.2.jar;f:\jenkins\jenkins-slave\tools\hudson.tasks.Maven_MavenInstallation\maven-3.1.0/conf/logging
jenkins.maven3.agent.Maven31Main f:\jenkins\jenkins-slave\tools\hudson.tasks.Maven_MavenInstallation\maven-3.1.0
F:\jenkins\jenkins-slave\slave.jar f:\jenkins\jenkins-slave\maven31-interceptor.jar f:\jenkins\jenkins-slave\maven3-interceptor-commons.jar
58038
<===[JENKINS REMOTING CAPACITY]===>   channel started
log4j:WARN No appenders could be found for logger (org.apache.commons.beanutils.converters.BooleanConverter).
log4j:WARN Please initialize the log4j system properly.
Executing Maven:  -B -f <https://builds.apache.org/job/Tiles-Request-1.0.x%20(Java6)/ws/pom.xml>
-Dmaven.repo.local=f:\jenkins\jenkins-slave\maven-repositories\0 clean install -Denforcer.skip=true
[INFO] Scanning for projects...
[INFO] Downloading: http://repo.maven.apache.org/maven2/org/apache/maven/scm/maven-scm-api/1.8.1/maven-scm-api-1.8.1.pom
[INFO] Downloaded: http://repo.maven.apache.org/maven2/org/apache/maven/scm/maven-scm-api/1.8.1/maven-scm-api-1.8.1.pom
(2 KB at 0.6 KB/sec)
[INFO] Downloading: http://repo.maven.apache.org/maven2/org/apache/maven/scm/maven-scm/1.8.1/maven-scm-1.8.1.pom
[INFO] Downloaded: http://repo.maven.apache.org/maven2/org/apache/maven/scm/maven-scm/1.8.1/maven-scm-1.8.1.pom
(22 KB at 216.5 KB/sec)
[INFO] Downloading: http://repo.maven.apache.org/maven2/org/apache/maven/scm/maven-scm-provider-gitexe/1.8.1/maven-scm-provider-gitexe-1.8.1.pom
[INFO] Downloaded: http://repo.maven.apache.org/maven2/org/apache/maven/scm/maven-scm-provider-gitexe/1.8.1/maven-scm-provider-gitexe-1.8.1.pom
(3 KB at 36.2 KB/sec)
[INFO] Downloading: http://repo.maven.apache.org/maven2/org/apache/maven/scm/maven-scm-providers-git/1.8.1/maven-scm-providers-git-1.8.1.pom
[INFO] Downloaded: http://repo.maven.apache.org/maven2/org/apache/maven/scm/maven-scm-providers-git/1.8.1/maven-scm-providers-git-1.8.1.pom
(3 KB at 31.8 KB/sec)
[INFO] Downloading: http://repo.maven.apache.org/maven2/org/apache/maven/scm/maven-scm-providers/1.8.1/maven-scm-providers-1.8.1.pom
[INFO] Downloaded: http://repo.maven.apache.org/maven2/org/apache/maven/scm/maven-scm-providers/1.8.1/maven-scm-providers-1.8.1.pom
(4 KB at 52.9 KB/sec)
[INFO] Downloading: http://repo.maven.apache.org/maven2/org/apache/maven/scm/maven-scm-provider-git-commons/1.8.1/maven-scm-provider-git-commons-1.8.1.pom
[INFO] Downloaded: http://repo.maven.apache.org/maven2/org/apache/maven/scm/maven-scm-provider-git-commons/1.8.1/maven-scm-provider-git-commons-1.8.1.pom
(3 KB at 33.0 KB/sec)
[INFO] Downloading: http://repo.maven.apache.org/maven2/org/apache/maven/scm/maven-scm-provider-svnexe/1.8.1/maven-scm-provider-svnexe-1.8.1.pom
[INFO] Downloaded: http://repo.maven.apache.org/maven2/org/apache/maven/scm/maven-scm-provider-svnexe/1.8.1/maven-scm-provider-svnexe-1.8.1.pom
(3 KB at 32.4 KB/sec)
[INFO] Downloading: http://repo.maven.apache.org/maven2/org/apache/maven/scm/maven-scm-providers-svn/1.8.1/maven-scm-providers-svn-1.8.1.pom
[INFO] Downloaded: http://repo.maven.apache.org/maven2/org/apache/maven/scm/maven-scm-providers-svn/1.8.1/maven-scm-providers-svn-1.8.1.pom
(3 KB at 30.5 KB/sec)
[INFO] Downloading: http://repo.maven.apache.org/maven2/org/apache/maven/scm/maven-scm-provider-svn-commons/1.8.1/maven-scm-provider-svn-commons-1.8.1.pom
[INFO] Downloaded: http://repo.maven.apache.org/maven2/org/apache/maven/scm/maven-scm-provider-svn-commons/1.8.1/maven-scm-provider-svn-commons-1.8.1.pom
(3 KB at 34.3 KB/sec)
[INFO] Downloading: http://repo.maven.apache.org/maven2/org/apache/maven/scm/maven-scm-api/1.8.1/maven-scm-api-1.8.1.jar
[INFO] Downloading: http://repo.maven.apache.org/maven2/org/apache/maven/scm/maven-scm-provider-svn-commons/1.8.1/maven-scm-provider-svn-commons-1.8.1.jar
[INFO] Downloading: http://repo.maven.apache.org/maven2/org/apache/maven/scm/maven-scm-provider-svnexe/1.8.1/maven-scm-provider-svnexe-1.8.1.jar
[INFO] Downloading: http://repo.maven.apache.org/maven2/org/apache/maven/scm/maven-scm-provider-git-commons/1.8.1/maven-scm-provider-git-commons-1.8.1.jar
[INFO] Downloading: http://repo.maven.apache.org/maven2/org/apache/maven/scm/maven-scm-provider-gitexe/1.8.1/maven-scm-provider-gitexe-1.8.1.jar
[INFO] Downloaded: http://repo.maven.apache.org/maven2/org/apache/maven/scm/maven-scm-provider-svn-commons/1.8.1/maven-scm-provider-svn-commons-1.8.1.jar
(40 KB at 198.5 KB/sec)
[INFO] Downloaded: http://repo.maven.apache.org/maven2/org/apache/maven/scm/maven-scm-api/1.8.1/maven-scm-api-1.8.1.jar
(103 KB at 466.0 KB/sec)
[INFO] Downloaded: http://repo.maven.apache.org/maven2/org/apache/maven/scm/maven-scm-provider-gitexe/1.8.1/maven-scm-provider-gitexe-1.8.1.jar
(63 KB at 298.2 KB/sec)
[INFO] Downloaded: http://repo.maven.apache.org/maven2/org/apache/maven/scm/maven-scm-provider-git-commons/1.8.1/maven-scm-provider-git-commons-1.8.1.jar
(37 KB at 134.3 KB/sec)
[INFO] Downloaded: http://repo.maven.apache.org/maven2/org/apache/maven/scm/maven-scm-provider-svnexe/1.8.1/maven-scm-provider-svnexe-1.8.1.jar
(76 KB at 162.3 KB/sec)
[INFO] Downloading: http://repo.maven.apache.org/maven2/org/apache/maven/wagon/wagon-ssh/2.5/wagon-ssh-2.5.pom
[INFO] Downloaded: http://repo.maven.apache.org/maven2/org/apache/maven/wagon/wagon-ssh/2.5/wagon-ssh-2.5.pom
(6 KB at 81.0 KB/sec)
[INFO] Downloading: http://repo.maven.apache.org/maven2/org/apache/maven/wagon/wagon-ssh-common/2.5/wagon-ssh-common-2.5.pom
[INFO] Downloaded: http://repo.maven.apache.org/maven2/org/apache/maven/wagon/wagon-ssh-common/2.5/wagon-ssh-common-2.5.pom
(2 KB at 24.9 KB/sec)
[INFO] Downloading: http://repo.maven.apache.org/maven2/org/apache/maven/wagon/wagon-ssh/2.5/wagon-ssh-2.5.jar
[INFO] Downloading: http://repo.maven.apache.org/maven2/org/apache/maven/wagon/wagon-ssh-common/2.5/wagon-ssh-common-2.5.jar
[INFO] Downloaded: http://repo.maven.apache.org/maven2/org/apache/maven/wagon/wagon-ssh/2.5/wagon-ssh-2.5.jar
(29 KB at 372.4 KB/sec)
[INFO] Downloaded: http://repo.maven.apache.org/maven2/org/apache/maven/wagon/wagon-ssh-common/2.5/wagon-ssh-common-2.5.jar
(25 KB at 255.7 KB/sec)
[INFO] ------------------------------------------------------------------------
[INFO] Reactor Build Order:
[INFO] 
[INFO] Tiles Request Framework
[INFO] Tiles request - API
[INFO] Tiles request - Servlet support
[INFO] Tiles Request - Wildcard file loading in Servlets
[INFO] Tiles - Portlet support
[INFO] Tiles - Wildcard file loading in Portlets
[INFO] Tiles Request - JSP support
[INFO] Tiles Request - Freemarker support
[INFO] Tiles Request - Velocity support
[INFO] Tiles request - Mustache support
[INFO] Tiles Request Assembly
[INFO]                                                                         
[INFO] ------------------------------------------------------------------------
[INFO] Building Tiles Request Framework 1.0.5-SNAPSHOT
[INFO] ------------------------------------------------------------------------
[INFO] Downloading: http://repo.maven.apache.org/maven2/org/slf4j/slf4j-simple/1.7.6/slf4j-simple-1.7.6.pom
[INFO] Downloaded: http://repo.maven.apache.org/maven2/org/slf4j/slf4j-simple/1.7.6/slf4j-simple-1.7.6.pom
(2 KB at 21.1 KB/sec)
[INFO] Downloading: http://repo.maven.apache.org/maven2/org/slf4j/slf4j-simple/1.7.6/slf4j-simple-1.7.6.jar
[INFO] Downloaded: http://repo.maven.apache.org/maven2/org/slf4j/slf4j-simple/1.7.6/slf4j-simple-1.7.6.jar
(11 KB at 147.0 KB/sec)
[INFO] 
[INFO] --- maven-clean-plugin:2.5:clean (default-clean) @ tiles-request ---
[INFO] 
[INFO] --- maven-enforcer-plugin:1.2:enforce (enforce-java) @ tiles-request ---
[INFO] Skipping Rule Enforcement.
[INFO] 
[INFO] --- maven-remote-resources-plugin:1.4:process (default) @ tiles-request ---
[INFO] 
[INFO] --- maven-bundle-plugin:2.3.7:manifest (bundle-manifest) @ tiles-request ---
[WARNING] Ignoring project type pom - supportedProjectTypes = [jar, bundle]
[INFO] 
[INFO] --- maven-site-plugin:3.3:attach-descriptor (attach-descriptor) @ tiles-request ---
[INFO] 
[INFO] --- maven-install-plugin:2.3.1:install (default-install) @ tiles-request ---
[INFO] Installing <https://builds.apache.org/job/Tiles-Request-1.0.x%20(Java6)/ws/pom.xml>
to f:\jenkins\jenkins-slave\maven-repositories\0\org\apache\tiles\tiles-request\1.0.5-SNAPSHOT\tiles-request-1.0.5-SNAPSHOT.pom
[INFO] Installing <https://builds.apache.org/job/Tiles-Request-1.0.x%20(Java6)/ws/target\tiles-request-1.0.5-SNAPSHOT-site.xml>
to f:\jenkins\jenkins-slave\maven-repositories\0\org\apache\tiles\tiles-request\1.0.5-SNAPSHOT\tiles-request-1.0.5-SNAPSHOT-site.xml
[INFO]                                                                         
[INFO] ------------------------------------------------------------------------
[INFO] Building Tiles request - API 1.0.5-SNAPSHOT
[INFO] ------------------------------------------------------------------------
[INFO] Downloading: http://repo.maven.apache.org/maven2/junit/junit/4.7/junit-4.7.pom
[INFO] Downloaded: http://repo.maven.apache.org/maven2/junit/junit/4.7/junit-4.7.pom (2 KB
at 6.5 KB/sec)
[INFO] Downloading: http://repo.maven.apache.org/maven2/org/easymock/easymockclassextension/3.0/easymockclassextension-3.0.pom
[INFO] Downloaded: http://repo.maven.apache.org/maven2/org/easymock/easymockclassextension/3.0/easymockclassextension-3.0.pom
(5 KB at 33.8 KB/sec)
[INFO] Downloading: http://repo.maven.apache.org/maven2/org/easymock/easymock-parent/3.0/easymock-parent-3.0.pom
[INFO] Downloaded: http://repo.maven.apache.org/maven2/org/easymock/easymock-parent/3.0/easymock-parent-3.0.pom
(11 KB at 152.1 KB/sec)
[INFO] Downloading: http://repo.maven.apache.org/maven2/org/easymock/easymock/3.0/easymock-3.0.pom
[INFO] Downloaded: http://repo.maven.apache.org/maven2/org/easymock/easymock/3.0/easymock-3.0.pom
(6 KB at 81.4 KB/sec)
[INFO] Downloading: http://repo.maven.apache.org/maven2/junit/junit/4.7/junit-4.7.jar
[INFO] Downloading: http://repo.maven.apache.org/maven2/org/easymock/easymock/3.0/easymock-3.0.jar
[INFO] Downloading: http://repo.maven.apache.org/maven2/org/easymock/easymockclassextension/3.0/easymockclassextension-3.0.jar
[INFO] Downloaded: http://repo.maven.apache.org/maven2/org/easymock/easymockclassextension/3.0/easymockclassextension-3.0.jar
(12 KB at 113.6 KB/sec)
[INFO] Downloaded: http://repo.maven.apache.org/maven2/org/easymock/easymock/3.0/easymock-3.0.jar
(112 KB at 554.5 KB/sec)
[INFO] Downloaded: http://repo.maven.apache.org/maven2/junit/junit/4.7/junit-4.7.jar (227
KB at 799.0 KB/sec)
[INFO] 
[INFO] --- maven-clean-plugin:2.5:clean (default-clean) @ tiles-request-api ---
[INFO] 
[INFO] --- maven-enforcer-plugin:1.2:enforce (enforce-java) @ tiles-request-api ---
[INFO] Skipping Rule Enforcement.
[INFO] 
[INFO] --- maven-remote-resources-plugin:1.4:process (default) @ tiles-request-api ---
[INFO] 
[INFO] --- maven-resources-plugin:2.6:resources (default-resources) @ tiles-request-api ---
[INFO] Using 'UTF-8' encoding to copy filtered resources.
[INFO] Copying 0 resource
[INFO] Copying 3 resources
[INFO] 
[INFO] --- maven-compiler-plugin:2.5.1:compile (default-compile) @ tiles-request-api ---
[INFO] Compiling 51 source files to F:\jenkins\jenkins-slave\workspace\Tiles-Request-1.0.x
(Java6)\tiles-request-api\target\classes
[INFO] -------------------------------------------------------------
[ERROR] COMPILATION ERROR : 
[INFO] -------------------------------------------------------------
[ERROR] F:\jenkins\jenkins-slave\workspace\Tiles-Request-1.0.x (Java6)\tiles-request-api\src\main\java\org\apache\tiles\request\locale\PostfixedApplicationResource.java:[25,16]
cannot find symbol
symbol  : class IllformedLocaleException
location: package java.util
[ERROR] F:\jenkins\jenkins-slave\workspace\Tiles-Request-1.0.x (Java6)\tiles-request-api\src\main\java\org\apache\tiles\request\locale\PostfixedApplicationResource.java:[204,14]
cannot find symbol
symbol  : class Builder
location: class java.util.Locale
[ERROR] F:\jenkins\jenkins-slave\workspace\Tiles-Request-1.0.x (Java6)\tiles-request-api\src\main\java\org\apache\tiles\request\locale\PostfixedApplicationResource.java:[204,43]
cannot find symbol
symbol  : class Builder
location: class java.util.Locale
[ERROR] F:\jenkins\jenkins-slave\workspace\Tiles-Request-1.0.x (Java6)\tiles-request-api\src\main\java\org\apache\tiles\request\locale\PostfixedApplicationResource.java:[219,17]
cannot find symbol
symbol  : class IllformedLocaleException
location: class org.apache.tiles.request.locale.PostfixedApplicationResource
[INFO] 4 errors 
[INFO] -------------------------------------------------------------
[INFO] ------------------------------------------------------------------------
[INFO] Reactor Summary:
[INFO] 
[INFO] Tiles Request Framework ........................... SUCCESS [21.492s]
[INFO] Tiles request - API ............................... FAILURE [8.934s]
[INFO] Tiles request - Servlet support ................... SKIPPED
[INFO] Tiles Request - Wildcard file loading in Servlets . SKIPPED
[INFO] Tiles - Portlet support ........................... SKIPPED
[INFO] Tiles - Wildcard file loading in Portlets ......... SKIPPED
[INFO] Tiles Request - JSP support ....................... SKIPPED
[INFO] Tiles Request - Freemarker support ................ SKIPPED
[INFO] Tiles Request - Velocity support .................. SKIPPED
[INFO] Tiles request - Mustache support .................. SKIPPED
[INFO] Tiles Request Assembly ............................ SKIPPED
[INFO] ------------------------------------------------------------------------
[INFO] BUILD FAILURE
[INFO] ------------------------------------------------------------------------
[INFO] Total time: 43.208s
[INFO] Finished at: Thu May 29 02:05:28 PDT 2014
[INFO] Final Memory: 21M/61M
[INFO] ------------------------------------------------------------------------
Waiting for Jenkins to finish collecting data
[ERROR] Failed to execute goal org.apache.maven.plugins:maven-compiler-plugin:2.5.1:compile
(default-compile) on project tiles-request-api: Compilation failure: Compilation failure:
[JENKINS] Archiving F:\jenkins\jenkins-slave\workspace\Tiles-Request-1.0.x (Java6)\tiles-request-freemarker\pom.xml
to org.apache.tiles/tiles-request-freemarker/1.0.5-SNAPSHOT/tiles-request-freemarker-1.0.5-SNAPSHOT.pom
[ERROR] F:\jenkins\jenkins-slave\workspace\Tiles-Request-1.0.x (Java6)\tiles-request-api\src\main\java\org\apache\tiles\request\locale\PostfixedApplicationResource.java:[25,16]
cannot find symbol
[ERROR] symbol  : class IllformedLocaleException
[ERROR] location: package java.util
[ERROR] F:\jenkins\jenkins-slave\workspace\Tiles-Request-1.0.x (Java6)\tiles-request-api\src\main\java\org\apache\tiles\request\locale\PostfixedApplicationResource.java:[204,14]
cannot find symbol
[ERROR] symbol  : class Builder
[ERROR] location: class java.util.Locale
[ERROR] F:\jenkins\jenkins-slave\workspace\Tiles-Request-1.0.x (Java6)\tiles-request-api\src\main\java\org\apache\tiles\request\locale\PostfixedApplicationResource.java:[204,43]
cannot find symbol
[ERROR] symbol  : class Builder
[ERROR] location: class java.util.Locale
[ERROR] F:\jenkins\jenkins-slave\workspace\Tiles-Request-1.0.x (Java6)\tiles-request-api\src\main\java\org\apache\tiles\request\locale\PostfixedApplicationResource.java:[219,17]
cannot find symbol
[ERROR] symbol  : class IllformedLocaleException
[ERROR] location: class org.apache.tiles.request.locale.PostfixedApplicationResource
[ERROR] -> [Help 1]
[ERROR] 
[ERROR] To see the full stack trace of the errors, re-run Maven with the -e switch.
[ERROR] Re-run Maven using the -X switch to enable full debug logging.
[ERROR] 
[ERROR] For more information about the errors and possible solutions, please read the following
articles:
[ERROR] [Help 1] http://cwiki.apache.org/confluence/display/MAVEN/MojoFailureException
[ERROR] 
[ERROR] After correcting the problems, you can resume the build with the command
[ERROR]   mvn <goals> -rf :tiles-request-api
[JENKINS] Archiving F:\jenkins\jenkins-slave\workspace\Tiles-Request-1.0.x (Java6)\tiles-request-mustache\pom.xml
to org.apache.tiles/tiles-request-mustache/1.0.5-SNAPSHOT/tiles-request-mustache-1.0.5-SNAPSHOT.pom
[JENKINS] Archiving F:\jenkins\jenkins-slave\workspace\Tiles-Request-1.0.x (Java6)\tiles-request-portlet\pom.xml
to org.apache.tiles/tiles-request-portlet/1.0.5-SNAPSHOT/tiles-request-portlet-1.0.5-SNAPSHOT.pom
[JENKINS] Archiving F:\jenkins\jenkins-slave\workspace\Tiles-Request-1.0.x (Java6)\tiles-request-api\pom.xml
to org.apache.tiles/tiles-request-api/1.0.5-SNAPSHOT/tiles-request-api-1.0.5-SNAPSHOT.pom
[JENKINS] Archiving F:\jenkins\jenkins-slave\workspace\Tiles-Request-1.0.x (Java6)\assembly\pom.xml
to org.apache.tiles/tiles-request-assembly/1.0.5-SNAPSHOT/tiles-request-assembly-1.0.5-SNAPSHOT.pom
[JENKINS] Archiving <https://builds.apache.org/job/Tiles-Request-1.0.x%20(Java6)/ws/pom.xml>
to org.apache.tiles/tiles-request/1.0.5-SNAPSHOT/tiles-request-1.0.5-SNAPSHOT.pom
[JENKINS] Archiving <https://builds.apache.org/job/Tiles-Request-1.0.x%20(Java6)/ws/target\tiles-request-1.0.5-SNAPSHOT-site.xml>
to org.apache.tiles/tiles-request/1.0.5-SNAPSHOT/tiles-request-1.0.5-SNAPSHOT-site.xml
[JENKINS] Archiving F:\jenkins\jenkins-slave\workspace\Tiles-Request-1.0.x (Java6)\tiles-request-velocity\pom.xml
to org.apache.tiles/tiles-request-velocity/1.0.5-SNAPSHOT/tiles-request-velocity-1.0.5-SNAPSHOT.pom
[JENKINS] Archiving F:\jenkins\jenkins-slave\workspace\Tiles-Request-1.0.x (Java6)\tiles-request-servlet-wildcard\pom.xml
to org.apache.tiles/tiles-request-servlet-wildcard/1.0.5-SNAPSHOT/tiles-request-servlet-wildcard-1.0.5-SNAPSHOT.pom
[JENKINS] Archiving F:\jenkins\jenkins-slave\workspace\Tiles-Request-1.0.x (Java6)\tiles-request-portlet-wildcard\pom.xml
to org.apache.tiles/tiles-request-portlet-wildcard/1.0.5-SNAPSHOT/tiles-request-portlet-wildcard-1.0.5-SNAPSHOT.pom
[JENKINS] Archiving F:\jenkins\jenkins-slave\workspace\Tiles-Request-1.0.x (Java6)\tiles-request-servlet\pom.xml
to org.apache.tiles/tiles-request-servlet/1.0.5-SNAPSHOT/tiles-request-servlet-1.0.5-SNAPSHOT.pom
[JENKINS] Archiving F:\jenkins\jenkins-slave\workspace\Tiles-Request-1.0.x (Java6)\tiles-request-jsp\pom.xml
to org.apache.tiles/tiles-request-jsp/1.0.5-SNAPSHOT/tiles-request-jsp-1.0.5-SNAPSHOT.pom
channel stopped

Mime
View raw message