thrift-dev mailing list archives

Site index · List index
Message view « Date » · « Thread »
Top « Date » · « Thread »
From "Balachandar Rajarathinam (Jira)" <j...@apache.org>
Subject [jira] [Commented] (THRIFT-5311) g++: error: /libboost_unit_test_framework.a: No such file or directory
Date Sun, 15 Nov 2020 19:09:00 GMT

    [ https://issues.apache.org/jira/browse/THRIFT-5311?page=com.atlassian.jira.plugin.system.issuetabpanels:comment-tabpanel&focusedCommentId=17232378#comment-17232378
] 

Balachandar Rajarathinam commented on THRIFT-5311:
--------------------------------------------------

Hi Zezeng Wang,
Thank you very much for your resolution views. For 1), its not reset-safe. I pass path during
"./configure --with-boost=/path/i/want". It looks like, static lib search needs to be documented.
2) I have tried it as well and it did not work. I tried "git clone" 2 times and build from
sources 2 times.
Thanks
Bala

> g++: error: /libboost_unit_test_framework.a: No such file or directory
> ----------------------------------------------------------------------
>
>                 Key: THRIFT-5311
>                 URL: https://issues.apache.org/jira/browse/THRIFT-5311
>             Project: Thrift
>          Issue Type: Bug
>          Components: C++ - Library
>    Affects Versions: 0.13.0
>         Environment:  
> ls /usr/lib/x86_64-linux-gnu/libboost_unit*
> /usr/lib/x86_64-linux-gnu/libboost_unit_test_framework.a /usr/lib/x86_64-linux-gnu/libboost_unit_test_framework.so.1.71.0
> /usr/lib/x86_64-linux-gnu/libboost_unit_test_framework.so
>  
> $ ./configure --without-java --without-mono --with-boost=/usr/lib
> ## --------- ##
> ## Platform. ##
> ## --------- ##
> hostname = VirtualBox
> uname -m = x86_64
> uname -r = 5.4.0-52-generic
> uname -s = Linux
> uname -v = #57-Ubuntu SMP Thu Oct 15 10:57:00 UTC 2020
> /usr/bin/uname -p = x86_64
> /bin/uname -X = unknown
>            Reporter: Balachandar Rajarathinam
>            Priority: Major
>
> libtool: link: g++ -std=c++11 -Wall -Wextra -pedantic -g -O2 -o .libs/processor_test
processor/ProcessorTest.o processor/EventLog.o processor/ServerThread.o ./.libs/libprocessortest.a
../../../lib/cpp/.libs/libthrift.so ../../../lib/cpp/.libs/libthriftnb.so /libboost_unit_test_framework.a
-levent -lrt -lpthread
> g++: error: /libboost_unit_test_framework.a: No such file or directory
> make[5]: *** [Makefile:1322: processor_test] Error 1



--
This message was sent by Atlassian Jira
(v8.3.4#803005)

Mime
View raw message