thrift-dev mailing list archives

Site index · List index
Message view « Date » · « Thread »
Top « Date » · « Thread »
From Apache Jenkins Server <jenk...@builds.apache.org>
Subject Build failed in Jenkins: Thrift #349
Date Tue, 06 Dec 2011 03:28:43 GMT
See <https://builds.apache.org/job/Thrift/349/changes>

Changes:

[jfarrell] Thrift-1445:minor C++ generator variable cleanup
Client: cpp
Patch: Dave Watson

In generate_process_function(), service_func_name is always used as a
string literal. Therefore, construct it with the double quotes
built-in, rather than having to add them everywhere we use it.

------------------------------------------
[...truncated 1829 lines...]
<TestingTime>0</TestingTime></TestCase><TestCase name="CoupledTTransports&lt;CoupledSocketTransports&gt;::test_borrow_part_available()"><TestingTime>0</TestingTime></TestCase><TestCase
name="CoupledTTransports&lt;CoupledSocketTransports&gt;::test_borrow_none_available()"><TestingTime>0</TestingTime></TestCase><TestCase
name="CoupledBufferedTransportsT&lt;CoupledSocketTransports&gt;::test_read_part_available()"><TestingTime>0</TestingTime></TestCase><TestCase
name="CoupledBufferedTransportsT&lt;CoupledSocketTransports&gt;::test_read_partial_midframe()"><TestingTime>0</TestingTime></TestCase><TestCase
name="CoupledBufferedTransportsT&lt;CoupledSocketTransports&gt;::test_read_none_available()">Timeout
alarm expired; attempting to unblock transport
<TestingTime>0</TestingTime></TestCase><TestCase name="CoupledBufferedTransportsT&lt;CoupledSocketTransports&gt;::test_borrow_part_available()"><TestingTime>0</TestingTime></TestCase><TestCase
name="CoupledBufferedTransportsT&lt;CoupledSocketTransports&gt;::test_borrow_none_available()"><TestingTime>0</TestingTime></TestCase><TestCase
name="CoupledFramedTransportsT&lt;CoupledSocketTransports&gt;::test_read_part_available()"><TestingTime>0</TestingTime></TestCase><TestCase
name="CoupledFramedTransportsT&lt;CoupledSocketTransports&gt;::test_read_partial_midframe()"><TestingTime>0</TestingTime></TestCase><TestCase
name="CoupledFramedTransportsT&lt;CoupledSocketTransports&gt;::test_read_none_available()">Timeout
alarm expired; attempting to unblock transport
<TestingTime>10000</TestingTime></TestCase><TestCase name="CoupledFramedTransportsT&lt;CoupledSocketTransports&gt;::test_borrow_part_available()"><TestingTime>0</TestingTime></TestCase><TestCase
name="CoupledFramedTransportsT&lt;CoupledSocketTransports&gt;::test_borrow_none_available()"><TestingTime>0</TestingTime></TestCase><TestCase
name="CoupledZlibTransportsT&lt;CoupledSocketTransports&gt;::test_read_part_available()"><TestingTime>0</TestingTime></TestCase><TestCase
name="CoupledZlibTransportsT&lt;CoupledSocketTransports&gt;::test_read_partial_midframe()"><TestingTime>0</TestingTime></TestCase><TestCase
name="CoupledZlibTransportsT&lt;CoupledSocketTransports&gt;::test_read_none_available()">Timeout
alarm expired; attempting to unblock transport
<TestingTime>0</TestingTime></TestCase><TestCase name="CoupledZlibTransportsT&lt;CoupledSocketTransports&gt;::test_borrow_part_available()"><TestingTime>0</TestingTime></TestCase><TestCase
name="CoupledZlibTransportsT&lt;CoupledSocketTransports&gt;::test_borrow_none_available()"><TestingTime>0</TestingTime></TestCase><TestCase
name="CoupledFileTransports::test_rw(1048576, 16777212, 0, 0, 0, 0)"><TestingTime>10000</TestingTime></TestCase><TestCase
name="CoupledTTransports&lt;CoupledFileTransports&gt;::test_rw(1048576, 16777212,
0, 0, 0, 0)"><TestingTime>10000</TestingTime></TestCase><TestCase
name="CoupledBufferedTransportsT&lt;CoupledFileTransports&gt;::test_rw(1048576, 16777212,
0, 0, 0, 0)"><TestingTime>20000</TestingTime></TestCase><TestCase
name="CoupledFramedTransportsT&lt;CoupledFileTransports&gt;::test_rw(1048576, 16777212,
0, 0, 0, 0)"><TestingTime>20000</TestingTime></TestCase><TestCase
name="CoupledZlibTransportsT&lt;CoupledFileTransports&gt;::test_rw(1048576, 16777212,
0, 0, 0, 0)"><TestingTime>20000</TestingTime></TestCase><TestCase
name="CoupledFileTransports::test_rw(131072, rand(1, 4096), rand(1, 4096), 0, 0, 0)"><TestingTime>0</TestingTime></TestCase><TestCase
name="CoupledTTransports&lt;CoupledFileTransports&gt;::test_rw(131072, rand(1, 4096),
rand(1, 4096), 0, 0, 0)"><TestingTime>0</TestingTime></TestCase><TestCase
name="CoupledBufferedTransportsT&lt;CoupledFileTransports&gt;::test_rw(131072, rand(1,
4096), rand(1, 4096), 0, 0, 0)"><TestingTime>10000</TestingTime></TestCase><TestCase
name="CoupledFramedTransportsT&lt;CoupledFileTransports&gt;::test_rw(131072, rand(1,
4096), rand(1, 4096), 0, 0, 0)"><TestingTime>0</TestingTime></TestCase><TestCase
name="CoupledZlibTransportsT&lt;CoupledFileTransports&gt;::test_rw(131072, rand(1,
4096), rand(1, 4096), 0, 0, 0)"><TestingTime>0</TestingTime></TestCase><TestCase
name="CoupledFileTransports::test_rw(131072, 167, 163, 0, 0, 0)"><TestingTime>10000</TestingTime></TestCase><TestCase
name="CoupledTTransports&lt;CoupledFileTransports&gt;::test_rw(131072, 167, 163, 0,
0, 0)"><TestingTime>0</TestingTime></TestCase><TestCase name="CoupledBufferedTransportsT&lt;CoupledFileTransports&gt;::test_rw(131072,
167, 163, 0, 0, 0)"><TestingTime>10000</TestingTime></TestCase><TestCase
name="CoupledFramedTransportsT&lt;CoupledFileTransports&gt;::test_rw(131072, 167,
163, 0, 0, 0)"><TestingTime>0</TestingTime></TestCase><TestCase name="CoupledZlibTransportsT&lt;CoupledFileTransports&gt;::test_rw(131072,
167, 163, 0, 0, 0)"><TestingTime>0</TestingTime></TestCase><TestCase
name="CoupledFileTransports::test_rw(2048, 1, 1, 0, 0, 0)"><TestingTime>10000</TestingTime></TestCase><TestCase
name="CoupledTTransports&lt;CoupledFileTransports&gt;::test_rw(2048, 1, 1, 0, 0, 0)"><TestingTime>10000</TestingTime></TestCase><TestCase
name="CoupledBufferedTransportsT&lt;CoupledFileTransports&gt;::test_rw(2048, 1, 1,
0, 0, 0)"><TestingTime>0</TestingTime></TestCase><TestCase name="CoupledFramedTransportsT&lt;CoupledFileTransports&gt;::test_rw(2048,
1, 1, 0, 0, 0)"><TestingTime>0</TestingTime></TestCase><TestCase name="CoupledZlibTransportsT&lt;CoupledFileTransports&gt;::test_rw(2048,
1, 1, 0, 0, 0)"><TestingTime>0</TestingTime></TestCase><TestCase name="CoupledFileTransports::test_rw(65536,
0, 0, rand(1, 4096), rand(1, 4096), 0)"><TestingTime>10000</TestingTime></TestCase><TestCase
name="CoupledTTransports&lt;CoupledFileTransports&gt;::test_rw(65536, 0, 0, rand(1,
4096), rand(1, 4096), 0)"><TestingTime>0</TestingTime></TestCase><TestCase
name="CoupledBufferedTransportsT&lt;CoupledFileTransports&gt;::test_rw(65536, 0, 0,
rand(1, 4096), rand(1, 4096), 0)"><TestingTime>0</TestingTime></TestCase><TestCase
name="CoupledFramedTransportsT&lt;CoupledFileTransports&gt;::test_rw(65536, 0, 0,
rand(1, 4096), rand(1, 4096), 0)"><TestingTime>10000</TestingTime></TestCase><TestCase
name="CoupledZlibTransportsT&lt;CoupledFileTransports&gt;::test_rw(65536, 0, 0, rand(1,
4096), rand(1, 4096), 0)"><TestingTime>0</TestingTime></TestCase><TestCase
name="CoupledFileTransports::test_rw(65536, rand(1, 4096), rand(1, 4096), rand(1, 4096), rand(1,
4096), 0)"><TestingTime>10000</TestingTime></TestCase><TestCase name="CoupledTTransports&lt;CoupledFileTransports&gt;::test_rw(65536,
rand(1, 4096), rand(1, 4096), rand(1, 4096), rand(1, 4096), 0)"><TestingTime>0</TestingTime></TestCase><TestCase
name="CoupledBufferedTransportsT&lt;CoupledFileTransports&gt;::test_rw(65536, rand(1,
4096), rand(1, 4096), rand(1, 4096), rand(1, 4096), 0)"><TestingTime>0</TestingTime></TestCase><TestCase
name="CoupledFramedTransportsT&lt;CoupledFileTransports&gt;::test_rw(65536, rand(1,
4096), rand(1, 4096), rand(1, 4096), rand(1, 4096), 0)"><TestingTime>10000</TestingTime></TestCase><TestCase
name="CoupledZlibTransportsT&lt;CoupledFileTransports&gt;::test_rw(65536, rand(1,
4096), rand(1, 4096), rand(1, 4096), rand(1, 4096), 0)"><TestingTime>0</TestingTime></TestCase><TestCase
name="CoupledFileTransports::test_rw(65536, 167, 163, rand(1, 4096), rand(1, 4096), 0)"><TestingTime>10000</TestingTime></TestCase><TestCase
name="CoupledTTransports&lt;CoupledFileTransports&gt;::test_rw(65536, 167, 163, rand(1,
4096), rand(1, 4096), 0)"><TestingTime>0</TestingTime></TestCase><TestCase
name="CoupledBufferedTransportsT&lt;CoupledFileTransports&gt;::test_rw(65536, 167,
163, rand(1, 4096), rand(1, 4096), 0)"><TestingTime>0</TestingTime></TestCase><TestCase
name="CoupledFramedTransportsT&lt;CoupledFileTransports&gt;::test_rw(65536, 167, 163,
rand(1, 4096), rand(1, 4096), 0)"><TestingTime>10000</TestingTime></TestCase><TestCase
name="CoupledZlibTransportsT&lt;CoupledFileTransports&gt;::test_rw(65536, 167, 163,
rand(1, 4096), rand(1, 4096), 0)"><TestingTime>0</TestingTime></TestCase><TestCase
name="CoupledFileTransports::test_rw(2048, 1, 1, rand(1, 4096), rand(1, 4096), 0)"><TestingTime>10000</TestingTime></TestCase><TestCase
name="CoupledTTransports&lt;CoupledFileTransports&gt;::test_rw(2048, 1, 1, rand(1,
4096), rand(1, 4096), 0)"><TestingTime>10000</TestingTime></TestCase><TestCase
name="CoupledBufferedTransportsT&lt;CoupledFileTransports&gt;::test_rw(2048, 1, 1,
rand(1, 4096), rand(1, 4096), 0)"><TestingTime>0</TestingTime></TestCase><TestCase
name="CoupledFramedTransportsT&lt;CoupledFileTransports&gt;::test_rw(2048, 1, 1, rand(1,
4096), rand(1, 4096), 0)"><TestingTime>0</TestingTime></TestCase><TestCase
name="CoupledZlibTransportsT&lt;CoupledFileTransports&gt;::test_rw(2048, 1, 1, rand(1,
4096), rand(1, 4096), 0)"><TestingTime>0</TestingTime></TestCase><TestCase
name="CoupledFileTransports::test_read_part_available()"><TestingTime>0</TestingTime></TestCase><TestCase
name="CoupledFileTransports::test_read_partial_midframe()"><TestingTime>0</TestingTime></TestCase><TestCase
name="CoupledFileTransports::test_read_none_available()"><TestingTime>0</TestingTime></TestCase><TestCase
name="CoupledFileTransports::test_borrow_part_available()"><TestingTime>10000</TestingTime></TestCase><TestCase
name="CoupledFileTransports::test_borrow_none_available()"><TestingTime>0</TestingTime></TestCase><TestCase
name="CoupledTTransports&lt;CoupledFileTransports&gt;::test_read_part_available()"><TestingTime>0</TestingTime></TestCase><TestCase
name="CoupledTTransports&lt;CoupledFileTransports&gt;::test_read_partial_midframe()"><TestingTime>0</TestingTime></TestCase><TestCase
name="CoupledTTransports&lt;CoupledFileTransports&gt;::test_read_none_available()"><TestingTime>0</TestingTime></TestCase><TestCase
name="CoupledTTransports&lt;CoupledFileTransports&gt;::test_borrow_part_available()"><TestingTime>0</TestingTime></TestCase><TestCase
name="CoupledTTransports&lt;CoupledFileTransports&gt;::test_borrow_none_available()"><TestingTime>0</TestingTime></TestCase><TestCase
name="CoupledBufferedTransportsT&lt;CoupledFileTransports&gt;::test_read_part_available()"><TestingTime>0</TestingTime></TestCase><TestCase
name="CoupledBufferedTransportsT&lt;CoupledFileTransports&gt;::test_read_partial_midframe()"><TestingTime>0</TestingTime></TestCase><TestCase
name="CoupledBufferedTransportsT&lt;CoupledFileTransports&gt;::test_read_none_available()"><TestingTime>0</TestingTime></TestCase><TestCase
name="CoupledBufferedTransportsT&lt;CoupledFileTransports&gt;::test_borrow_part_available()"><TestingTime>0</TestingTime></TestCase><TestCase
name="CoupledBufferedTransportsT&lt;CoupledFileTransports&gt;::test_borrow_none_available()"><TestingTime>0</TestingTime></TestCase><TestCase
name="CoupledFramedTransportsT&lt;CoupledFileTransports&gt;::test_read_part_available()"><TestingTime>0</TestingTime></TestCase><TestCase
name="CoupledFramedTransportsT&lt;CoupledFileTransports&gt;::test_read_partial_midframe()"><TestingTime>0</TestingTime></TestCase><TestCase
name="CoupledFramedTransportsT&lt;CoupledFileTransports&gt;::test_read_none_available()"><TestingTime>0</TestingTime></TestCase><TestCase
name="CoupledFramedTransportsT&lt;CoupledFileTransports&gt;::test_borrow_part_available()"><TestingTime>10000</TestingTime></TestCase><TestCase
name="CoupledFramedTransportsT&lt;CoupledFileTransports&gt;::test_borrow_none_available()"><TestingTime>0</TestingTime></TestCase><TestCase
name="CoupledZlibTransportsT&lt;CoupledFileTransports&gt;::test_read_part_available()"><TestingTime>0</TestingTime></TestCase><TestCase
name="CoupledZlibTransportsT&lt;CoupledFileTransports&gt;::test_read_partial_midframe()"><TestingTime>0</TestingTime></TestCase><TestCase
name="CoupledZlibTransportsT&lt;CoupledFileTransports&gt;::test_read_none_available()"><TestingTime>0</TestingTime></TestCase><TestCase
name="CoupledZlibTransportsT&lt;CoupledFileTransports&gt;::test_borrow_part_available()"><TestingTime>0</TestingTime></TestCase><TestCase
name="CoupledZlibTransportsT&lt;CoupledFileTransports&gt;::test_borrow_none_available()"><TestingTime>0</TestingTime></TestCase><TestCase
name="CoupledTTransports&lt;CoupledBufferedTransports&gt;::test_rw(1048576, rand(1,
4096), rand(1, 4096), rand(1, 4096), rand(1, 4096), 0)"><TestingTime>10000</TestingTime></TestCase><TestCase
name="CoupledBufferBases&lt;CoupledBufferedTransports&gt;::test_rw(1048576, rand(1,
4096), rand(1, 4096), rand(1, 4096), rand(1, 4096), 0)"><TestingTime>0</TestingTime></TestCase><TestCase
name="CoupledTTransports&lt;CoupledFramedTransports&gt;::test_rw(1048576, rand(1,
4096), rand(1, 4096), rand(1, 4096), rand(1, 4096), 0)"><TestingTime>10000</TestingTime></TestCase><TestCase
name="CoupledBufferBases&lt;CoupledFramedTransports&gt;::test_rw(1048576, rand(1,
4096), rand(1, 4096), rand(1, 4096), rand(1, 4096), 0)"><TestingTime>10000</TestingTime></TestCase><TestCase
name="CoupledTTransports&lt;CoupledZlibTransports&gt;::test_rw(1048576, rand(1, 4096),
rand(1, 4096), rand(1, 4096), rand(1, 4096), 0)"><TestingTime>20000</TestingTime></TestCase></TestSuite></TestLog>
*** No errors detected
PASS: TransportTest
seed: 1323141590
<TestLog><TestSuite name="ZlibTest"><TestCase name="uniform-test_write_then_read"><TestingTime>0</TestingTime></TestCase><TestCase
name="uniform-test_separate_checksum"><TestingTime>0</TestingTime></TestCase><TestCase
name="uniform-test_incomplete_checksum"><TestingTime>0</TestingTime></TestCase><TestCase
name="uniform-test_invalid_checksum"><TestingTime>0</TestingTime></TestCase><TestCase
name="uniform-test_write_after_flush"><TestingTime>0</TestingTime></TestCase><TestCase
name="uniform-constant-test_read_write_mix"><TestingTime>0</TestingTime></TestCase><TestCase
name="uniform-lognormal-write-test_read_write_mix"><TestingTime>0</TestingTime></TestCase><TestCase
name="uniform-lognormal-read-test_read_write_mix"><TestingTime>0</TestingTime></TestCase><TestCase
name="uniform-lognormal-both-test_read_write_mix"><TestingTime>0</TestingTime></TestCase><TestCase
name="uniform-lognormal-same-distribution-test_read_write_mix"><TestingTime>0</TestingTime></TestCase><TestCase
name="compressible-test_write_then_read"><TestingTime>10000</TestingTime></TestCase><TestCase
name="compressible-test_separate_checksum"><TestingTime>0</TestingTime></TestCase><TestCase
name="compressible-test_incomplete_checksum"><TestingTime>0</TestingTime></TestCase><TestCase
name="compressible-test_invalid_checksum"><TestingTime>0</TestingTime></TestCase><TestCase
name="compressible-test_write_after_flush"><TestingTime>0</TestingTime></TestCase><TestCase
name="compressible-constant-test_read_write_mix"><TestingTime>0</TestingTime></TestCase><TestCase
name="compressible-lognormal-write-test_read_write_mix"><TestingTime>0</TestingTime></TestCase><TestCase
name="compressible-lognormal-read-test_read_write_mix"><TestingTime>10000</TestingTime></TestCase><TestCase
name="compressible-lognormal-both-test_read_write_mix"><TestingTime>0</TestingTime></TestCase><TestCase
name="compressible-lognormal-same-distribution-test_read_write_mix"><TestingTime>0</TestingTime></TestCase><TestCase
name="random-test_write_then_read"><TestingTime>0</TestingTime></TestCase><TestCase
name="random-test_separate_checksum"><TestingTime>10000</TestingTime></TestCase><TestCase
name="random-test_incomplete_checksum"><TestingTime>0</TestingTime></TestCase><TestCase
name="random-test_invalid_checksum"><TestingTime>0</TestingTime></TestCase><TestCase
name="random-test_write_after_flush"><TestingTime>0</TestingTime></TestCase><TestCase
name="random-constant-test_read_write_mix"><TestingTime>0</TestingTime></TestCase><TestCase
name="random-lognormal-write-test_read_write_mix"><TestingTime>10000</TestingTime></TestCase><TestCase
name="random-lognormal-read-test_read_write_mix"><TestingTime>0</TestingTime></TestCase><TestCase
name="random-lognormal-both-test_read_write_mix"><TestingTime>0</TestingTime></TestCase><TestCase
name="random-lognormal-same-distribution-test_read_write_mix"><TestingTime>10000</TestingTime></TestCase><TestCase
name="test_no_write"><TestingTime>0</TestingTime></TestCase></TestSuite></TestLog>
*** No errors detected
PASS: ZlibTest
<TestLog><TestSuite name="TFileTransportTest"><TestCase name="test_destructor"><TestingTime>90000</TestingTime></TestCase><TestCase
name="test_flush_max_us1"><TestingTime>0</TestingTime></TestCase><TestCase
name="test_flush_max_us2"><TestingTime>0</TestingTime></TestCase><TestCase
name="test_flush_max_us3"><TestingTime>10000</TestingTime></TestCase><TestCase
name="test_noop_flush"><TestingTime>0</TestingTime></TestCase></TestSuite></TestLog>
*** No errors detected
PASS: TFileTransportTest
<TestLog><TestSuite name="thrift"><TestSuite name="TBufferBaseTest"><TestCase
name="test_MemoryBuffer_Write_GetBuffer"><TestingTime>0</TestingTime></TestCase><TestCase
name="test_MemoryBuffer_Write_Read"><TestingTime>0</TestingTime></TestCase><TestCase
name="test_MemoryBuffer_Write_ReadString"><TestingTime>10000</TestingTime></TestCase><TestCase
name="test_MemoryBuffer_Write_Read_Multi1"><TestingTime>0</TestingTime></TestCase><TestCase
name="test_MemoryBuffer_Write_Read_Multi2"><TestingTime>10000</TestingTime></TestCase><TestCase
name="test_MemoryBuffer_Write_Read_Incomplete"><TestingTime>0</TestingTime></TestCase><TestCase
name="test_BufferedTransport_Write"><TestingTime>10000</TestingTime></TestCase><TestCase
name="test_BufferedTransport_Read_Full"><TestingTime>0</TestingTime></TestCase><TestCase
name="test_BufferedTransport_Read_Short"><TestingTime>10000</TestingTime></TestCase><TestCase
name="test_FramedTransport_Write"><TestingTime>0</TestingTime></TestCase><TestCase
name="test_FramedTransport_Read"><TestingTime>0</TestingTime></TestCase><TestCase
name="test_FramedTransport_Write_Read"><TestingTime>70000</TestingTime></TestCase><TestCase
name="test_FramedTransport_Empty_Flush"><TestingTime>0</TestingTime></TestCase></TestSuite><TestSuite
name="TMemoryBufferTest"><TestCase name="test_roundtrip"><Message file="./boost/test/impl/results_collector.ipp"
line="220">Test case test_roundtrip did not run any assertions</Message><TestingTime>0</TestingTime></TestCase><TestCase
name="test_copy">Object reuse: 1   Data reuse: 1   YAY!
<Message file="./boost/test/impl/results_collector.ipp" line="220">Test case test_copy
did not run any assertions</Message><TestingTime>0</TestingTime></TestCase><TestCase
name="test_exceptions"><Message file="./boost/test/impl/results_collector.ipp" line="220">Test
case test_exceptions did not run any assertions</Message><TestingTime>0</TestingTime></TestCase></TestSuite></TestSuite></TestLog>
*** No errors detected
PASS: UnitTests
===================
All 11 tests passed
===================
make[4]: Leaving directory `<https://builds.apache.org/job/Thrift/ws/thrift/lib/cpp/test'>
make[3]: Leaving directory `<https://builds.apache.org/job/Thrift/ws/thrift/lib/cpp/test'>
make[2]: Leaving directory `<https://builds.apache.org/job/Thrift/ws/thrift/lib/cpp'>
Making check in csharp
make[2]: Entering directory `<https://builds.apache.org/job/Thrift/ws/thrift/lib/csharp'>
make[2]: Nothing to be done for `check'.
make[2]: Leaving directory `<https://builds.apache.org/job/Thrift/ws/thrift/lib/csharp'>
Making check in java
make[2]: Entering directory `<https://builds.apache.org/job/Thrift/ws/thrift/lib/java'>
/usr/bin/ant -Dtest.junit.output.format=xml
Buildfile: <https://builds.apache.org/job/Thrift/ws/thrift/lib/java/build.xml>

setup.init:

mvn.ant.tasks.check:

proxy:

mvn.ant.tasks.download:
      [get] Getting: http://repo1.maven.org/maven2/org/apache/maven/maven-ant-tasks/2.1.3/maven-ant-tasks-2.1.3.jar
      [get] To: <https://builds.apache.org/job/Thrift/ws/thrift/lib/java/build/tools/maven-ant-tasks-2.1.3.jar>
      [get] Not modified - so not downloaded

mvn.init:
[artifact:dependencies] [WARNING] Overriding profile: 'maven-ant-tasks-repo-profile' (source:
pom) with new instance from source: pom

init:

compile:

dist:

BUILD SUCCESSFUL
Total time: 1 second
make  check-local
make[3]: Entering directory `<https://builds.apache.org/job/Thrift/ws/thrift/lib/java'>
/usr/bin/ant -Dtest.junit.output.format=xml
Buildfile: <https://builds.apache.org/job/Thrift/ws/thrift/lib/java/build.xml>

setup.init:

mvn.ant.tasks.check:

proxy:

mvn.ant.tasks.download:
      [get] Getting: http://repo1.maven.org/maven2/org/apache/maven/maven-ant-tasks/2.1.3/maven-ant-tasks-2.1.3.jar
      [get] To: <https://builds.apache.org/job/Thrift/ws/thrift/lib/java/build/tools/maven-ant-tasks-2.1.3.jar>
      [get] Not modified - so not downloaded

mvn.init:
[artifact:dependencies] [WARNING] Overriding profile: 'maven-ant-tasks-repo-profile' (source:
pom) with new instance from source: pom

init:

compile:

dist:

BUILD SUCCESSFUL
Total time: 1 second
/usr/bin/ant -Dtest.junit.output.format=xml test
Buildfile: <https://builds.apache.org/job/Thrift/ws/thrift/lib/java/build.xml>

generate:
     [exec] [WARNING:<https://builds.apache.org/job/Thrift/ws/thrift/test/DebugProtoTest.thrift>:41]
64-bit constant "10000000000" may not work in all languages.
     [exec] 
     [exec] [WARNING:<https://builds.apache.org/job/Thrift/ws/thrift/test/DebugProtoTest.thrift>:173]
64-bit constant "1099511627775" may not work in all languages.
     [exec] 
     [exec] [WARNING:<https://builds.apache.org/job/Thrift/ws/thrift/test/DebugProtoTest.thrift>:183]
64-bit constant "4294967295" may not work in all languages.
     [exec] 
     [exec] [WARNING:<https://builds.apache.org/job/Thrift/ws/thrift/test/DebugProtoTest.thrift>:183]
64-bit constant "1099511627775" may not work in all languages.
     [exec] 
     [exec] [WARNING:<https://builds.apache.org/job/Thrift/ws/thrift/test/DebugProtoTest.thrift>:183]
64-bit constant "281474976710655" may not work in all languages.
     [exec] 
     [exec] [WARNING:<https://builds.apache.org/job/Thrift/ws/thrift/test/DebugProtoTest.thrift>:183]
64-bit constant "72057594037927935" may not work in all languages.
     [exec] 
     [exec] [WARNING:<https://builds.apache.org/job/Thrift/ws/thrift/test/DebugProtoTest.thrift>:183]
64-bit constant "9223372036854775807" may not work in all languages.
     [exec] 
     [exec] [WARNING:<https://builds.apache.org/job/Thrift/ws/thrift/test/DebugProtoTest.thrift>:192]
64-bit constant "4294967295" may not work in all languages.
     [exec] 
     [exec] [WARNING:<https://builds.apache.org/job/Thrift/ws/thrift/test/DebugProtoTest.thrift>:192]
64-bit constant "1099511627775" may not work in all languages.
     [exec] 
     [exec] [WARNING:<https://builds.apache.org/job/Thrift/ws/thrift/test/DebugProtoTest.thrift>:192]
64-bit constant "281474976710655" may not work in all languages.
     [exec] 
     [exec] [WARNING:<https://builds.apache.org/job/Thrift/ws/thrift/test/DebugProtoTest.thrift>:192]
64-bit constant "72057594037927935" may not work in all languages.
     [exec] 
     [exec] [WARNING:<https://builds.apache.org/job/Thrift/ws/thrift/test/DebugProtoTest.thrift>:192]
64-bit constant "9223372036854775807" may not work in all languages.
     [exec] 
     [exec] [WARNING:<https://builds.apache.org/job/Thrift/ws/thrift/test/DebugProtoTest.thrift>:201]
64-bit constant "9223372036854775807" may not work in all languages.
     [exec] 
     [exec] [WARNING:<https://builds.apache.org/job/Thrift/ws/thrift/test/DebugProtoTest.thrift>:208]
64-bit constant "9223372036854775807" may not work in all languages.
     [exec] 
     [exec] [WARNING:<https://builds.apache.org/job/Thrift/ws/thrift/test/DebugProtoTest.thrift>:355]
No field key specified for field1, resulting protocol may have conflicts or not be backwards
compatible!
     [exec] 
     [exec] [WARNING:<https://builds.apache.org/job/Thrift/ws/thrift/test/DebugProtoTest.thrift>:356]
No field key specified for field2, resulting protocol may have conflicts or not be backwards
compatible!
     [exec] 
     [exec] [WARNING:<https://builds.apache.org/job/Thrift/ws/thrift/test/DebugProtoTest.thrift>:357]
No field key specified for field3, resulting protocol may have conflicts or not be backwards
compatible!
     [exec] 
     [exec] [WARNING:<https://builds.apache.org/job/Thrift/ws/thrift/test/DebugProtoTest.thrift>:358]
No field key specified for field4, resulting protocol may have conflicts or not be backwards
compatible!
     [exec] 
     [exec] [WARNING:<https://builds.apache.org/job/Thrift/ws/thrift/test/DebugProtoTest.thrift>:359]
No field key specified for field5, resulting protocol may have conflicts or not be backwards
compatible!
     [exec] 
     [exec] [WARNING:<https://builds.apache.org/job/Thrift/ws/thrift/test/DebugProtoTest.thrift>:360]
No field key specified for field6, resulting protocol may have conflicts or not be backwards
compatible!
     [exec] 
     [exec] [WARNING:<https://builds.apache.org/job/Thrift/ws/thrift/test/DebugProtoTest.thrift>:361]
No field key specified for field7, resulting protocol may have conflicts or not be backwards
compatible!
     [exec] 
     [exec] [WARNING:<https://builds.apache.org/job/Thrift/ws/thrift/test/DebugProtoTest.thrift>:362]
No field key specified for field8, resulting protocol may have conflicts or not be backwards
compatible!
     [exec] 
     [exec] [WARNING:<https://builds.apache.org/job/Thrift/ws/thrift/test/DebugProtoTest.thrift>:363]
No field key specified for field9, resulting protocol may have conflicts or not be backwards
compatible!
     [exec] 
     [exec] [WARNING:<https://builds.apache.org/job/Thrift/ws/thrift/test/DebugProtoTest.thrift>:364]
No field key specified for field10, resulting protocol may have conflicts or not be backwards
compatible!
     [exec] 
     [exec] [WARNING:<https://builds.apache.org/job/Thrift/ws/thrift/test/DebugProtoTest.thrift>:365]
No field key specified for field11, resulting protocol may have conflicts or not be backwards
compatible!
     [exec] 
     [exec] [WARNING:<https://builds.apache.org/job/Thrift/ws/thrift/test/DebugProtoTest.thrift>:366]
No field key specified for field12, resulting protocol may have conflicts or not be backwards
compatible!
     [exec] 
     [exec] [WARNING:<https://builds.apache.org/job/Thrift/ws/thrift/test/DebugProtoTest.thrift>:41]
64-bit constant "10000000000" may not work in all languages.
     [exec] 
     [exec] [WARNING:<https://builds.apache.org/job/Thrift/ws/thrift/test/DebugProtoTest.thrift>:173]
64-bit constant "1099511627775" may not work in all languages.
     [exec] 
     [exec] [WARNING:<https://builds.apache.org/job/Thrift/ws/thrift/test/DebugProtoTest.thrift>:183]
64-bit constant "4294967295" may not work in all languages.
     [exec] 
     [exec] [WARNING:<https://builds.apache.org/job/Thrift/ws/thrift/test/DebugProtoTest.thrift>:183]
64-bit constant "1099511627775" may not work in all languages.
     [exec] 
     [exec] [WARNING:<https://builds.apache.org/job/Thrift/ws/thrift/test/DebugProtoTest.thrift>:183]
64-bit constant "281474976710655" may not work in all languages.
     [exec] 
     [exec] [WARNING:<https://builds.apache.org/job/Thrift/ws/thrift/test/DebugProtoTest.thrift>:183]
64-bit constant "72057594037927935" may not work in all languages.
     [exec] 
     [exec] [WARNING:<https://builds.apache.org/job/Thrift/ws/thrift/test/DebugProtoTest.thrift>:183]
64-bit constant "9223372036854775807" may not work in all languages.
     [exec] 
     [exec] [WARNING:<https://builds.apache.org/job/Thrift/ws/thrift/test/DebugProtoTest.thrift>:192]
64-bit constant "4294967295" may not work in all languages.
     [exec] 
     [exec] [WARNING:<https://builds.apache.org/job/Thrift/ws/thrift/test/DebugProtoTest.thrift>:192]
64-bit constant "1099511627775" may not work in all languages.
     [exec] 
     [exec] [WARNING:<https://builds.apache.org/job/Thrift/ws/thrift/test/DebugProtoTest.thrift>:192]
64-bit constant "281474976710655" may not work in all languages.
     [exec] 
     [exec] [WARNING:<https://builds.apache.org/job/Thrift/ws/thrift/test/DebugProtoTest.thrift>:192]
64-bit constant "72057594037927935" may not work in all languages.
     [exec] 
     [exec] [WARNING:<https://builds.apache.org/job/Thrift/ws/thrift/test/DebugProtoTest.thrift>:192]
64-bit constant "9223372036854775807" may not work in all languages.
     [exec] 
     [exec] [WARNING:<https://builds.apache.org/job/Thrift/ws/thrift/test/DebugProtoTest.thrift>:201]
64-bit constant "9223372036854775807" may not work in all languages.
     [exec] 
     [exec] [WARNING:<https://builds.apache.org/job/Thrift/ws/thrift/test/DebugProtoTest.thrift>:208]
64-bit constant "9223372036854775807" may not work in all languages.
     [exec] 
     [exec] [WARNING:<https://builds.apache.org/job/Thrift/ws/thrift/test/DebugProtoTest.thrift>:355]
No field key specified for field1, resulting protocol may have conflicts or not be backwards
compatible!
     [exec] 
     [exec] [WARNING:<https://builds.apache.org/job/Thrift/ws/thrift/test/DebugProtoTest.thrift>:356]
No field key specified for field2, resulting protocol may have conflicts or not be backwards
compatible!
     [exec] 
     [exec] [WARNING:<https://builds.apache.org/job/Thrift/ws/thrift/test/DebugProtoTest.thrift>:357]
No field key specified for field3, resulting protocol may have conflicts or not be backwards
compatible!
     [exec] 
     [exec] [WARNING:<https://builds.apache.org/job/Thrift/ws/thrift/test/DebugProtoTest.thrift>:358]
No field key specified for field4, resulting protocol may have conflicts or not be backwards
compatible!
     [exec] 
     [exec] [WARNING:<https://builds.apache.org/job/Thrift/ws/thrift/test/DebugProtoTest.thrift>:359]
No field key specified for field5, resulting protocol may have conflicts or not be backwards
compatible!
     [exec] 
     [exec] [WARNING:<https://builds.apache.org/job/Thrift/ws/thrift/test/DebugProtoTest.thrift>:360]
No field key specified for field6, resulting protocol may have conflicts or not be backwards
compatible!
     [exec] 
     [exec] [WARNING:<https://builds.apache.org/job/Thrift/ws/thrift/test/DebugProtoTest.thrift>:361]
No field key specified for field7, resulting protocol may have conflicts or not be backwards
compatible!
     [exec] 
     [exec] [WARNING:<https://builds.apache.org/job/Thrift/ws/thrift/test/DebugProtoTest.thrift>:362]
No field key specified for field8, resulting protocol may have conflicts or not be backwards
compatible!
     [exec] 
     [exec] [WARNING:<https://builds.apache.org/job/Thrift/ws/thrift/test/DebugProtoTest.thrift>:363]
No field key specified for field9, resulting protocol may have conflicts or not be backwards
compatible!
     [exec] 
     [exec] [WARNING:<https://builds.apache.org/job/Thrift/ws/thrift/test/DebugProtoTest.thrift>:364]
No field key specified for field10, resulting protocol may have conflicts or not be backwards
compatible!
     [exec] 
     [exec] [WARNING:<https://builds.apache.org/job/Thrift/ws/thrift/test/DebugProtoTest.thrift>:365]
No field key specified for field11, resulting protocol may have conflicts or not be backwards
compatible!
     [exec] 
     [exec] [WARNING:<https://builds.apache.org/job/Thrift/ws/thrift/test/DebugProtoTest.thrift>:366]
No field key specified for field12, resulting protocol may have conflicts or not be backwards
compatible!
     [exec] 
     [exec] [WARNING:<https://builds.apache.org/job/Thrift/ws/thrift/test/JavaBeansTest.thrift>:38]
No field key specified for blah, resulting protocol may have conflicts or not be backwards
compatible!
     [exec] 
     [exec] [WARNING:<https://builds.apache.org/job/Thrift/ws/thrift/test/JavaBeansTest.thrift>:38]
No field key specified for blah, resulting protocol may have conflicts or not be backwards
compatible!
     [exec] 

setup.init:

mvn.ant.tasks.check:

proxy:

mvn.ant.tasks.download:
      [get] Getting: http://repo1.maven.org/maven2/org/apache/maven/maven-ant-tasks/2.1.3/maven-ant-tasks-2.1.3.jar
      [get] To: <https://builds.apache.org/job/Thrift/ws/thrift/lib/java/build/tools/maven-ant-tasks-2.1.3.jar>
      [get] Not modified - so not downloaded

mvn.init:
[artifact:dependencies] [WARNING] Overriding profile: 'maven-ant-tasks-repo-profile' (source:
pom) with new instance from source: pom

init:

compile:

dist:

compile-test:
    [javac] Compiling 66 source files to <https://builds.apache.org/job/Thrift/ws/thrift/lib/java/build/test>
    [javac] Note: Some input files use unchecked or unsafe operations.
    [javac] Note: Recompile with -Xlint:unchecked for details.
    [javac] Compiling 2 source files to <https://builds.apache.org/job/Thrift/ws/thrift/lib/java/build/test>
    [javac] Note: Some input files use unchecked or unsafe operations.
    [javac] Note: Recompile with -Xlint:unchecked for details.
    [javac] Compiling 40 source files to <https://builds.apache.org/job/Thrift/ws/thrift/lib/java/build/test>
    [javac] <https://builds.apache.org/job/Thrift/ws/thrift/lib/java/test/org/apache/thrift/Fixtures.java>:332:
cannot find symbol
    [javac] symbol  : class Constants
    [javac] location: package thrift.test
    [javac]           thrift.test.Constants.COMPACT_TEST);
    [javac]                      ^
    [javac] Note: Some input files use unchecked or unsafe operations.
    [javac] Note: Recompile with -Xlint:unchecked for details.
    [javac] 1 error

BUILD FAILED
<https://builds.apache.org/job/Thrift/ws/thrift/lib/java/build.xml>:165: Compile failed;
see the compiler error output for details.

Total time: 9 seconds
make[3]: *** [check-local] Error 1
make[3]: Leaving directory `<https://builds.apache.org/job/Thrift/ws/thrift/lib/java'>
make[2]: *** [check-am] Error 2
make[2]: Leaving directory `<https://builds.apache.org/job/Thrift/ws/thrift/lib/java'>
make[1]: *** [check-recursive] Error 1
make[1]: Leaving directory `<https://builds.apache.org/job/Thrift/ws/thrift/lib'>
make: *** [check-recursive] Error 1
Build step 'Execute shell' marked build as failure
[WARNINGS] Skipping publisher since build result is FAILURE
[TASKS] Skipping publisher since build result is FAILURE
Archiving artifacts
Recording test results
Publishing Javadoc
Updating THRIFT-1445


Mime
View raw message