tez-issues mailing list archives

Site index · List index
Message view « Date » · « Thread »
Top « Date » · « Thread »
From Apache Jenkins Server <jenk...@builds.apache.org>
Subject Failed: TEZ-3363 PreCommit Build #2629
Date Wed, 13 Sep 2017 17:01:00 GMT
Jira: https://issues.apache.org/jira/browse/TEZ-3363
Build: https://builds.apache.org/job/PreCommit-TEZ-Build/2629/

###################################################################################
########################## LAST 60 LINES OF THE CONSOLE ###########################
[...truncated 336.98 KB...]
[ERROR] [Help 1] http://cwiki.apache.org/confluence/display/MAVEN/MojoFailureException
[ERROR] [Help 2] http://cwiki.apache.org/confluence/display/MAVEN/MojoExecutionException
[ERROR] 
[ERROR] After correcting the problems, you can resume the build with the command
[ERROR]   mvn <goals> -rf :tez-tests
[INFO] Build failures were ignored.




{color:red}-1 overall{color}.  Here are the results of testing the latest attachment
  http://issues.apache.org/jira/secure/attachment/12886888/TEZ-3363.002.patch
  against master revision 7e895f5.

    {color:green}+1 @author{color}.  The patch does not contain any @author tags.

    {color:green}+1 tests included{color}.  The patch appears to include 3 new or modified
test files.

    {color:green}+1 javac{color}.  The applied patch does not increase the total number of
javac compiler warnings.

    {color:green}+1 javadoc{color}.  There were no new javadoc warning messages.

    {color:green}+1 findbugs{color}.  The patch does not introduce any new Findbugs (version
3.0.1) warnings.

    {color:green}+1 release audit{color}.  The applied patch does not increase the total number
of release audit warnings.

    {color:red}-1 core tests{color}.  The patch failed these unit tests in :
                   org.apache.tez.mapreduce.TestMRRJobsDAGApi

Test results: https://builds.apache.org/job/PreCommit-TEZ-Build/2629//testReport/
Console output: https://builds.apache.org/job/PreCommit-TEZ-Build/2629//console

This message is automatically generated.


======================================================================
======================================================================
    Adding comment to Jira.
======================================================================
======================================================================


Comment added.
31219c14aee963567d5ae2659ce3d1c72ed35d48 logged out


======================================================================
======================================================================
    Finished build.
======================================================================
======================================================================


Build step 'Execute shell' marked build as failure
Archiving artifacts
[description-setter] Could not determine description.
Recording test results
Email was triggered for: Failure - Any
Sending email for trigger: Failure - Any



###################################################################################
############################## FAILED TESTS (if any) ##############################
6 tests failed.
FAILED:  org.apache.tez.mapreduce.TestMRRJobsDAGApi.testMultipleMRRSleepJobViaSession

Error Message:
expected:<READY> but was:<RUNNING>

Stack Trace:
java.lang.AssertionError: expected:<READY> but was:<RUNNING>
	at org.junit.Assert.fail(Assert.java:88)
	at org.junit.Assert.failNotEquals(Assert.java:743)
	at org.junit.Assert.assertEquals(Assert.java:118)
	at org.junit.Assert.assertEquals(Assert.java:144)
	at org.apache.tez.mapreduce.TestMRRJobsDAGApi.testMultipleMRRSleepJobViaSession(TestMRRJobsDAGApi.java:501)


FAILED:  org.apache.tez.mapreduce.TestMRRJobsDAGApi.testNonDefaultFSStagingDir

Error Message:
test timed out after 60000 milliseconds

Stack Trace:
java.lang.Exception: test timed out after 60000 milliseconds
	at java.lang.Thread.sleep(Native Method)
	at org.apache.tez.client.TezClient.waitNonSessionTillReady(TezClient.java:941)
	at org.apache.tez.client.TezClient.submitDAGApplication(TezClient.java:1036)
	at org.apache.tez.client.TezClient.submitDAGApplication(TezClient.java:992)
	at org.apache.tez.client.TezClient.submitDAG(TezClient.java:524)
	at org.apache.tez.mapreduce.TestMRRJobsDAGApi.testNonDefaultFSStagingDir(TestMRRJobsDAGApi.java:245)


FAILED:  org.apache.tez.mapreduce.TestMRRJobsDAGApi.testMRRSleepJobDagSubmit

Error Message:
test timed out after 60000 milliseconds

Stack Trace:
java.lang.Exception: test timed out after 60000 milliseconds
	at java.lang.Thread.sleep(Native Method)
	at org.apache.tez.client.TezClient.waitNonSessionTillReady(TezClient.java:941)
	at org.apache.tez.client.TezClient.submitDAGApplication(TezClient.java:1036)
	at org.apache.tez.client.TezClient.submitDAGApplication(TezClient.java:992)
	at org.apache.tez.client.TezClient.submitDAG(TezClient.java:524)
	at org.apache.tez.mapreduce.TestMRRJobsDAGApi.testMRRSleepJobDagSubmitCore(TestMRRJobsDAGApi.java:700)
	at org.apache.tez.mapreduce.TestMRRJobsDAGApi.testMRRSleepJobDagSubmitCore(TestMRRJobsDAGApi.java:543)
	at org.apache.tez.mapreduce.TestMRRJobsDAGApi.testMRRSleepJobDagSubmit(TestMRRJobsDAGApi.java:325)


FAILED:  org.apache.tez.mapreduce.TestMRRJobsDAGApi.testMRRSleepJobDagSubmitAndKillViaRPC

Error Message:
test timed out after 60000 milliseconds

Stack Trace:
java.lang.Exception: test timed out after 60000 milliseconds
	at java.lang.Thread.sleep(Native Method)
	at org.apache.tez.client.TezClient.waitForProxy(TezClient.java:972)
	at org.apache.tez.client.TezClient.submitDAGSession(TezClient.java:586)
	at org.apache.tez.client.TezClient.submitDAG(TezClient.java:522)
	at org.apache.tez.mapreduce.TestMRRJobsDAGApi.testMRRSleepJobDagSubmitCore(TestMRRJobsDAGApi.java:746)
	at org.apache.tez.mapreduce.TestMRRJobsDAGApi.testMRRSleepJobDagSubmitCore(TestMRRJobsDAGApi.java:543)
	at org.apache.tez.mapreduce.TestMRRJobsDAGApi.testMRRSleepJobDagSubmitAndKillViaRPC(TestMRRJobsDAGApi.java:516)


FAILED:  org.apache.tez.mapreduce.TestMRRJobsDAGApi.testMRRSleepJobDagSubmitAndKill

Error Message:
test timed out after 60000 milliseconds

Stack Trace:
java.lang.Exception: test timed out after 60000 milliseconds
	at java.lang.Thread.sleep(Native Method)
	at org.apache.tez.client.TezClient.waitNonSessionTillReady(TezClient.java:941)
	at org.apache.tez.client.TezClient.submitDAGApplication(TezClient.java:1036)
	at org.apache.tez.client.TezClient.submitDAGApplication(TezClient.java:992)
	at org.apache.tez.client.TezClient.submitDAG(TezClient.java:524)
	at org.apache.tez.mapreduce.TestMRRJobsDAGApi.testMRRSleepJobDagSubmitCore(TestMRRJobsDAGApi.java:700)
	at org.apache.tez.mapreduce.TestMRRJobsDAGApi.testMRRSleepJobDagSubmitCore(TestMRRJobsDAGApi.java:543)
	at org.apache.tez.mapreduce.TestMRRJobsDAGApi.testMRRSleepJobDagSubmitAndKill(TestMRRJobsDAGApi.java:336)


FAILED:  org.apache.tez.mapreduce.TestMRRJobsDAGApi.testAMRelocalizationConflict

Error Message:
test timed out after 120000 milliseconds

Stack Trace:
java.lang.Exception: test timed out after 120000 milliseconds
	at java.lang.Thread.sleep(Native Method)
	at org.apache.tez.client.TezClient.waitForProxy(TezClient.java:972)
	at org.apache.tez.client.TezClient.submitDAGSession(TezClient.java:586)
	at org.apache.tez.client.TezClient.submitDAG(TezClient.java:522)
	at org.apache.tez.mapreduce.TestMRRJobsDAGApi.testMRRSleepJobDagSubmitCore(TestMRRJobsDAGApi.java:746)
	at org.apache.tez.mapreduce.TestMRRJobsDAGApi.testAMRelocalizationConflict(TestMRRJobsDAGApi.java:437)
Mime
  • Unnamed multipart/mixed (inline, None, 0 bytes)
View raw message