tez-issues mailing list archives

Site index · List index
Message view « Date » · « Thread »
Top « Date » · « Thread »
From Apache Jenkins Server <jenk...@builds.apache.org>
Subject Failed: TEZ-3124 PreCommit Build #1505
Date Wed, 24 Feb 2016 07:59:56 GMT
Jira: https://issues.apache.org/jira/browse/TEZ-3124
Build: https://builds.apache.org/job/PreCommit-TEZ-Build/1505/

###################################################################################
########################## LAST 60 LINES OF THE CONSOLE ###########################
[...truncated 3635 lines...]
[ERROR] 
[ERROR] After correcting the problems, you can resume the build with the command
[ERROR]   mvn <goals> -rf :tez-dag
[INFO] Build failures were ignored.




{color:red}-1 overall{color}.  Here are the results of testing the latest attachment
  http://issues.apache.org/jira/secure/attachment/12789354/TEZ-3124-5.patch
  against master revision 7fc28f7.

    {color:green}+1 @author{color}.  The patch does not contain any @author tags.

    {color:green}+1 tests included{color}.  The patch appears to include 2 new or modified
test files.

      {color:red}-1 javac{color}.  The applied patch generated 31 javac compiler warnings
(more than the master's current 30 warnings).

    {color:green}+1 javadoc{color}.  There were no new javadoc warning messages.

    {color:green}+1 findbugs{color}.  The patch does not introduce any new Findbugs (version
3.0.1) warnings.

    {color:green}+1 release audit{color}.  The applied patch does not increase the total number
of release audit warnings.

    {color:red}-1 core tests{color}.  The patch failed these unit tests in :
                   org.apache.tez.test.TestFaultTolerance
                  org.apache.tez.dag.app.dag.impl.TestDAGImpl

Test results: https://builds.apache.org/job/PreCommit-TEZ-Build/1505//testReport/
Javac warnings: https://builds.apache.org/job/PreCommit-TEZ-Build/1505//artifact/patchprocess/diffJavacWarnings.txt
Console output: https://builds.apache.org/job/PreCommit-TEZ-Build/1505//console

This message is automatically generated.


======================================================================
======================================================================
    Adding comment to Jira.
======================================================================
======================================================================


Comment added.
3cf01733319fed6c7222de15ea1ac9bbf1527798 logged out


======================================================================
======================================================================
    Finished build.
======================================================================
======================================================================


Build step 'Execute shell' marked build as failure
Archiving artifacts
[description-setter] Could not determine description.
Recording test results
Email was triggered for: Failure - Any
Sending email for trigger: Failure - Any



###################################################################################
############################## FAILED TESTS (if any) ##############################
7 tests failed.
FAILED:  org.apache.tez.test.TestFaultTolerance.testBasicInputFailureWithExit

Error Message:
TezSession has already shutdown. No cluster diagnostics found.

Stack Trace:
org.apache.tez.dag.api.SessionNotRunning: TezSession has already shutdown. No cluster diagnostics
found.
	at org.apache.tez.client.TezClient.waitTillReady(TezClient.java:784)
	at org.apache.tez.test.TestFaultTolerance.runDAGAndVerify(TestFaultTolerance.java:129)
	at org.apache.tez.test.TestFaultTolerance.runDAGAndVerify(TestFaultTolerance.java:124)
	at org.apache.tez.test.TestFaultTolerance.runDAGAndVerify(TestFaultTolerance.java:120)
	at org.apache.tez.test.TestFaultTolerance.testBasicInputFailureWithExit(TestFaultTolerance.java:261)


FAILED:  org.apache.tez.test.TestFaultTolerance.testInputFailureRerunCanSendOutputToTwoDownstreamVertices

Error Message:
TezSession has already shutdown. No cluster diagnostics found.

Stack Trace:
org.apache.tez.dag.api.SessionNotRunning: TezSession has already shutdown. No cluster diagnostics
found.
	at org.apache.tez.client.TezClient.waitTillReady(TezClient.java:784)
	at org.apache.tez.test.TestFaultTolerance.runDAGAndVerify(TestFaultTolerance.java:129)
	at org.apache.tez.test.TestFaultTolerance.runDAGAndVerify(TestFaultTolerance.java:124)
	at org.apache.tez.test.TestFaultTolerance.runDAGAndVerify(TestFaultTolerance.java:120)
	at org.apache.tez.test.TestFaultTolerance.testInputFailureRerunCanSendOutputToTwoDownstreamVertices(TestFaultTolerance.java:703)


FAILED:  org.apache.tez.test.TestFaultTolerance.testMultipleInputFailureWithoutExit

Error Message:
TezSession has already shutdown. No cluster diagnostics found.

Stack Trace:
org.apache.tez.dag.api.SessionNotRunning: TezSession has already shutdown. No cluster diagnostics
found.
	at org.apache.tez.client.TezClient.waitTillReady(TezClient.java:784)
	at org.apache.tez.test.TestFaultTolerance.runDAGAndVerify(TestFaultTolerance.java:129)
	at org.apache.tez.test.TestFaultTolerance.runDAGAndVerify(TestFaultTolerance.java:124)
	at org.apache.tez.test.TestFaultTolerance.runDAGAndVerify(TestFaultTolerance.java:120)
	at org.apache.tez.test.TestFaultTolerance.testMultipleInputFailureWithoutExit(TestFaultTolerance.java:328)


FAILED:  org.apache.tez.test.TestFaultTolerance.testCascadingInputFailureWithExitSuccess

Error Message:
TezSession has already shutdown. No cluster diagnostics found.

Stack Trace:
org.apache.tez.dag.api.SessionNotRunning: TezSession has already shutdown. No cluster diagnostics
found.
	at org.apache.tez.client.TezClient.waitTillReady(TezClient.java:784)
	at org.apache.tez.test.TestFaultTolerance.runDAGAndVerify(TestFaultTolerance.java:129)
	at org.apache.tez.test.TestFaultTolerance.runDAGAndVerify(TestFaultTolerance.java:124)
	at org.apache.tez.test.TestFaultTolerance.runDAGAndVerify(TestFaultTolerance.java:120)
	at org.apache.tez.test.TestFaultTolerance.testCascadingInputFailureWithExitSuccess(TestFaultTolerance.java:576)


FAILED:  org.apache.tez.test.TestFaultTolerance.testBasicSuccessBroadcast

Error Message:
TezSession has already shutdown. No cluster diagnostics found.

Stack Trace:
org.apache.tez.dag.api.SessionNotRunning: TezSession has already shutdown. No cluster diagnostics
found.
	at org.apache.tez.client.TezClient.waitTillReady(TezClient.java:784)
	at org.apache.tez.test.TestFaultTolerance.runDAGAndVerify(TestFaultTolerance.java:129)
	at org.apache.tez.test.TestFaultTolerance.runDAGAndVerify(TestFaultTolerance.java:124)
	at org.apache.tez.test.TestFaultTolerance.runDAGAndVerify(TestFaultTolerance.java:120)
	at org.apache.tez.test.TestFaultTolerance.testBasicSuccessBroadcast(TestFaultTolerance.java:173)


FAILED:  org.apache.tez.test.TestFaultTolerance.testTwoLevelsFailingDAGSuccess

Error Message:
TezSession has already shutdown. No cluster diagnostics found.

Stack Trace:
org.apache.tez.dag.api.SessionNotRunning: TezSession has already shutdown. No cluster diagnostics
found.
	at org.apache.tez.client.TezClient.waitTillReady(TezClient.java:784)
	at org.apache.tez.test.TestFaultTolerance.runDAGAndVerify(TestFaultTolerance.java:129)
	at org.apache.tez.test.TestFaultTolerance.runDAGAndVerify(TestFaultTolerance.java:124)
	at org.apache.tez.test.TestFaultTolerance.runDAGAndVerify(TestFaultTolerance.java:120)
	at org.apache.tez.test.TestFaultTolerance.testTwoLevelsFailingDAGSuccess(TestFaultTolerance.java:364)


FAILED:  org.apache.tez.dag.app.dag.impl.TestDAGImpl.testCounterLimits

Error Message:
expected:<FAILED> but was:<SUCCEEDED>

Stack Trace:
java.lang.AssertionError: expected:<FAILED> but was:<SUCCEEDED>
	at org.junit.Assert.fail(Assert.java:88)
	at org.junit.Assert.failNotEquals(Assert.java:743)
	at org.junit.Assert.assertEquals(Assert.java:118)
	at org.junit.Assert.assertEquals(Assert.java:144)
	at org.apache.tez.dag.app.dag.impl.TestDAGImpl.testCounterLimits(TestDAGImpl.java:2290)



Mime
  • Unnamed multipart/mixed (inline, None, 0 bytes)
View raw message