tez-issues mailing list archives

Site index · List index
Message view « Date » · « Thread »
Top « Date » · « Thread »
From Apache Jenkins Server <jenk...@builds.apache.org>
Subject Failed: TEZ-3102 PreCommit Build #1508
Date Wed, 24 Feb 2016 22:38:43 GMT
Jira: https://issues.apache.org/jira/browse/TEZ-3102
Build: https://builds.apache.org/job/PreCommit-TEZ-Build/1508/

###################################################################################
########################## LAST 60 LINES OF THE CONSOLE ###########################
[...truncated 3842 lines...]
[ERROR] [Help 2] http://cwiki.apache.org/confluence/display/MAVEN/MojoExecutionException
[ERROR] 
[ERROR] After correcting the problems, you can resume the build with the command
[ERROR]   mvn <goals> -rf :tez-dag
[INFO] Build failures were ignored.




{color:red}-1 overall{color}.  Here are the results of testing the latest attachment
  http://issues.apache.org/jira/secure/attachment/12789633/TEZ-3102.003.patch
  against master revision 701e9aa.

    {color:green}+1 @author{color}.  The patch does not contain any @author tags.

    {color:green}+1 tests included{color}.  The patch appears to include 1 new or modified
test files.

    {color:green}+1 javac{color}.  The applied patch does not increase the total number of
javac compiler warnings.

    {color:green}+1 javadoc{color}.  There were no new javadoc warning messages.

    {color:green}+1 findbugs{color}.  The patch does not introduce any new Findbugs (version
3.0.1) warnings.

    {color:green}+1 release audit{color}.  The applied patch does not increase the total number
of release audit warnings.

    {color:red}-1 core tests{color}.  The patch failed these unit tests in :
                   org.apache.tez.test.TestFaultTolerance
                  org.apache.tez.dag.app.rm.TestContainerReuse

Test results: https://builds.apache.org/job/PreCommit-TEZ-Build/1508//testReport/
Console output: https://builds.apache.org/job/PreCommit-TEZ-Build/1508//console

This message is automatically generated.


======================================================================
======================================================================
    Adding comment to Jira.
======================================================================
======================================================================


Comment added.
0170d6653e58ec9117752cb32c46daecdcaf9680 logged out


======================================================================
======================================================================
    Finished build.
======================================================================
======================================================================


Build step 'Execute shell' marked build as failure
Archiving artifacts
[description-setter] Could not determine description.
Recording test results
Email was triggered for: Failure - Any
Sending email for trigger: Failure - Any



###################################################################################
############################## FAILED TESTS (if any) ##############################
8 tests failed.
FAILED:  org.apache.tez.dag.app.rm.TestContainerReuse.testReuseConflictLocalResources

Error Message:

Wanted but not invoked:
taskSchedulerManagerForTest.taskAllocated(
    0,
    Mock for TA attempt_0_0001_0_01_000003_1,
    <any>,
    Container: [ContainerId: container_1_0001_01_000001, NodeId: host1:0, NodeHttpAddress:
host1:0, Resource: <memory:1024, vCores:1>, Priority: 1, Token: null, ]
);
-> at org.apache.tez.dag.app.rm.TestContainerReuse.testReuseConflictLocalResources(TestContainerReuse.java:1254)

However, there were other interactions with this mock:
taskSchedulerManagerForTest.init(
    Configuration: core-default.xml, core-site.xml, yarn-default.xml, yarn-site.xml
);
-> at org.apache.tez.dag.app.rm.TestContainerReuse.testReuseConflictLocalResources(TestContainerReuse.java:1143)

taskSchedulerManagerForTest.setConfig(
    Configuration: core-default.xml, core-site.xml, yarn-default.xml, yarn-site.xml
);
-> at org.apache.tez.dag.app.rm.TestContainerReuse.testReuseConflictLocalResources(TestContainerReuse.java:1143)

taskSchedulerManagerForTest.serviceInit(
    Configuration: core-default.xml, core-site.xml, yarn-default.xml, yarn-site.xml
);
-> at org.apache.tez.dag.app.rm.TestContainerReuse.testReuseConflictLocalResources(TestContainerReuse.java:1143)

taskSchedulerManagerForTest.start();
-> at org.apache.tez.dag.app.rm.TestContainerReuse.testReuseConflictLocalResources(TestContainerReuse.java:1144)

taskSchedulerManagerForTest.serviceStart();
-> at org.apache.tez.dag.app.rm.TestContainerReuse.testReuseConflictLocalResources(TestContainerReuse.java:1144)

taskSchedulerManagerForTest.instantiateSchedulers(
    "host",
    0,
    "",
    Mock for AppContext, hashCode: 551913438
);
-> at org.apache.tez.dag.app.rm.TestContainerReuse.testReuseConflictLocalResources(TestContainerReuse.java:1144)

taskSchedulerManagerForTest.getContainerSignatureMatcher();
-> at org.apache.tez.dag.app.rm.TestContainerReuse.testReuseConflictLocalResources(TestContainerReuse.java:1144)

taskSchedulerManagerForTest.getConfig();
-> at org.apache.tez.dag.app.rm.TestContainerReuse.testReuseConflictLocalResources(TestContainerReuse.java:1144)

taskSchedulerManagerForTest.getSpyTaskScheduler();
-> at org.apache.tez.dag.app.rm.TestContainerReuse.testReuseConflictLocalResources(TestContainerReuse.java:1146)

taskSchedulerManagerForTest.setApplicationRegistrationData(
    0,
    Mock for Resource, hashCode: 1027281073,
    Mock for Map, hashCode: 1891955678,
    null
);
-> at org.apache.tez.dag.app.rm.TaskSchedulerContextImpl.setApplicationRegistrationData(TaskSchedulerContextImpl.java:96)

taskSchedulerManagerForTest.handleEvent(
    EventType: S_TA_LAUNCH_REQUEST
);
-> at org.apache.tez.dag.app.rm.TestContainerReuse.testReuseConflictLocalResources(TestContainerReuse.java:1208)

taskSchedulerManagerForTest.handleEvent(
    EventType: S_TA_LAUNCH_REQUEST
);
-> at org.apache.tez.dag.app.rm.TestContainerReuse.testReuseConflictLocalResources(TestContainerReuse.java:1211)

taskSchedulerManagerForTest.taskAllocated(
    0,
    Mock for TA attempt_0_0001_0_01_000001_1,
    EventType: S_TA_LAUNCH_REQUEST,
    Container: [ContainerId: container_1_0001_01_000001, NodeId: host1:0, NodeHttpAddress:
host1:0, Resource: <memory:1024, vCores:1>, Priority: 1, Token: null, ]
);
-> at org.apache.tez.dag.app.rm.TaskSchedulerContextImpl.taskAllocated(TaskSchedulerContextImpl.java:69)

taskSchedulerManagerForTest.handleEvent(
    EventType: S_TA_ENDED
);
-> at org.apache.tez.dag.app.rm.TestContainerReuse.testReuseConflictLocalResources(TestContainerReuse.java:1227)

taskSchedulerManagerForTest.taskAllocated(
    0,
    Mock for TA attempt_0_0001_0_01_000002_1,
    EventType: S_TA_LAUNCH_REQUEST,
    Container: [ContainerId: container_1_0001_01_000001, NodeId: host1:0, NodeHttpAddress:
host1:0, Resource: <memory:1024, vCores:1>, Priority: 1, Token: null, ]
);
-> at org.apache.tez.dag.app.rm.TaskSchedulerContextImpl.taskAllocated(TaskSchedulerContextImpl.java:69)

taskSchedulerManagerForTest.handleEvent(
    EventType: S_TA_ENDED
);
-> at org.apache.tez.dag.app.rm.TestContainerReuse.testReuseConflictLocalResources(TestContainerReuse.java:1241)

taskSchedulerManagerForTest.handleEvent(
    EventType: S_TA_LAUNCH_REQUEST
);
-> at org.apache.tez.dag.app.rm.TestContainerReuse.testReuseConflictLocalResources(TestContainerReuse.java:1251)



Stack Trace:
org.mockito.exceptions.verification.WantedButNotInvoked: 
Wanted but not invoked:
taskSchedulerManagerForTest.taskAllocated(
    0,
    Mock for TA attempt_0_0001_0_01_000003_1,
    <any>,
    Container: [ContainerId: container_1_0001_01_000001, NodeId: host1:0, NodeHttpAddress:
host1:0, Resource: <memory:1024, vCores:1>, Priority: 1, Token: null, ]
);
-> at org.apache.tez.dag.app.rm.TestContainerReuse.testReuseConflictLocalResources(TestContainerReuse.java:1254)

However, there were other interactions with this mock:
taskSchedulerManagerForTest.init(
    Configuration: core-default.xml, core-site.xml, yarn-default.xml, yarn-site.xml
);
-> at org.apache.tez.dag.app.rm.TestContainerReuse.testReuseConflictLocalResources(TestContainerReuse.java:1143)

taskSchedulerManagerForTest.setConfig(
    Configuration: core-default.xml, core-site.xml, yarn-default.xml, yarn-site.xml
);
-> at org.apache.tez.dag.app.rm.TestContainerReuse.testReuseConflictLocalResources(TestContainerReuse.java:1143)

taskSchedulerManagerForTest.serviceInit(
    Configuration: core-default.xml, core-site.xml, yarn-default.xml, yarn-site.xml
);
-> at org.apache.tez.dag.app.rm.TestContainerReuse.testReuseConflictLocalResources(TestContainerReuse.java:1143)

taskSchedulerManagerForTest.start();
-> at org.apache.tez.dag.app.rm.TestContainerReuse.testReuseConflictLocalResources(TestContainerReuse.java:1144)

taskSchedulerManagerForTest.serviceStart();
-> at org.apache.tez.dag.app.rm.TestContainerReuse.testReuseConflictLocalResources(TestContainerReuse.java:1144)

taskSchedulerManagerForTest.instantiateSchedulers(
    "host",
    0,
    "",
    Mock for AppContext, hashCode: 551913438
);
-> at org.apache.tez.dag.app.rm.TestContainerReuse.testReuseConflictLocalResources(TestContainerReuse.java:1144)

taskSchedulerManagerForTest.getContainerSignatureMatcher();
-> at org.apache.tez.dag.app.rm.TestContainerReuse.testReuseConflictLocalResources(TestContainerReuse.java:1144)

taskSchedulerManagerForTest.getConfig();
-> at org.apache.tez.dag.app.rm.TestContainerReuse.testReuseConflictLocalResources(TestContainerReuse.java:1144)

taskSchedulerManagerForTest.getSpyTaskScheduler();
-> at org.apache.tez.dag.app.rm.TestContainerReuse.testReuseConflictLocalResources(TestContainerReuse.java:1146)

taskSchedulerManagerForTest.setApplicationRegistrationData(
    0,
    Mock for Resource, hashCode: 1027281073,
    Mock for Map, hashCode: 1891955678,
    null
);
-> at org.apache.tez.dag.app.rm.TaskSchedulerContextImpl.setApplicationRegistrationData(TaskSchedulerContextImpl.java:96)

taskSchedulerManagerForTest.handleEvent(
    EventType: S_TA_LAUNCH_REQUEST
);
-> at org.apache.tez.dag.app.rm.TestContainerReuse.testReuseConflictLocalResources(TestContainerReuse.java:1208)

taskSchedulerManagerForTest.handleEvent(
    EventType: S_TA_LAUNCH_REQUEST
);
-> at org.apache.tez.dag.app.rm.TestContainerReuse.testReuseConflictLocalResources(TestContainerReuse.java:1211)

taskSchedulerManagerForTest.taskAllocated(
    0,
    Mock for TA attempt_0_0001_0_01_000001_1,
    EventType: S_TA_LAUNCH_REQUEST,
    Container: [ContainerId: container_1_0001_01_000001, NodeId: host1:0, NodeHttpAddress:
host1:0, Resource: <memory:1024, vCores:1>, Priority: 1, Token: null, ]
);
-> at org.apache.tez.dag.app.rm.TaskSchedulerContextImpl.taskAllocated(TaskSchedulerContextImpl.java:69)

taskSchedulerManagerForTest.handleEvent(
    EventType: S_TA_ENDED
);
-> at org.apache.tez.dag.app.rm.TestContainerReuse.testReuseConflictLocalResources(TestContainerReuse.java:1227)

taskSchedulerManagerForTest.taskAllocated(
    0,
    Mock for TA attempt_0_0001_0_01_000002_1,
    EventType: S_TA_LAUNCH_REQUEST,
    Container: [ContainerId: container_1_0001_01_000001, NodeId: host1:0, NodeHttpAddress:
host1:0, Resource: <memory:1024, vCores:1>, Priority: 1, Token: null, ]
);
-> at org.apache.tez.dag.app.rm.TaskSchedulerContextImpl.taskAllocated(TaskSchedulerContextImpl.java:69)

taskSchedulerManagerForTest.handleEvent(
    EventType: S_TA_ENDED
);
-> at org.apache.tez.dag.app.rm.TestContainerReuse.testReuseConflictLocalResources(TestContainerReuse.java:1241)

taskSchedulerManagerForTest.handleEvent(
    EventType: S_TA_LAUNCH_REQUEST
);
-> at org.apache.tez.dag.app.rm.TestContainerReuse.testReuseConflictLocalResources(TestContainerReuse.java:1251)


	at org.apache.tez.dag.app.rm.TestContainerReuse.testReuseConflictLocalResources(TestContainerReuse.java:1254)


FAILED:  org.apache.tez.test.TestFaultTolerance.testRandomFailingInputs

Error Message:
expected:<SUCCEEDED> but was:<ERROR>

Stack Trace:
java.lang.AssertionError: expected:<SUCCEEDED> but was:<ERROR>
	at org.junit.Assert.fail(Assert.java:88)
	at org.junit.Assert.failNotEquals(Assert.java:743)
	at org.junit.Assert.assertEquals(Assert.java:118)
	at org.junit.Assert.assertEquals(Assert.java:144)
	at org.apache.tez.test.TestFaultTolerance.runDAGAndVerify(TestFaultTolerance.java:141)
	at org.apache.tez.test.TestFaultTolerance.runDAGAndVerify(TestFaultTolerance.java:124)
	at org.apache.tez.test.TestFaultTolerance.runDAGAndVerify(TestFaultTolerance.java:120)
	at org.apache.tez.test.TestFaultTolerance.testRandomFailingInputs(TestFaultTolerance.java:763)


FAILED:  org.apache.tez.test.TestFaultTolerance.testBasicInputFailureWithExit

Error Message:
TezSession has already shutdown. No cluster diagnostics found.

Stack Trace:
org.apache.tez.dag.api.SessionNotRunning: TezSession has already shutdown. No cluster diagnostics
found.
	at org.apache.tez.client.TezClient.waitTillReady(TezClient.java:784)
	at org.apache.tez.test.TestFaultTolerance.runDAGAndVerify(TestFaultTolerance.java:129)
	at org.apache.tez.test.TestFaultTolerance.runDAGAndVerify(TestFaultTolerance.java:124)
	at org.apache.tez.test.TestFaultTolerance.runDAGAndVerify(TestFaultTolerance.java:120)
	at org.apache.tez.test.TestFaultTolerance.testBasicInputFailureWithExit(TestFaultTolerance.java:261)


FAILED:  org.apache.tez.test.TestFaultTolerance.testInputFailureRerunCanSendOutputToTwoDownstreamVertices

Error Message:
TezSession has already shutdown. No cluster diagnostics found.

Stack Trace:
org.apache.tez.dag.api.SessionNotRunning: TezSession has already shutdown. No cluster diagnostics
found.
	at org.apache.tez.client.TezClient.waitTillReady(TezClient.java:784)
	at org.apache.tez.test.TestFaultTolerance.runDAGAndVerify(TestFaultTolerance.java:129)
	at org.apache.tez.test.TestFaultTolerance.runDAGAndVerify(TestFaultTolerance.java:124)
	at org.apache.tez.test.TestFaultTolerance.runDAGAndVerify(TestFaultTolerance.java:120)
	at org.apache.tez.test.TestFaultTolerance.testInputFailureRerunCanSendOutputToTwoDownstreamVertices(TestFaultTolerance.java:703)


FAILED:  org.apache.tez.test.TestFaultTolerance.testMultipleInputFailureWithoutExit

Error Message:
TezSession has already shutdown. No cluster diagnostics found.

Stack Trace:
org.apache.tez.dag.api.SessionNotRunning: TezSession has already shutdown. No cluster diagnostics
found.
	at org.apache.tez.client.TezClient.waitTillReady(TezClient.java:784)
	at org.apache.tez.test.TestFaultTolerance.runDAGAndVerify(TestFaultTolerance.java:129)
	at org.apache.tez.test.TestFaultTolerance.runDAGAndVerify(TestFaultTolerance.java:124)
	at org.apache.tez.test.TestFaultTolerance.runDAGAndVerify(TestFaultTolerance.java:120)
	at org.apache.tez.test.TestFaultTolerance.testMultipleInputFailureWithoutExit(TestFaultTolerance.java:328)


FAILED:  org.apache.tez.test.TestFaultTolerance.testCascadingInputFailureWithExitSuccess

Error Message:
TezSession has already shutdown. No cluster diagnostics found.

Stack Trace:
org.apache.tez.dag.api.SessionNotRunning: TezSession has already shutdown. No cluster diagnostics
found.
	at org.apache.tez.client.TezClient.waitTillReady(TezClient.java:784)
	at org.apache.tez.test.TestFaultTolerance.runDAGAndVerify(TestFaultTolerance.java:129)
	at org.apache.tez.test.TestFaultTolerance.runDAGAndVerify(TestFaultTolerance.java:124)
	at org.apache.tez.test.TestFaultTolerance.runDAGAndVerify(TestFaultTolerance.java:120)
	at org.apache.tez.test.TestFaultTolerance.testCascadingInputFailureWithExitSuccess(TestFaultTolerance.java:576)


FAILED:  org.apache.tez.test.TestFaultTolerance.testBasicSuccessBroadcast

Error Message:
TezSession has already shutdown. No cluster diagnostics found.

Stack Trace:
org.apache.tez.dag.api.SessionNotRunning: TezSession has already shutdown. No cluster diagnostics
found.
	at org.apache.tez.client.TezClient.waitTillReady(TezClient.java:784)
	at org.apache.tez.test.TestFaultTolerance.runDAGAndVerify(TestFaultTolerance.java:129)
	at org.apache.tez.test.TestFaultTolerance.runDAGAndVerify(TestFaultTolerance.java:124)
	at org.apache.tez.test.TestFaultTolerance.runDAGAndVerify(TestFaultTolerance.java:120)
	at org.apache.tez.test.TestFaultTolerance.testBasicSuccessBroadcast(TestFaultTolerance.java:173)


FAILED:  org.apache.tez.test.TestFaultTolerance.testTwoLevelsFailingDAGSuccess

Error Message:
TezSession has already shutdown. No cluster diagnostics found.

Stack Trace:
org.apache.tez.dag.api.SessionNotRunning: TezSession has already shutdown. No cluster diagnostics
found.
	at org.apache.tez.client.TezClient.waitTillReady(TezClient.java:784)
	at org.apache.tez.test.TestFaultTolerance.runDAGAndVerify(TestFaultTolerance.java:129)
	at org.apache.tez.test.TestFaultTolerance.runDAGAndVerify(TestFaultTolerance.java:124)
	at org.apache.tez.test.TestFaultTolerance.runDAGAndVerify(TestFaultTolerance.java:120)
	at org.apache.tez.test.TestFaultTolerance.testTwoLevelsFailingDAGSuccess(TestFaultTolerance.java:364)



Mime
  • Unnamed multipart/mixed (inline, None, 0 bytes)
View raw message