tez-issues mailing list archives

Site index · List index
Message view « Date » · « Thread »
Top « Date » · « Thread »
From Apache Jenkins Server <jenk...@builds.apache.org>
Subject Failed: TEZ-3141 PreCommit Build #1519
Date Fri, 26 Feb 2016 16:32:29 GMT
Jira: https://issues.apache.org/jira/browse/TEZ-3141
Build: https://builds.apache.org/job/PreCommit-TEZ-Build/1519/

###################################################################################
########################## LAST 60 LINES OF THE CONSOLE ###########################
[...truncated 1765 lines...]

  Running tests 
  /home/jenkins/tools/maven/latest/bin/mvn clean install -fn -DTezPatchProcess
cat: /home/jenkins/jenkins-slave/workspace/PreCommit-TEZ-Build@2/../patchprocess/testrun.txt:
No such file or directory
awk: fatal: cannot open file `/home/jenkins/jenkins-slave/workspace/PreCommit-TEZ-Build@2/../patchprocess/testrun.txt'
for reading (No such file or directory)




{color:red}-1 overall{color}.  Here are the results of testing the latest attachment
  http://issues.apache.org/jira/secure/attachment/12790144/TEZ-3141.002.patch
  against master revision 15d7339.

    {color:green}+1 @author{color}.  The patch does not contain any @author tags.

    {color:green}+1 tests included{color}.  The patch appears to include 1 new or modified
test files.

    {color:green}+1 javac{color}.  The applied patch does not increase the total number of
javac compiler warnings.

    {color:green}+1 javadoc{color}.  There were no new javadoc warning messages.

    {color:red}-1 findbugs{color}.  The patch appears to introduce 1 new Findbugs (version
3.0.1) warnings.

    {color:green}+1 release audit{color}.  The applied patch does not increase the total number
of release audit warnings.

    {color:red}-1 core tests{color}.  The patch failed these unit tests in :
                   org.apache.tez.test.TestFaultTolerance

Test results: https://builds.apache.org/job/PreCommit-TEZ-Build/1519//testReport/
Findbugs warnings: https://builds.apache.org/job/PreCommit-TEZ-Build/1519//artifact/patchprocess/newPatchFindbugsWarningstez-runtime-library.html
Console output: https://builds.apache.org/job/PreCommit-TEZ-Build/1519//console

This message is automatically generated.


======================================================================
======================================================================
    Adding comment to Jira.
======================================================================
======================================================================


Comment added.
0988e2739a75eb6105a641de85a0e03ee237b6e8 logged out


======================================================================
======================================================================
    Finished build.
======================================================================
======================================================================


Build step 'Execute shell' marked build as failure
Archiving artifacts
[description-setter] Could not determine description.
Recording test results
Email was triggered for: Failure - Any
Sending email for trigger: Failure - Any



###################################################################################
############################## FAILED TESTS (if any) ##############################
7 tests failed.
FAILED:  org.apache.tez.test.TestFaultTolerance.testRandomFailingInputs

Error Message:
expected:<SUCCEEDED> but was:<ERROR>

Stack Trace:
java.lang.AssertionError: expected:<SUCCEEDED> but was:<ERROR>
	at org.junit.Assert.fail(Assert.java:88)
	at org.junit.Assert.failNotEquals(Assert.java:743)
	at org.junit.Assert.assertEquals(Assert.java:118)
	at org.junit.Assert.assertEquals(Assert.java:144)
	at org.apache.tez.test.TestFaultTolerance.runDAGAndVerify(TestFaultTolerance.java:141)
	at org.apache.tez.test.TestFaultTolerance.runDAGAndVerify(TestFaultTolerance.java:124)
	at org.apache.tez.test.TestFaultTolerance.runDAGAndVerify(TestFaultTolerance.java:120)
	at org.apache.tez.test.TestFaultTolerance.testRandomFailingInputs(TestFaultTolerance.java:763)


FAILED:  org.apache.tez.test.TestFaultTolerance.testBasicInputFailureWithExit

Error Message:
TezSession has already shutdown. No cluster diagnostics found.

Stack Trace:
org.apache.tez.dag.api.SessionNotRunning: TezSession has already shutdown. No cluster diagnostics
found.
	at org.apache.tez.client.TezClient.waitTillReady(TezClient.java:784)
	at org.apache.tez.test.TestFaultTolerance.runDAGAndVerify(TestFaultTolerance.java:129)
	at org.apache.tez.test.TestFaultTolerance.runDAGAndVerify(TestFaultTolerance.java:124)
	at org.apache.tez.test.TestFaultTolerance.runDAGAndVerify(TestFaultTolerance.java:120)
	at org.apache.tez.test.TestFaultTolerance.testBasicInputFailureWithExit(TestFaultTolerance.java:261)


FAILED:  org.apache.tez.test.TestFaultTolerance.testInputFailureRerunCanSendOutputToTwoDownstreamVertices

Error Message:
TezSession has already shutdown. No cluster diagnostics found.

Stack Trace:
org.apache.tez.dag.api.SessionNotRunning: TezSession has already shutdown. No cluster diagnostics
found.
	at org.apache.tez.client.TezClient.waitTillReady(TezClient.java:784)
	at org.apache.tez.test.TestFaultTolerance.runDAGAndVerify(TestFaultTolerance.java:129)
	at org.apache.tez.test.TestFaultTolerance.runDAGAndVerify(TestFaultTolerance.java:124)
	at org.apache.tez.test.TestFaultTolerance.runDAGAndVerify(TestFaultTolerance.java:120)
	at org.apache.tez.test.TestFaultTolerance.testInputFailureRerunCanSendOutputToTwoDownstreamVertices(TestFaultTolerance.java:703)


FAILED:  org.apache.tez.test.TestFaultTolerance.testMultipleInputFailureWithoutExit

Error Message:
TezSession has already shutdown. No cluster diagnostics found.

Stack Trace:
org.apache.tez.dag.api.SessionNotRunning: TezSession has already shutdown. No cluster diagnostics
found.
	at org.apache.tez.client.TezClient.waitTillReady(TezClient.java:784)
	at org.apache.tez.test.TestFaultTolerance.runDAGAndVerify(TestFaultTolerance.java:129)
	at org.apache.tez.test.TestFaultTolerance.runDAGAndVerify(TestFaultTolerance.java:124)
	at org.apache.tez.test.TestFaultTolerance.runDAGAndVerify(TestFaultTolerance.java:120)
	at org.apache.tez.test.TestFaultTolerance.testMultipleInputFailureWithoutExit(TestFaultTolerance.java:328)


FAILED:  org.apache.tez.test.TestFaultTolerance.testCascadingInputFailureWithExitSuccess

Error Message:
TezSession has already shutdown. No cluster diagnostics found.

Stack Trace:
org.apache.tez.dag.api.SessionNotRunning: TezSession has already shutdown. No cluster diagnostics
found.
	at org.apache.tez.client.TezClient.waitTillReady(TezClient.java:784)
	at org.apache.tez.test.TestFaultTolerance.runDAGAndVerify(TestFaultTolerance.java:129)
	at org.apache.tez.test.TestFaultTolerance.runDAGAndVerify(TestFaultTolerance.java:124)
	at org.apache.tez.test.TestFaultTolerance.runDAGAndVerify(TestFaultTolerance.java:120)
	at org.apache.tez.test.TestFaultTolerance.testCascadingInputFailureWithExitSuccess(TestFaultTolerance.java:576)


FAILED:  org.apache.tez.test.TestFaultTolerance.testBasicSuccessBroadcast

Error Message:
TezSession has already shutdown. No cluster diagnostics found.

Stack Trace:
org.apache.tez.dag.api.SessionNotRunning: TezSession has already shutdown. No cluster diagnostics
found.
	at org.apache.tez.client.TezClient.waitTillReady(TezClient.java:784)
	at org.apache.tez.test.TestFaultTolerance.runDAGAndVerify(TestFaultTolerance.java:129)
	at org.apache.tez.test.TestFaultTolerance.runDAGAndVerify(TestFaultTolerance.java:124)
	at org.apache.tez.test.TestFaultTolerance.runDAGAndVerify(TestFaultTolerance.java:120)
	at org.apache.tez.test.TestFaultTolerance.testBasicSuccessBroadcast(TestFaultTolerance.java:173)


FAILED:  org.apache.tez.test.TestFaultTolerance.testTwoLevelsFailingDAGSuccess

Error Message:
TezSession has already shutdown. No cluster diagnostics found.

Stack Trace:
org.apache.tez.dag.api.SessionNotRunning: TezSession has already shutdown. No cluster diagnostics
found.
	at org.apache.tez.client.TezClient.waitTillReady(TezClient.java:784)
	at org.apache.tez.test.TestFaultTolerance.runDAGAndVerify(TestFaultTolerance.java:129)
	at org.apache.tez.test.TestFaultTolerance.runDAGAndVerify(TestFaultTolerance.java:124)
	at org.apache.tez.test.TestFaultTolerance.runDAGAndVerify(TestFaultTolerance.java:120)
	at org.apache.tez.test.TestFaultTolerance.testTwoLevelsFailingDAGSuccess(TestFaultTolerance.java:364)



Mime
  • Unnamed multipart/mixed (inline, None, 0 bytes)
View raw message