tez-issues mailing list archives

Site index · List index
Message view « Date » · « Thread »
Top « Date » · « Thread »
From Apache Jenkins Server <jenk...@builds.apache.org>
Subject Failed: TEZ-3128 PreCommit Build #1507
Date Wed, 24 Feb 2016 15:57:28 GMT
Jira: https://issues.apache.org/jira/browse/TEZ-3128
Build: https://builds.apache.org/job/PreCommit-TEZ-Build/1507/

###################################################################################
########################## LAST 60 LINES OF THE CONSOLE ###########################
[...truncated 3583 lines...]
[ERROR] 
[ERROR] After correcting the problems, you can resume the build with the command
[ERROR]   mvn <goals> -rf :tez-history-parser
[INFO] Build failures were ignored.




{color:red}-1 overall{color}.  Here are the results of testing the latest attachment
  http://issues.apache.org/jira/secure/attachment/12789566/TEZ-3128.002.patch
  against master revision 701e9aa.

    {color:green}+1 @author{color}.  The patch does not contain any @author tags.

    {color:red}-1 tests included{color}.  The patch doesn't appear to include any new or modified
tests.
                        Please justify why no new tests are needed for this patch.
                        Also please list what manual steps were performed to verify this patch.

    {color:green}+1 javac{color}.  The applied patch does not increase the total number of
javac compiler warnings.

    {color:green}+1 javadoc{color}.  There were no new javadoc warning messages.

    {color:green}+1 findbugs{color}.  The patch does not introduce any new Findbugs (version
3.0.1) warnings.

    {color:green}+1 release audit{color}.  The applied patch does not increase the total number
of release audit warnings.

    {color:red}-1 core tests{color}.  The patch failed these unit tests in :
                   org.apache.tez.history.TestHistoryParser

Test results: https://builds.apache.org/job/PreCommit-TEZ-Build/1507//testReport/
Console output: https://builds.apache.org/job/PreCommit-TEZ-Build/1507//console

This message is automatically generated.


======================================================================
======================================================================
    Adding comment to Jira.
======================================================================
======================================================================


Comment added.
4ab9596f9f35dadb14ddfa50bf1a9986dbeb9d2b logged out


======================================================================
======================================================================
    Finished build.
======================================================================
======================================================================


Build step 'Execute shell' marked build as failure
Archiving artifacts
[description-setter] Could not determine description.
Recording test results
Email was triggered for: Failure - Any
Sending email for trigger: Failure - Any



###################################################################################
############################## FAILED TESTS (if any) ##############################
1 tests failed.
FAILED:  org.apache.tez.history.TestHistoryParser.testParserWithSuccessfulJob

Error Message:
null

Stack Trace:
java.lang.AssertionError: null
	at org.junit.Assert.fail(Assert.java:86)
	at org.junit.Assert.assertTrue(Assert.java:41)
	at org.junit.Assert.assertTrue(Assert.java:52)
	at org.apache.tez.history.TestHistoryParser.verifyJobSpecificInfo(TestHistoryParser.java:252)
	at org.apache.tez.history.TestHistoryParser.testParserWithSuccessfulJob(TestHistoryParser.java:209)



Mime
  • Unnamed multipart/mixed (inline, None, 0 bytes)
View raw message