tez-issues mailing list archives

Site index · List index
Message view « Date » · « Thread »
Top « Date » · « Thread »
From Apache Jenkins Server <jenk...@builds.apache.org>
Subject Failed: TEZ-2307 PreCommit Build #1442
Date Mon, 01 Feb 2016 06:28:38 GMT
Jira: https://issues.apache.org/jira/browse/TEZ-2307
Build: https://builds.apache.org/job/PreCommit-TEZ-Build/1442/

###################################################################################
########################## LAST 60 LINES OF THE CONSOLE ###########################
[...truncated 3572 lines...]
[ERROR] After correcting the problems, you can resume the build with the command
[ERROR]   mvn <goals> -rf :tez-dag
[INFO] Build failures were ignored.




{color:red}-1 overall{color}.  Here are the results of testing the latest attachment
  http://issues.apache.org/jira/secure/attachment/12785457/TEZ-2307-5.patch
  against master revision 870972d.

    {color:green}+1 @author{color}.  The patch does not contain any @author tags.

    {color:red}-1 tests included{color}.  The patch doesn't appear to include any new or modified
tests.
                        Please justify why no new tests are needed for this patch.
                        Also please list what manual steps were performed to verify this patch.

    {color:green}+1 javac{color}.  The applied patch does not increase the total number of
javac compiler warnings.

    {color:green}+1 javadoc{color}.  There were no new javadoc warning messages.

    {color:green}+1 findbugs{color}.  The patch does not introduce any new Findbugs (version
3.0.1) warnings.

    {color:green}+1 release audit{color}.  The applied patch does not increase the total number
of release audit warnings.

    {color:red}-1 core tests{color}.  The patch failed these unit tests in :
                   org.apache.tez.dag.app.dag.impl.TestDAGImpl
                  org.apache.tez.dag.app.TestMockDAGAppMaster

Test results: https://builds.apache.org/job/PreCommit-TEZ-Build/1442//testReport/
Console output: https://builds.apache.org/job/PreCommit-TEZ-Build/1442//console

This message is automatically generated.


======================================================================
======================================================================
    Adding comment to Jira.
======================================================================
======================================================================


Comment added.
e966e8e57dd367cbf3f3f7da2f9d5fe644e3e7e6 logged out


======================================================================
======================================================================
    Finished build.
======================================================================
======================================================================


Build step 'Execute shell' marked build as failure
Archiving artifacts
[description-setter] Could not determine description.
Recording test results
Email was triggered for: Failure - Any
Sending email for trigger: Failure - Any



###################################################################################
############################## FAILED TESTS (if any) ##############################
2 tests failed.
FAILED:  org.apache.tez.dag.app.TestMockDAGAppMaster.testInternalPreemption

Error Message:
expected:<KILLED> but was:<SUCCEEDED>

Stack Trace:
java.lang.AssertionError: expected:<KILLED> but was:<SUCCEEDED>
	at org.junit.Assert.fail(Assert.java:88)
	at org.junit.Assert.failNotEquals(Assert.java:743)
	at org.junit.Assert.assertEquals(Assert.java:118)
	at org.junit.Assert.assertEquals(Assert.java:144)
	at org.apache.tez.dag.app.TestMockDAGAppMaster.testInternalPreemption(TestMockDAGAppMaster.java:215)


FAILED:  org.apache.tez.dag.app.dag.impl.TestDAGImpl.testCounterLimits

Error Message:
expected:<FAILED> but was:<SUCCEEDED>

Stack Trace:
java.lang.AssertionError: expected:<FAILED> but was:<SUCCEEDED>
	at org.junit.Assert.fail(Assert.java:88)
	at org.junit.Assert.failNotEquals(Assert.java:743)
	at org.junit.Assert.assertEquals(Assert.java:118)
	at org.junit.Assert.assertEquals(Assert.java:144)
	at org.apache.tez.dag.app.dag.impl.TestDAGImpl.testCounterLimits(TestDAGImpl.java:2254)



Mime
  • Unnamed multipart/mixed (inline, None, 0 bytes)
View raw message