tez-issues mailing list archives

Site index · List index
Message view « Date » · « Thread »
Top « Date » · « Thread »
From Apache Jenkins Server <jenk...@builds.apache.org>
Subject Failed: TEZ-2583 PreCommit Build #870
Date Wed, 01 Jul 2015 14:22:56 GMT
Jira: https://issues.apache.org/jira/browse/TEZ-2583
Build: https://builds.apache.org/job/PreCommit-TEZ-Build/870/

###################################################################################
########################## LAST 60 LINES OF THE CONSOLE ###########################
[...truncated 2698 lines...]




{color:red}-1 overall{color}.  Here are the results of testing the latest attachment
  http://issues.apache.org/jira/secure/attachment/12743069/TEZ-2583-2.patch
  against master revision 2073351.

    {color:green}+1 @author{color}.  The patch does not contain any @author tags.

    {color:green}+1 tests included{color}.  The patch appears to include 3 new or modified
test files.

    {color:green}+1 javac{color}.  The applied patch does not increase the total number of
javac compiler warnings.

    {color:green}+1 javadoc{color}.  There were no new javadoc warning messages.

    {color:green}+1 findbugs{color}.  The patch does not introduce any new Findbugs (version
3.0.1) warnings.

    {color:green}+1 release audit{color}.  The applied patch does not increase the total number
of release audit warnings.

    {color:red}-1 core tests{color}.  The patch failed these unit tests in :
                   org.apache.tez.test.TestRecovery

Test results: https://builds.apache.org/job/PreCommit-TEZ-Build/870//testReport/
Console output: https://builds.apache.org/job/PreCommit-TEZ-Build/870//console

This message is automatically generated.


======================================================================
======================================================================
    Adding comment to Jira.
======================================================================
======================================================================


Comment added.
562dd714dc7870edde731e86608232082c9cf8c2 logged out


======================================================================
======================================================================
    Finished build.
======================================================================
======================================================================


Build step 'Execute shell' marked build as failure
Archiving artifacts
Sending artifact delta relative to PreCommit-TEZ-Build #868
Archived 47 artifacts
Archive block size is 32768
Received 24 blocks and 2116856 bytes
Compression is 27.1%
Took 0.73 sec
[description-setter] Could not determine description.
Recording test results
Email was triggered for: Failure
Sending email for trigger: Failure



###################################################################################
############################## FAILED TESTS (if any) ##############################
1 tests failed.
FAILED:  org.apache.tez.test.TestRecovery.testRecovery_OrderedWordCount

Error Message:
OrderedWordCount failed

Stack Trace:
java.lang.AssertionError: OrderedWordCount failed
	at org.junit.Assert.fail(Assert.java:88)
	at org.junit.Assert.assertTrue(Assert.java:41)
	at org.apache.tez.test.TestRecovery.testOrderedWordCount(TestRecovery.java:309)
	at org.apache.tez.test.TestRecovery.testRecovery_OrderedWordCount(TestRecovery.java:276)



Mime
  • Unnamed multipart/mixed (inline, None, 0 bytes)
View raw message