tez-issues mailing list archives

Site index · List index
Message view « Date » · « Thread »
Top « Date » · « Thread »
From Apache Jenkins Server <jenk...@builds.apache.org>
Subject Failed: TEZ-2311 PreCommit Build #940
Date Thu, 30 Jul 2015 03:42:11 GMT
Jira: https://issues.apache.org/jira/browse/TEZ-2311
Build: https://builds.apache.org/job/PreCommit-TEZ-Build/940/

###################################################################################
########################## LAST 60 LINES OF THE CONSOLE ###########################
[...truncated 2825 lines...]




{color:red}-1 overall{color}.  Here are the results of testing the latest attachment
  http://issues.apache.org/jira/secure/attachment/12747904/TEZ-2311-6.patch
  against master revision df87125.

    {color:green}+1 @author{color}.  The patch does not contain any @author tags.

    {color:green}+1 tests included{color}.  The patch appears to include 5 new or modified
test files.

    {color:green}+1 javac{color}.  The applied patch does not increase the total number of
javac compiler warnings.

    {color:green}+1 javadoc{color}.  There were no new javadoc warning messages.

    {color:green}+1 findbugs{color}.  The patch does not introduce any new Findbugs (version
3.0.1) warnings.

    {color:green}+1 release audit{color}.  The applied patch does not increase the total number
of release audit warnings.

    {color:red}-1 core tests{color}.  The patch failed these unit tests in :
                   org.apache.tez.test.TestFaultTolerance

Test results: https://builds.apache.org/job/PreCommit-TEZ-Build/940//testReport/
Console output: https://builds.apache.org/job/PreCommit-TEZ-Build/940//console

This message is automatically generated.


======================================================================
======================================================================
    Adding comment to Jira.
======================================================================
======================================================================


Comment added.
1bffd6c8a334a4393f0edbfe9c89026df99da1e2 logged out


======================================================================
======================================================================
    Finished build.
======================================================================
======================================================================


Build step 'Execute shell' marked build as failure
Archiving artifacts
Sending artifact delta relative to PreCommit-TEZ-Build #939
Archived 50 artifacts
Archive block size is 32768
Received 17 blocks and 2452765 bytes
Compression is 18.5%
Took 1 sec
[description-setter] Could not determine description.
Recording test results
Email was triggered for: Failure
Sending email for trigger: Failure



###################################################################################
############################## FAILED TESTS (if any) ##############################
1 tests failed.
REGRESSION:  org.apache.tez.test.TestFaultTolerance.testBasicInputFailureWithExit

Error Message:
expected:<SUCCEEDED> but was:<FAILED>

Stack Trace:
java.lang.AssertionError: expected:<SUCCEEDED> but was:<FAILED>
	at org.junit.Assert.fail(Assert.java:88)
	at org.junit.Assert.failNotEquals(Assert.java:743)
	at org.junit.Assert.assertEquals(Assert.java:118)
	at org.junit.Assert.assertEquals(Assert.java:144)
	at org.apache.tez.test.TestFaultTolerance.runDAGAndVerify(TestFaultTolerance.java:135)
	at org.apache.tez.test.TestFaultTolerance.runDAGAndVerify(TestFaultTolerance.java:114)
	at org.apache.tez.test.TestFaultTolerance.testBasicInputFailureWithExit(TestFaultTolerance.java:248)



Mime
  • Unnamed multipart/mixed (inline, None, 0 bytes)
View raw message