tez-issues mailing list archives

Site index · List index
Message view « Date » · « Thread »
Top « Date » · « Thread »
From Apache Jenkins Server <jenk...@builds.apache.org>
Subject Failed: TEZ-2239 PreCommit Build #909
Date Wed, 22 Jul 2015 19:55:07 GMT
Jira: https://issues.apache.org/jira/browse/TEZ-2239
Build: https://builds.apache.org/job/PreCommit-TEZ-Build/909/

###################################################################################
########################## LAST 60 LINES OF THE CONSOLE ###########################
[...truncated 2696 lines...]


{color:red}-1 overall{color}.  Here are the results of testing the latest attachment
  http://issues.apache.org/jira/secure/attachment/12746607/TEZ-2239.2.patch
  against master revision c7ada82.

    {color:green}+1 @author{color}.  The patch does not contain any @author tags.

    {color:red}-1 tests included{color}.  The patch doesn't appear to include any new or modified
tests.
                        Please justify why no new tests are needed for this patch.
                        Also please list what manual steps were performed to verify this patch.

    {color:green}+1 javac{color}.  The applied patch does not increase the total number of
javac compiler warnings.

    {color:green}+1 javadoc{color}.  There were no new javadoc warning messages.

    {color:green}+1 findbugs{color}.  The patch does not introduce any new Findbugs (version
3.0.1) warnings.

    {color:green}+1 release audit{color}.  The applied patch does not increase the total number
of release audit warnings.

    {color:red}-1 core tests{color}.  The patch failed these unit tests in :
                   org.apache.tez.test.TestFaultTolerance

Test results: https://builds.apache.org/job/PreCommit-TEZ-Build/909//testReport/
Console output: https://builds.apache.org/job/PreCommit-TEZ-Build/909//console

This message is automatically generated.


======================================================================
======================================================================
    Adding comment to Jira.
======================================================================
======================================================================


Comment added.
71773ca74a536cf846ef03e431721c59ff3e21ab logged out


======================================================================
======================================================================
    Finished build.
======================================================================
======================================================================


Build step 'Execute shell' marked build as failure
Archiving artifacts
Sending artifact delta relative to PreCommit-TEZ-Build #906
Archived 47 artifacts
Archive block size is 32768
Received 10 blocks and 2579965 bytes
Compression is 11.3%
Took 0.59 sec
[description-setter] Could not determine description.
Recording test results
Email was triggered for: Failure
Sending email for trigger: Failure



###################################################################################
############################## FAILED TESTS (if any) ##############################
1 tests failed.
REGRESSION:  org.apache.tez.test.TestFaultTolerance.testMultiVersionInputFailureWithoutExit

Error Message:
expected:<SUCCEEDED> but was:<FAILED>

Stack Trace:
java.lang.AssertionError: expected:<SUCCEEDED> but was:<FAILED>
	at org.junit.Assert.fail(Assert.java:88)
	at org.junit.Assert.failNotEquals(Assert.java:743)
	at org.junit.Assert.assertEquals(Assert.java:118)
	at org.junit.Assert.assertEquals(Assert.java:144)
	at org.apache.tez.test.TestFaultTolerance.runDAGAndVerify(TestFaultTolerance.java:135)
	at org.apache.tez.test.TestFaultTolerance.runDAGAndVerify(TestFaultTolerance.java:114)
	at org.apache.tez.test.TestFaultTolerance.testMultiVersionInputFailureWithoutExit(TestFaultTolerance.java:326)



Mime
  • Unnamed multipart/mixed (inline, None, 0 bytes)
View raw message