tez-issues mailing list archives

Site index · List index
Message view « Date » · « Thread »
Top « Date » · « Thread »
From Apache Jenkins Server <jenk...@builds.apache.org>
Subject Failed: TEZ-2583 PreCommit Build #869
Date Wed, 01 Jul 2015 11:49:52 GMT
Jira: https://issues.apache.org/jira/browse/TEZ-2583
Build: https://builds.apache.org/job/PreCommit-TEZ-Build/869/

###################################################################################
########################## LAST 60 LINES OF THE CONSOLE ###########################
[...truncated 2710 lines...]



{color:red}-1 overall{color}.  Here are the results of testing the latest attachment
  http://issues.apache.org/jira/secure/attachment/12743045/TEZ-2583-1.patch
  against master revision 2073351.

    {color:green}+1 @author{color}.  The patch does not contain any @author tags.

    {color:green}+1 tests included{color}.  The patch appears to include 3 new or modified
test files.

    {color:green}+1 javac{color}.  The applied patch does not increase the total number of
javac compiler warnings.

    {color:red}-1 javadoc{color}.  The javadoc tool appears to have generated 1 warning messages.
        See https://builds.apache.org/job/PreCommit-TEZ-Build/869//artifact/patchprocess/diffJavadocWarnings.txt
for details.

    {color:green}+1 findbugs{color}.  The patch does not introduce any new Findbugs (version
3.0.1) warnings.

    {color:green}+1 release audit{color}.  The applied patch does not increase the total number
of release audit warnings.

    {color:red}-1 core tests{color}.  The patch failed these unit tests in :
                   org.apache.tez.test.TestRecovery

Test results: https://builds.apache.org/job/PreCommit-TEZ-Build/869//testReport/
Console output: https://builds.apache.org/job/PreCommit-TEZ-Build/869//console

This message is automatically generated.


======================================================================
======================================================================
    Adding comment to Jira.
======================================================================
======================================================================


Comment added.
d7d2da1a50d615301927c67a72705a44ab9a1ab3 logged out


======================================================================
======================================================================
    Finished build.
======================================================================
======================================================================


Build step 'Execute shell' marked build as failure
Archiving artifacts
Sending artifact delta relative to PreCommit-TEZ-Build #868
Archived 47 artifacts
Archive block size is 32768
Received 8 blocks and 2644944 bytes
Compression is 9.0%
Took 1.4 sec
[description-setter] Could not determine description.
Recording test results
Email was triggered for: Failure
Sending email for trigger: Failure



###################################################################################
############################## FAILED TESTS (if any) ##############################
2 tests failed.
FAILED:  org.apache.tez.test.TestRecovery.testRecovery_HashJoin

Error Message:
expected:<DAG_INITIALIZED> but was:<DAG_FINISHED>

Stack Trace:
java.lang.AssertionError: expected:<DAG_INITIALIZED> but was:<DAG_FINISHED>
	at org.junit.Assert.fail(Assert.java:88)
	at org.junit.Assert.failNotEquals(Assert.java:743)
	at org.junit.Assert.assertEquals(Assert.java:118)
	at org.junit.Assert.assertEquals(Assert.java:144)
	at org.apache.tez.test.TestRecovery.testHashJoinExample(TestRecovery.java:516)
	at org.apache.tez.test.TestRecovery.testRecovery_HashJoin(TestRecovery.java:442)


FAILED:  org.apache.tez.test.TestRecovery.testRecovery_OrderedWordCount

Error Message:
expected:<DAG_INITIALIZED> but was:<DAG_FINISHED>

Stack Trace:
java.lang.AssertionError: expected:<DAG_INITIALIZED> but was:<DAG_FINISHED>
	at org.junit.Assert.fail(Assert.java:88)
	at org.junit.Assert.failNotEquals(Assert.java:743)
	at org.junit.Assert.assertEquals(Assert.java:118)
	at org.junit.Assert.assertEquals(Assert.java:144)
	at org.apache.tez.test.TestRecovery.testOrderedWordCount(TestRecovery.java:314)
	at org.apache.tez.test.TestRecovery.testRecovery_OrderedWordCount(TestRecovery.java:276)



Mime
  • Unnamed multipart/mixed (inline, None, 0 bytes)
View raw message