tez-issues mailing list archives

Site index · List index
Message view « Date » · « Thread »
Top « Date » · « Thread »
From Apache Jenkins Server <jenk...@builds.apache.org>
Subject Failed: TEZ-2068 PreCommit Build #168
Date Wed, 11 Feb 2015 17:41:51 GMT
Jira: https://issues.apache.org/jira/browse/TEZ-2068
Build: https://builds.apache.org/job/PreCommit-TEZ-Build/168/

###################################################################################
########################## LAST 60 LINES OF THE CONSOLE ###########################
[...truncated 2426 lines...]


{color:red}-1 overall{color}.  Here are the results of testing the latest attachment
  http://issues.apache.org/jira/secure/attachment/12698126/TEZ-2068.2.patch
  against master revision b336ca0.

    {color:green}+1 @author{color}.  The patch does not contain any @author tags.

    {color:red}-1 tests included{color}.  The patch doesn't appear to include any new or modified
tests.
                        Please justify why no new tests are needed for this patch.
                        Also please list what manual steps were performed to verify this patch.

    {color:green}+1 javac{color}.  The applied patch does not increase the total number of
javac compiler warnings.

    {color:green}+1 javadoc{color}.  There were no new javadoc warning messages.

    {color:green}+1 findbugs{color}.  The patch does not introduce any new Findbugs (version
2.0.3) warnings.

    {color:green}+1 release audit{color}.  The applied patch does not increase the total number
of release audit warnings.

    {color:red}-1 core tests{color}.  The patch failed these unit tests in :
                   org.apache.tez.test.TestTezJobs

Test results: https://builds.apache.org/job/PreCommit-TEZ-Build/168//testReport/
Console output: https://builds.apache.org/job/PreCommit-TEZ-Build/168//console

This message is automatically generated.


======================================================================
======================================================================
    Adding comment to Jira.
======================================================================
======================================================================


Comment added.
4bc959f993f31db2f8e3cbef2d19a7de4fa246d2 logged out


======================================================================
======================================================================
    Finished build.
======================================================================
======================================================================


Build step 'Execute shell' marked build as failure
Archiving artifacts
Sending artifact delta relative to PreCommit-TEZ-Build #163
Archived 41 artifacts
Archive block size is 32768
Received 8 blocks and 2374844 bytes
Compression is 9.9%
Took 1.2 sec
[description-setter] Could not determine description.
Recording test results
Email was triggered for: Failure
Sending email for trigger: Failure



###################################################################################
############################## FAILED TESTS (if any) ##############################
1 tests failed.
FAILED:  org.apache.tez.test.TestTezJobs.testInvalidQueueSubmission

Error Message:
Job submission should have thrown an exception

Stack Trace:
java.lang.AssertionError: Job submission should have thrown an exception
	at org.junit.Assert.fail(Assert.java:88)
	at org.apache.tez.test.TestTezJobs.testInvalidQueueSubmission(TestTezJobs.java:699)



Mime
  • Unnamed multipart/mixed (inline, None, 0 bytes)
View raw message