tez-issues mailing list archives

Site index · List index
Message view « Date » · « Thread »
Top « Date » · « Thread »
From Apache Jenkins Server <jenk...@builds.apache.org>
Subject Failed: TEZ-1914 PreCommit Build #159
Date Tue, 10 Feb 2015 19:30:11 GMT
Jira: https://issues.apache.org/jira/browse/TEZ-1914
Build: https://builds.apache.org/job/PreCommit-TEZ-Build/159/

###################################################################################
########################## LAST 60 LINES OF THE CONSOLE ###########################
[...truncated 2434 lines...]




{color:red}-1 overall{color}.  Here are the results of testing the latest attachment
  http://issues.apache.org/jira/secure/attachment/12697838/TEZ-1914.4.patch
  against master revision 12c31ab.

    {color:green}+1 @author{color}.  The patch does not contain any @author tags.

    {color:green}+1 tests included{color}.  The patch appears to include 5 new or modified
test files.

    {color:green}+1 javac{color}.  The applied patch does not increase the total number of
javac compiler warnings.

    {color:green}+1 javadoc{color}.  There were no new javadoc warning messages.

    {color:green}+1 findbugs{color}.  The patch does not introduce any new Findbugs (version
2.0.3) warnings.

    {color:green}+1 release audit{color}.  The applied patch does not increase the total number
of release audit warnings.

    {color:red}-1 core tests{color}.  The patch failed these unit tests in :
                   org.apache.tez.test.TestTezJobs

Test results: https://builds.apache.org/job/PreCommit-TEZ-Build/159//testReport/
Console output: https://builds.apache.org/job/PreCommit-TEZ-Build/159//console

This message is automatically generated.


======================================================================
======================================================================
    Adding comment to Jira.
======================================================================
======================================================================


Comment added.
043da44a8b73ef07bf568e8cf252de60b4e56c52 logged out


======================================================================
======================================================================
    Finished build.
======================================================================
======================================================================


Build step 'Execute shell' marked build as failure
Archiving artifacts
Sending artifact delta relative to PreCommit-TEZ-Build #156
Archived 41 artifacts
Archive block size is 32768
Received 2 blocks and 2570377 bytes
Compression is 2.5%
Took 0.96 sec
[description-setter] Could not determine description.
Recording test results
Email was triggered for: Failure
Sending email for trigger: Failure



###################################################################################
############################## FAILED TESTS (if any) ##############################
1 tests failed.
FAILED:  org.apache.tez.test.TestTezJobs.testInvalidQueueSubmission

Error Message:
Job submission should have thrown an exception

Stack Trace:
java.lang.AssertionError: Job submission should have thrown an exception
	at org.junit.Assert.fail(Assert.java:88)
	at org.apache.tez.test.TestTezJobs.testInvalidQueueSubmission(TestTezJobs.java:699)



Mime
  • Unnamed multipart/mixed (inline, None, 0 bytes)
View raw message