tez-issues mailing list archives

Site index · List index
Message view « Date » · « Thread »
Top « Date » · « Thread »
From Apache Jenkins Server <jenk...@builds.apache.org>
Subject Failed: TEZ-1233 PreCommit Build #150
Date Tue, 10 Feb 2015 05:16:07 GMT
Jira: https://issues.apache.org/jira/browse/TEZ-1233
Build: https://builds.apache.org/job/PreCommit-TEZ-Build/150/

###################################################################################
########################## LAST 60 LINES OF THE CONSOLE ###########################
[...truncated 2525 lines...]




{color:red}-1 overall{color}.  Here are the results of testing the latest attachment
  http://issues.apache.org/jira/secure/attachment/12697649/TEZ-1233-2.patch
  against master revision 12c31ab.

    {color:green}+1 @author{color}.  The patch does not contain any @author tags.

    {color:green}+1 tests included{color}.  The patch appears to include 4 new or modified
test files.

    {color:green}+1 javac{color}.  The applied patch does not increase the total number of
javac compiler warnings.

    {color:green}+1 javadoc{color}.  There were no new javadoc warning messages.

    {color:green}+1 findbugs{color}.  The patch does not introduce any new Findbugs (version
2.0.3) warnings.

    {color:green}+1 release audit{color}.  The applied patch does not increase the total number
of release audit warnings.

    {color:red}-1 core tests{color}.  The patch failed these unit tests in :
                   org.apache.tez.dag.history.ats.acls.TestATSHistoryWithACLs

Test results: https://builds.apache.org/job/PreCommit-TEZ-Build/150//testReport/
Console output: https://builds.apache.org/job/PreCommit-TEZ-Build/150//console

This message is automatically generated.


======================================================================
======================================================================
    Adding comment to Jira.
======================================================================
======================================================================


Comment added.
b4d5738d9e8fbd9d0b251b6ba9999683f4970e27 logged out


======================================================================
======================================================================
    Finished build.
======================================================================
======================================================================


Build step 'Execute shell' marked build as failure
Archiving artifacts
Sending artifact delta relative to PreCommit-TEZ-Build #146
Archived 41 artifacts
Archive block size is 32768
Received 18 blocks and 2050886 bytes
Compression is 22.3%
Took 1 sec
[description-setter] Could not determine description.
Recording test results
Email was triggered for: Failure
Sending email for trigger: Failure



###################################################################################
############################## FAILED TESTS (if any) ##############################
1 tests failed.
FAILED:  org.apache.tez.dag.history.ats.acls.TestATSHistoryWithACLs.testDAGACls

Error Message:
com.google.protobuf.ServiceException: org.apache.hadoop.ipc.RemoteException(java.lang.IllegalStateException):
tez.yarn.ats.acl.dag.domain.id is set at the scope of DAG, but it is only valid in the scope
of AM
 at org.apache.tez.dag.api.TezConfiguration.validateProperty(TezConfiguration.java:1144)
 at org.apache.tez.dag.app.dag.impl.DAGImpl.<init>(DAGImpl.java:429)
 at org.apache.tez.dag.app.DAGAppMaster.createDAG(DAGAppMaster.java:768)
 at org.apache.tez.dag.app.DAGAppMaster.createDAG(DAGAppMaster.java:746)
 at org.apache.tez.dag.app.DAGAppMaster.startDAG(DAGAppMaster.java:1961)
 at org.apache.tez.dag.app.DAGAppMaster.submitDAGToAppMaster(DAGAppMaster.java:1095)
 at org.apache.tez.dag.api.client.DAGClientHandler.submitDAG(DAGClientHandler.java:113)
 at org.apache.tez.dag.api.client.rpc.DAGClientAMProtocolBlockingPBServerImpl.submitDAG(DAGClientAMProtocolBlockingPBServerImpl.java:162)
 at org.apache.tez.dag.api.client.rpc.DAGClientAMProtocolRPC$DAGClientAMProtocol$2.callBlockingMethod(DAGClientAMProtocolRPC.java:7381)
 at org.apache.hadoop.ipc.ProtobufRpcEngine$Server$ProtoBufRpcInvoker.call(ProtobufRpcEngine.java:619)
 at org.apache.hadoop.ipc.RPC$Server.call(RPC.java:962)
 at org.apache.hadoop.ipc.Server$Handler$1.run(Server.java:2039)
 at org.apache.hadoop.ipc.Server$Handler$1.run(Server.java:2035)
 at java.security.AccessController.doPrivileged(Native Method)
 at javax.security.auth.Subject.doAs(Subject.java:415)
 at org.apache.hadoop.security.UserGroupInformation.doAs(UserGroupInformation.java:1628)
 at org.apache.hadoop.ipc.Server$Handler.run(Server.java:2033)


Stack Trace:
org.apache.tez.dag.api.TezException: com.google.protobuf.ServiceException: org.apache.hadoop.ipc.RemoteException(java.lang.IllegalStateException):
tez.yarn.ats.acl.dag.domain.id is set at the scope of DAG, but it is only valid in the scope
of AM
	at org.apache.tez.dag.api.TezConfiguration.validateProperty(TezConfiguration.java:1144)
	at org.apache.tez.dag.app.dag.impl.DAGImpl.<init>(DAGImpl.java:429)
	at org.apache.tez.dag.app.DAGAppMaster.createDAG(DAGAppMaster.java:768)
	at org.apache.tez.dag.app.DAGAppMaster.createDAG(DAGAppMaster.java:746)
	at org.apache.tez.dag.app.DAGAppMaster.startDAG(DAGAppMaster.java:1961)
	at org.apache.tez.dag.app.DAGAppMaster.submitDAGToAppMaster(DAGAppMaster.java:1095)
	at org.apache.tez.dag.api.client.DAGClientHandler.submitDAG(DAGClientHandler.java:113)
	at org.apache.tez.dag.api.client.rpc.DAGClientAMProtocolBlockingPBServerImpl.submitDAG(DAGClientAMProtocolBlockingPBServerImpl.java:162)
	at org.apache.tez.dag.api.client.rpc.DAGClientAMProtocolRPC$DAGClientAMProtocol$2.callBlockingMethod(DAGClientAMProtocolRPC.java:7381)
	at org.apache.hadoop.ipc.ProtobufRpcEngine$Server$ProtoBufRpcInvoker.call(ProtobufRpcEngine.java:619)
	at org.apache.hadoop.ipc.RPC$Server.call(RPC.java:962)
	at org.apache.hadoop.ipc.Server$Handler$1.run(Server.java:2039)
	at org.apache.hadoop.ipc.Server$Handler$1.run(Server.java:2035)
	at java.security.AccessController.doPrivileged(Native Method)
	at javax.security.auth.Subject.doAs(Subject.java:415)
	at org.apache.hadoop.security.UserGroupInformation.doAs(UserGroupInformation.java:1628)
	at org.apache.hadoop.ipc.Server$Handler.run(Server.java:2033)

	at org.apache.hadoop.ipc.Client.call(Client.java:1468)
	at org.apache.hadoop.ipc.Client.call(Client.java:1399)
	at org.apache.hadoop.ipc.ProtobufRpcEngine$Invoker.invoke(ProtobufRpcEngine.java:232)
	at com.sun.proxy.$Proxy109.submitDAG(Unknown Source)
	at org.apache.tez.client.TezClient.submitDAGSession(TezClient.java:444)
	at org.apache.tez.client.TezClient.submitDAG(TezClient.java:381)
	at org.apache.tez.dag.history.ats.acls.TestATSHistoryWithACLs.testDAGACls(TestATSHistoryWithACLs.java:268)



Mime
  • Unnamed multipart/mixed (inline, None, 0 bytes)
View raw message