tapestry-dev mailing list archives

Site index · List index
Message view « Date » · « Thread »
Top « Date » · « Thread »
From Apache Jenkins Server <jenk...@builds.apache.org>
Subject Build failed in Jenkins: tapestry-trunk-freestyle #1526
Date Thu, 05 Nov 2015 11:00:39 GMT
See <https://builds.apache.org/job/tapestry-trunk-freestyle/1526/changes>

Changes:

[jochen.kemnade] TAP5-2204: when checking if the model parameter is bound, access the

------------------------------------------
[...truncated 138 lines...]
:tapestry-ioc:processResources
:tapestry-ioc:classes
:tapestry-ioc:jar
:tapestry-json:compileJava
:tapestry-json:compileGroovy UP-TO-DATE
:tapestry-json:processResources UP-TO-DATE
:tapestry-json:classes
:tapestry-json:jar
:tapestry-core:compileJavaNote: Some input files use or override a deprecated API.
Note: Recompile with -Xlint:deprecation for details.
Note: Some input files use unchecked or unsafe operations.
Note: Recompile with -Xlint:unchecked for details.

:tapestry-core:compileGroovy UP-TO-DATE
:tapestry-core:preprocessCoffeeScript
:tapestry-core:compileProcessedCoffeescript
:tapestry-core:processResources
:tapestry-core:classes
:tapestry-core:jar
:tapestry-hibernate-core:compileJavaNote: Some input files use or override a deprecated API.
Note: Recompile with -Xlint:deprecation for details.

:tapestry-hibernate-core:compileGroovy UP-TO-DATE
:tapestry-hibernate-core:processResources UP-TO-DATE
:tapestry-hibernate-core:classes
:tapestry-hibernate-core:jar
:tapestry-javadoc:compileJava
:tapestry-javadoc:compileGroovy UP-TO-DATE
:tapestry-javadoc:processResources UP-TO-DATE
:tapestry-javadoc:classes
:tapestry-javadoc:jar
:aggregateJavadocwarning: org/jsr107/ri/annotations/InterceptorType.class(org/jsr107/ri/annotations:InterceptorType.class):
major version 51 is newer than 50, the highest major version supported by this compiler.
It is recommended that the compiler be upgraded.
warning: org/jsr107/ri/annotations/AbstractInternalCacheKeyInvocationContext.class(org/jsr107/ri/annotations:AbstractInternalCacheKeyInvocationContext.class):
major version 51 is newer than 50, the highest major version supported by this compiler.
It is recommended that the compiler be upgraded.
warning: org/jsr107/ri/annotations/StaticCacheKeyInvocationContext.class(org/jsr107/ri/annotations:StaticCacheKeyInvocationContext.class):
major version 51 is newer than 50, the highest major version supported by this compiler.
It is recommended that the compiler be upgraded.
warning: org/jsr107/ri/annotations/InternalCacheKeyInvocationContext.class(org/jsr107/ri/annotations:InternalCacheKeyInvocationContext.class):
major version 51 is newer than 50, the highest major version supported by this compiler.
It is recommended that the compiler be upgraded.
warning: org/jsr107/ri/annotations/AbstractInternalCacheInvocationContext.class(org/jsr107/ri/annotations:AbstractInternalCacheInvocationContext.class):
major version 51 is newer than 50, the highest major version supported by this compiler.
It is recommended that the compiler be upgraded.
warning: org/jsr107/ri/annotations/InternalCacheInvocationContext.class(org/jsr107/ri/annotations:InternalCacheInvocationContext.class):
major version 51 is newer than 50, the highest major version supported by this compiler.
It is recommended that the compiler be upgraded.
warning: org/jsr107/ri/annotations/AbstractCachePutInterceptor.class(org/jsr107/ri/annotations:AbstractCachePutInterceptor.class):
major version 51 is newer than 50, the highest major version supported by this compiler.
It is recommended that the compiler be upgraded.
warning: org/jsr107/ri/annotations/CacheContextSource.class(org/jsr107/ri/annotations:CacheContextSource.class):
major version 51 is newer than 50, the highest major version supported by this compiler.
It is recommended that the compiler be upgraded.
warning: org/jsr107/ri/annotations/AbstractKeyedCacheInterceptor.class(org/jsr107/ri/annotations:AbstractKeyedCacheInterceptor.class):
major version 51 is newer than 50, the highest major version supported by this compiler.
It is recommended that the compiler be upgraded.
warning: org/jsr107/ri/annotations/AbstractCacheInterceptor.class(org/jsr107/ri/annotations:AbstractCacheInterceptor.class):
major version 51 is newer than 50, the highest major version supported by this compiler.
It is recommended that the compiler be upgraded.
warning: org/jsr107/ri/annotations/AbstractCacheLookupUtil.class(org/jsr107/ri/annotations:AbstractCacheLookupUtil.class):
major version 51 is newer than 50, the highest major version supported by this compiler.
It is recommended that the compiler be upgraded.
warning: org/jsr107/ri/annotations/StaticCacheInvocationContext.class(org/jsr107/ri/annotations:StaticCacheInvocationContext.class):
major version 51 is newer than 50, the highest major version supported by this compiler.
It is recommended that the compiler be upgraded.
warning: org/jsr107/ri/annotations/AbstractCacheResultInterceptor.class(org/jsr107/ri/annotations:AbstractCacheResultInterceptor.class):
major version 51 is newer than 50, the highest major version supported by this compiler.
It is recommended that the compiler be upgraded.
warning: org/jsr107/ri/annotations/AbstractCacheRemoveEntryInterceptor.class(org/jsr107/ri/annotations:AbstractCacheRemoveEntryInterceptor.class):
major version 51 is newer than 50, the highest major version supported by this compiler.
It is recommended that the compiler be upgraded.
warning: org/jsr107/ri/annotations/AbstractCacheRemoveAllInterceptor.class(org/jsr107/ri/annotations:AbstractCacheRemoveAllInterceptor.class):
major version 51 is newer than 50, the highest major version supported by this compiler.
It is recommended that the compiler be upgraded.
warning: org/jsr107/ri/annotations/DefaultCacheKeyGenerator.class(org/jsr107/ri/annotations:DefaultCacheKeyGenerator.class):
major version 51 is newer than 50, the highest major version supported by this compiler.
It is recommended that the compiler be upgraded.
warning: org/jsr107/ri/annotations/DefaultCacheResolverFactory.class(org/jsr107/ri/annotations:DefaultCacheResolverFactory.class):
major version 51 is newer than 50, the highest major version supported by this compiler.
It is recommended that the compiler be upgraded.
/x1/jenkins/jenkins-slave/workspace/tapestry-trunk-freestyle/tapestry-core/src/main/java/org/apache/tapestry5/services/ComponentClassResolver.java:185:
warning - @return tag has no arguments.
/x1/jenkins/jenkins-slave/workspace/tapestry-trunk-freestyle/tapestry-core/src/main/java/org/apache/tapestry5/services/ValueLabelProvider.java:31:
warning - @return tag has no arguments.
warning: org/jsr107/ri/annotations/AbstractCacheLookupUtil$ParameterDetails.class(org/jsr107/ri/annotations:AbstractCacheLookupUtil$ParameterDetails.class):
major version 51 is newer than 50, the highest major version supported by this compiler.
It is recommended that the compiler be upgraded.
warning: org/jsr107/ri/annotations/AbstractCacheLookupUtil$MethodKey.class(org/jsr107/ri/annotations:AbstractCacheLookupUtil$MethodKey.class):
major version 51 is newer than 50, the highest major version supported by this compiler.
It is recommended that the compiler be upgraded.
warning: org/jsr107/ri/annotations/CachePutMethodDetails.class(org/jsr107/ri/annotations:CachePutMethodDetails.class):
major version 51 is newer than 50, the highest major version supported by this compiler.
It is recommended that the compiler be upgraded.
warning: org/jsr107/ri/annotations/StaticCacheResultInvocationContext.class(org/jsr107/ri/annotations:StaticCacheResultInvocationContext.class):
major version 51 is newer than 50, the highest major version supported by this compiler.
It is recommended that the compiler be upgraded.
warning: org/jsr107/ri/annotations/DefaultGeneratedCacheKey.class(org/jsr107/ri/annotations:DefaultGeneratedCacheKey.class):
major version 51 is newer than 50, the highest major version supported by this compiler.
It is recommended that the compiler be upgraded.
warning: org/jsr107/ri/annotations/DefaultCacheResolver.class(org/jsr107/ri/annotations:DefaultCacheResolver.class):
major version 51 is newer than 50, the highest major version supported by this compiler.
It is recommended that the compiler be upgraded.
warning: org/jsr107/ri/annotations/ClassFilter.class(org/jsr107/ri/annotations:ClassFilter.class):
major version 51 is newer than 50, the highest major version supported by this compiler.
It is recommended that the compiler be upgraded.
warning: org/jsr107/ri/annotations/CacheResultMethodDetails.class(org/jsr107/ri/annotations:CacheResultMethodDetails.class):
major version 51 is newer than 50, the highest major version supported by this compiler.
It is recommended that the compiler be upgraded.
warning: org/jsr107/ri/annotations/CacheRemoveEntryMethodDetails.class(org/jsr107/ri/annotations:CacheRemoveEntryMethodDetails.class):
major version 51 is newer than 50, the highest major version supported by this compiler.
It is recommended that the compiler be upgraded.
warning: org/jsr107/ri/annotations/CacheRemoveAllMethodDetails.class(org/jsr107/ri/annotations:CacheRemoveAllMethodDetails.class):
major version 51 is newer than 50, the highest major version supported by this compiler.
It is recommended that the compiler be upgraded.
warning: org/jsr107/ri/annotations/CacheParameterDetails.class(org/jsr107/ri/annotations:CacheParameterDetails.class):
major version 51 is newer than 50, the highest major version supported by this compiler.
It is recommended that the compiler be upgraded.
warning: org/jsr107/ri/annotations/CacheMethodDetailsImpl.class(org/jsr107/ri/annotations:CacheMethodDetailsImpl.class):
major version 51 is newer than 50, the highest major version supported by this compiler.
It is recommended that the compiler be upgraded.
warning: org/jsr107/ri/annotations/CacheInvocationParameterImpl.class(org/jsr107/ri/annotations:CacheInvocationParameterImpl.class):
major version 51 is newer than 50, the highest major version supported by this compiler.
It is recommended that the compiler be upgraded.
warning: org/jsr107/ri/annotations/AbstractStaticCacheInvocationContext.class(org/jsr107/ri/annotations:AbstractStaticCacheInvocationContext.class):
major version 51 is newer than 50, the highest major version supported by this compiler.
It is recommended that the compiler be upgraded.

33 warnings
:beanmodel:generateTestGrammarSource UP-TO-DATE
:beanmodel:compileTestJava UP-TO-DATE
:beanmodel:compileTestGroovy UP-TO-DATE
:beanmodel:processTestResources UP-TO-DATE
:beanmodel:testClasses UP-TO-DATE
:beanmodel:test UP-TO-DATE
:commons:compileTestJava UP-TO-DATE
:commons:compileTestGroovy UP-TO-DATE
:commons:processTestResources UP-TO-DATE
:commons:testClasses UP-TO-DATE
:commons:test UP-TO-DATE
:plastic:compileTestJava
:plastic:compileTestGroovy
:plastic:processTestResources
:plastic:testClasses
:plastic:test
100 tests executed
:tapestry-beanvalidator:compileCoffeeScript
:tapestry-beanvalidator:compileJava
:tapestry-beanvalidator:compileGroovy UP-TO-DATE
:tapestry-beanvalidator:processResources UP-TO-DATE
:tapestry-beanvalidator:classes
:tapestry-beanvalidator:compileTestJava
:tapestry-beanvalidator:compileTestGroovy UP-TO-DATE
:tapestry-beanvalidator:processTestResources
:tapestry-beanvalidator:testClasses
:tapestry-beanvalidator:test
:tapestry-clojure:compileJava
:tapestry-clojure:compileGroovy UP-TO-DATE
:tapestry-clojure:processResources UP-TO-DATE
:tapestry-clojure:classes
:tapestry-clojure:compileTestJava
:tapestry-clojure:compileTestGroovy
:tapestry-clojure:processTestResources
:tapestry-clojure:testClasses
:tapestry-clojure:test
:tapestry-core:compileTestCoffeeScript
:tapestry-core:compileTestJavaNote: Some input files use or override a deprecated API.
Note: Recompile with -Xlint:deprecation for details.
Note: Some input files use unchecked or unsafe operations.
Note: Recompile with -Xlint:unchecked for details.

:tapestry-core:compileTestGroovy
:tapestry-core:processTestResources
:tapestry-core:testClasses
:tapestry-core:test

Tapestry Core > Component Unit Tests > org.apache.tapestry5.corelib.components.SelectTest.submitted_option_found_when_secure_always
FAILED
    java.lang.NullPointerException
        at org.apache.tapestry5.corelib.components.Select.toValue(Select.java:298)
        at org.apache.tapestry5.corelib.components.Select.processSubmission(Select.java:205)
        at org.apache.tapestry5.corelib.components.SelectTest.checkSubmittedOption(SelectTest.java:535)
        at org.apache.tapestry5.corelib.components.SelectTest.submitted_option_found_when_secure_always(SelectTest.java:428)

Tapestry Core > Component Unit Tests > org.apache.tapestry5.corelib.components.SelectTest.submitted_option_found_when_secure_auto
FAILED
    java.lang.NullPointerException
        at org.apache.tapestry5.corelib.components.Select.toValue(Select.java:298)
        at org.apache.tapestry5.corelib.components.Select.processSubmission(Select.java:205)
        at org.apache.tapestry5.corelib.components.SelectTest.checkSubmittedOption(SelectTest.java:535)
        at org.apache.tapestry5.corelib.components.SelectTest.submitted_option_found_when_secure_auto(SelectTest.java:468)

Tapestry Core > Component Unit Tests > org.apache.tapestry5.corelib.components.SelectTest.submitted_option_matches_against_value_encoded_option_model_value
FAILED
    java.lang.NullPointerException
        at org.apache.tapestry5.corelib.components.Select.toValue(Select.java:298)
        at org.apache.tapestry5.corelib.components.Select.processSubmission(Select.java:205)
        at org.apache.tapestry5.corelib.components.SelectTest.submitted_option_matches_against_value_encoded_option_model_value(SelectTest.java:580)

Tapestry Core > Component Unit Tests > org.apache.tapestry5.corelib.components.SelectTest.submitted_option_not_found_when_secure_always
FAILED
    java.lang.NullPointerException
        at org.apache.tapestry5.corelib.components.Select.toValue(Select.java:298)
        at org.apache.tapestry5.corelib.components.Select.processSubmission(Select.java:205)
        at org.apache.tapestry5.corelib.components.SelectTest.checkSubmittedOption(SelectTest.java:535)
        at org.apache.tapestry5.corelib.components.SelectTest.submitted_option_not_found_when_secure_always(SelectTest.java:438)

Tapestry Core > Component Unit Tests > org.apache.tapestry5.corelib.components.SelectTest.submitted_option_ok_when_secure_auto
FAILED
    java.lang.NullPointerException
        at org.apache.tapestry5.corelib.components.Select.toValue(Select.java:298)
        at org.apache.tapestry5.corelib.components.Select.processSubmission(Select.java:205)
        at org.apache.tapestry5.corelib.components.SelectTest.checkSubmittedOption(SelectTest.java:535)
        at org.apache.tapestry5.corelib.components.SelectTest.submitted_option_ok_when_secure_auto(SelectTest.java:478)

Tapestry Core > Component Unit Tests > org.apache.tapestry5.corelib.components.SelectTest.submitted_option_ok_when_secure_never
FAILED
    java.lang.NullPointerException
        at org.apache.tapestry5.corelib.components.Select.toValue(Select.java:298)
        at org.apache.tapestry5.corelib.components.Select.processSubmission(Select.java:205)
        at org.apache.tapestry5.corelib.components.SelectTest.checkSubmittedOption(SelectTest.java:535)
        at org.apache.tapestry5.corelib.components.SelectTest.submitted_option_ok_when_secure_never(SelectTest.java:448)

Tapestry Core > Component Unit Tests > org.apache.tapestry5.corelib.components.SelectTest.submitted_option_ok_when_secure_never_no_model
FAILED
    java.lang.NullPointerException
        at org.apache.tapestry5.corelib.components.Select.toValue(Select.java:298)
        at org.apache.tapestry5.corelib.components.Select.processSubmission(Select.java:205)
        at org.apache.tapestry5.corelib.components.SelectTest.checkSubmittedOption(SelectTest.java:535)
        at org.apache.tapestry5.corelib.components.SelectTest.submitted_option_ok_when_secure_never_no_model(SelectTest.java:458)
100 tests executed
200 tests executed
300 tests executed
400 tests executed
500 tests executed
600 tests executed
700 tests executed
800 tests executed
900 tests executed
1000 tests executed
1100 tests executed
1200 tests executed
1300 tests executed

Tapestry Core > Core Integration Tests > org.apache.tapestry5.integration.app1.CoreBehaviorsTests.context_lost_on_secure_page_redirect
FAILED
    com.thoughtworks.selenium.SeleniumException: Timed out after 30000ms
        at com.thoughtworks.selenium.HttpCommandProcessor.throwAssertionFailureExceptionOrError(HttpCommandProcessor.java:111)
        at com.thoughtworks.selenium.HttpCommandProcessor.doCommand(HttpCommandProcessor.java:105)
        at org.apache.tapestry5.test.ErrorReportingCommandProcessor.doCommand(ErrorReportingCommandProcessor.java:91)
        at com.thoughtworks.selenium.DefaultSelenium.open(DefaultSelenium.java:372)
        at org.apache.tapestry5.test.SeleniumTestCase.open(SeleniumTestCase.java:1106)
        at org.apache.tapestry5.integration.app1.CoreBehaviorsTests.context_lost_on_secure_page_redirect(CoreBehaviorsTests.java:1659)

Tapestry Core > Core Integration Tests > org.apache.tapestry5.integration.app1.CoreBehaviorsTests.secure_page_access
FAILED
    com.thoughtworks.selenium.SeleniumException: Timed out after 15000ms
        at com.thoughtworks.selenium.HttpCommandProcessor.throwAssertionFailureExceptionOrError(HttpCommandProcessor.java:111)
        at com.thoughtworks.selenium.HttpCommandProcessor.doCommand(HttpCommandProcessor.java:105)
        at org.apache.tapestry5.test.ErrorReportingCommandProcessor.doCommand(ErrorReportingCommandProcessor.java:91)
        at com.thoughtworks.selenium.DefaultSelenium.waitForPageToLoad(DefaultSelenium.java:681)
        at org.apache.tapestry5.test.SeleniumTestCase.waitForPageToLoad(SeleniumTestCase.java:1333)
        at org.apache.tapestry5.test.SeleniumTestCase.waitForPageToLoad(SeleniumTestCase.java:1529)
        at org.apache.tapestry5.test.SeleniumTestCase.clickAndWait(SeleniumTestCase.java:1520)
        at org.apache.tapestry5.test.SeleniumTestCase.openLinks(SeleniumTestCase.java:1593)
        at org.apache.tapestry5.integration.app1.CoreBehaviorsTests.secure_page_access(CoreBehaviorsTests.java:1486)
1400 tests executed
1500 tests executed

1532 tests completed, 9 failed
:tapestry-core:test FAILED

FAILURE: Build failed with an exception.

* What went wrong:
Execution failed for task ':tapestry-core:test'.
> There were failing tests. See the report at: file:///x1/jenkins/jenkins-slave/workspace/tapestry-trunk-freestyle/tapestry-core/build/reports/tests/index.html

* Try:
Run with --stacktrace option to get the stack trace. Run with --info or --debug option to
get more log output.

BUILD FAILED

Total time: 29 mins 43.717 secs
Build step 'Execute shell' marked build as failure
Recording test results
TestNG Reports Processing: START
Looking for TestNG results report in workspace using pattern: **/build/reports/tests/testng-results.xml
Did not find any matching files.
Updating TAP5-2204

---------------------------------------------------------------------
To unsubscribe, e-mail: dev-unsubscribe@tapestry.apache.org
For additional commands, e-mail: dev-help@tapestry.apache.org


Mime
View raw message