tapestry-dev mailing list archives

Site index · List index
Message view « Date » · « Thread »
Top « Date » · « Thread »
From Apache Jenkins Server <jenk...@builds.apache.org>
Subject Build failed in Jenkins: tapestry-trunk-freestyle #1351
Date Mon, 24 Nov 2014 23:30:28 GMT
See <https://builds.apache.org/job/tapestry-trunk-freestyle/1351/changes>

Changes:

[hlship] Fix a typo

------------------------------------------
[...truncated 129 lines...]
:tapestry-hibernate-core:compileJavaNote: Some input files use or override a deprecated API.
Note: Recompile with -Xlint:deprecation for details.

:tapestry-hibernate-core:compileGroovy UP-TO-DATE
:tapestry-hibernate-core:processResources UP-TO-DATE
:tapestry-hibernate-core:classes
:tapestry-hibernate-core:jar
:tapestry-javadoc:compileJava
:tapestry-javadoc:compileGroovy UP-TO-DATE
:tapestry-javadoc:processResources UP-TO-DATE
:tapestry-javadoc:classes
:tapestry-javadoc:jar
:aggregateJavadocwarning: org/jsr107/ri/annotations/InterceptorType.class(org/jsr107/ri/annotations:InterceptorType.class):
major version 51 is newer than 50, the highest major version supported by this compiler.
It is recommended that the compiler be upgraded.
warning: org/jsr107/ri/annotations/AbstractInternalCacheKeyInvocationContext.class(org/jsr107/ri/annotations:AbstractInternalCacheKeyInvocationContext.class):
major version 51 is newer than 50, the highest major version supported by this compiler.
It is recommended that the compiler be upgraded.
warning: org/jsr107/ri/annotations/StaticCacheKeyInvocationContext.class(org/jsr107/ri/annotations:StaticCacheKeyInvocationContext.class):
major version 51 is newer than 50, the highest major version supported by this compiler.
It is recommended that the compiler be upgraded.
warning: org/jsr107/ri/annotations/InternalCacheKeyInvocationContext.class(org/jsr107/ri/annotations:InternalCacheKeyInvocationContext.class):
major version 51 is newer than 50, the highest major version supported by this compiler.
It is recommended that the compiler be upgraded.
warning: org/jsr107/ri/annotations/AbstractInternalCacheInvocationContext.class(org/jsr107/ri/annotations:AbstractInternalCacheInvocationContext.class):
major version 51 is newer than 50, the highest major version supported by this compiler.
It is recommended that the compiler be upgraded.
warning: org/jsr107/ri/annotations/InternalCacheInvocationContext.class(org/jsr107/ri/annotations:InternalCacheInvocationContext.class):
major version 51 is newer than 50, the highest major version supported by this compiler.
It is recommended that the compiler be upgraded.
warning: org/jsr107/ri/annotations/AbstractCachePutInterceptor.class(org/jsr107/ri/annotations:AbstractCachePutInterceptor.class):
major version 51 is newer than 50, the highest major version supported by this compiler.
It is recommended that the compiler be upgraded.
warning: org/jsr107/ri/annotations/CacheContextSource.class(org/jsr107/ri/annotations:CacheContextSource.class):
major version 51 is newer than 50, the highest major version supported by this compiler.
It is recommended that the compiler be upgraded.
warning: org/jsr107/ri/annotations/AbstractKeyedCacheInterceptor.class(org/jsr107/ri/annotations:AbstractKeyedCacheInterceptor.class):
major version 51 is newer than 50, the highest major version supported by this compiler.
It is recommended that the compiler be upgraded.
warning: org/jsr107/ri/annotations/AbstractCacheInterceptor.class(org/jsr107/ri/annotations:AbstractCacheInterceptor.class):
major version 51 is newer than 50, the highest major version supported by this compiler.
It is recommended that the compiler be upgraded.
warning: org/jsr107/ri/annotations/AbstractCacheLookupUtil.class(org/jsr107/ri/annotations:AbstractCacheLookupUtil.class):
major version 51 is newer than 50, the highest major version supported by this compiler.
It is recommended that the compiler be upgraded.
warning: org/jsr107/ri/annotations/StaticCacheInvocationContext.class(org/jsr107/ri/annotations:StaticCacheInvocationContext.class):
major version 51 is newer than 50, the highest major version supported by this compiler.
It is recommended that the compiler be upgraded.
warning: org/jsr107/ri/annotations/AbstractCacheResultInterceptor.class(org/jsr107/ri/annotations:AbstractCacheResultInterceptor.class):
major version 51 is newer than 50, the highest major version supported by this compiler.
It is recommended that the compiler be upgraded.
warning: org/jsr107/ri/annotations/AbstractCacheRemoveEntryInterceptor.class(org/jsr107/ri/annotations:AbstractCacheRemoveEntryInterceptor.class):
major version 51 is newer than 50, the highest major version supported by this compiler.
It is recommended that the compiler be upgraded.
warning: org/jsr107/ri/annotations/AbstractCacheRemoveAllInterceptor.class(org/jsr107/ri/annotations:AbstractCacheRemoveAllInterceptor.class):
major version 51 is newer than 50, the highest major version supported by this compiler.
It is recommended that the compiler be upgraded.
warning: org/jsr107/ri/annotations/DefaultCacheKeyGenerator.class(org/jsr107/ri/annotations:DefaultCacheKeyGenerator.class):
major version 51 is newer than 50, the highest major version supported by this compiler.
It is recommended that the compiler be upgraded.
warning: org/jsr107/ri/annotations/DefaultCacheResolverFactory.class(org/jsr107/ri/annotations:DefaultCacheResolverFactory.class):
major version 51 is newer than 50, the highest major version supported by this compiler.
It is recommended that the compiler be upgraded.
/x1/jenkins/jenkins-slave/workspace/tapestry-trunk-freestyle/tapestry-core/src/main/java/org/apache/tapestry5/services/ComponentClassResolver.java:187:
warning - @return tag has no arguments.
/x1/jenkins/jenkins-slave/workspace/tapestry-trunk-freestyle/tapestry-core/src/main/java/org/apache/tapestry5/services/ValueLabelProvider.java:31:
warning - @return tag has no arguments.
/x1/jenkins/jenkins-slave/workspace/tapestry-trunk-freestyle/tapestry-core/src/main/java/org/apache/tapestry5/internal/services/FormControlNameManager.java:40:
warning - @return tag has no arguments.
/x1/jenkins/jenkins-slave/workspace/tapestry-trunk-freestyle/tapestry-core/src/main/java/org/apache/tapestry5/internal/services/FormControlNameManager.java:40:
warning - @param argument "string" is not a parameter name.
/x1/jenkins/jenkins-slave/workspace/tapestry-trunk-freestyle/tapestry-core/src/main/java/org/apache/tapestry5/internal/services/UnknownActivationContextHandler.java:33:
warning - Tag @see:illegal character: "58" in "http://issues.apache.org/jira/browse/TAP5-2070"
/x1/jenkins/jenkins-slave/workspace/tapestry-trunk-freestyle/tapestry-core/src/main/java/org/apache/tapestry5/internal/services/UnknownActivationContextHandler.java:33:
warning - Tag @see:illegal character: "47" in "http://issues.apache.org/jira/browse/TAP5-2070"
/x1/jenkins/jenkins-slave/workspace/tapestry-trunk-freestyle/tapestry-core/src/main/java/org/apache/tapestry5/internal/services/UnknownActivationContextHandler.java:33:
warning - Tag @see:illegal character: "47" in "http://issues.apache.org/jira/browse/TAP5-2070"
/x1/jenkins/jenkins-slave/workspace/tapestry-trunk-freestyle/tapestry-core/src/main/java/org/apache/tapestry5/internal/services/UnknownActivationContextHandler.java:33:
warning - Tag @see:illegal character: "47" in "http://issues.apache.org/jira/browse/TAP5-2070"
/x1/jenkins/jenkins-slave/workspace/tapestry-trunk-freestyle/tapestry-core/src/main/java/org/apache/tapestry5/internal/services/UnknownActivationContextHandler.java:33:
warning - Tag @see:illegal character: "47" in "http://issues.apache.org/jira/browse/TAP5-2070"
/x1/jenkins/jenkins-slave/workspace/tapestry-trunk-freestyle/tapestry-core/src/main/java/org/apache/tapestry5/internal/services/UnknownActivationContextHandler.java:33:
warning - Tag @see:illegal character: "47" in "http://issues.apache.org/jira/browse/TAP5-2070"
/x1/jenkins/jenkins-slave/workspace/tapestry-trunk-freestyle/tapestry-core/src/main/java/org/apache/tapestry5/internal/services/UnknownActivationContextHandler.java:33:
warning - Tag @see:illegal character: "45" in "http://issues.apache.org/jira/browse/TAP5-2070"
/x1/jenkins/jenkins-slave/workspace/tapestry-trunk-freestyle/tapestry-core/src/main/java/org/apache/tapestry5/internal/services/UnknownActivationContextHandler.java:33:
warning - Tag @see: reference not found: http://issues.apache.org/jira/browse/TAP5-2070
/x1/jenkins/jenkins-slave/workspace/tapestry-trunk-freestyle/tapestry-core/src/main/java/org/apache/tapestry5/ComponentResources.java:143:
warning - Tag @see: can't find getBindingGenericType() in org.apache.tapestry5.Binding
/x1/jenkins/jenkins-slave/workspace/tapestry-trunk-freestyle/tapestry-core/src/main/java/org/apache/tapestry5/services/ComponentOverride.java:29:
warning - Tag @see: reference not found: org.apache.tapestry5.services.ComponentClassResolver.
/x1/jenkins/jenkins-slave/workspace/tapestry-trunk-freestyle/tapestry-core/src/main/java/org/apache/tapestry5/services/LibraryMapping.java:80:
warning - Tag @link: can't find getLibraryName() in org.apache.tapestry5.services.LibraryMapping
/x1/jenkins/jenkins-slave/workspace/tapestry-trunk-freestyle/tapestry-core/src/main/java/org/apache/tapestry5/services/PartialTemplateRenderer.java:64:
warning - @param argument "renderCommand" is not a parameter name.
/x1/jenkins/jenkins-slave/workspace/tapestry-trunk-freestyle/tapestry-core/src/main/java/org/apache/tapestry5/model/ComponentModel.java:224:
warning - Tag @see:illegal character: "123" in "{@link MutableComponentModel.doHandleActivationEventContext()}"
/x1/jenkins/jenkins-slave/workspace/tapestry-trunk-freestyle/tapestry-core/src/main/java/org/apache/tapestry5/model/ComponentModel.java:224:
warning - Tag @see:illegal character: "64" in "{@link MutableComponentModel.doHandleActivationEventContext()}"
/x1/jenkins/jenkins-slave/workspace/tapestry-trunk-freestyle/tapestry-core/src/main/java/org/apache/tapestry5/model/ComponentModel.java:224:
warning - Tag @link: reference not found: org.apache.tapestry5.EventConstants.ACTIVATE
/x1/jenkins/jenkins-slave/workspace/tapestry-trunk-freestyle/tapestry-core/src/main/java/org/apache/tapestry5/model/ComponentModel.java:224:
warning - Tag @link: reference not found: org.apache.tapestry5.EventConstants.ACTIVATE
/x1/jenkins/jenkins-slave/workspace/tapestry-trunk-freestyle/tapestry-core/src/main/java/org/apache/tapestry5/model/ComponentModel.java:224:
warning - Tag @see: reference not found: {@link MutableComponentModel.doHandleActivationEventContext()}
/x1/jenkins/jenkins-slave/workspace/tapestry-trunk-freestyle/tapestry-core/src/main/java/org/apache/tapestry5/model/MutableComponentModel.java:135:
warning - Tag @link: reference not found: org.apache.tapestry5.EventConstants.ACTIVATE
/x1/jenkins/jenkins-slave/workspace/tapestry-trunk-freestyle/tapestry-core/src/main/java/org/apache/tapestry5/model/MutableComponentModel.java:135:
warning - Tag @link: reference not found: org.apache.tapestry5.EventConstants.ACTIVATE
/x1/jenkins/jenkins-slave/workspace/tapestry-trunk-freestyle/tapestry-core/src/main/java/org/apache/tapestry5/model/MutableComponentModel.java:135:
warning - Tag @link: reference not found: org.apache.tapestry5.EventConstants.ACTIVATE
/x1/jenkins/jenkins-slave/workspace/tapestry-trunk-freestyle/tapestry-core/src/main/java/org/apache/tapestry5/model/ComponentModel.java:224:
warning - Tag @link: reference not found: org.apache.tapestry5.EventConstants.ACTIVATE
/x1/jenkins/jenkins-slave/workspace/tapestry-trunk-freestyle/tapestry-core/src/main/java/org/apache/tapestry5/model/MutableComponentModel.java:135:
warning - Tag @link: reference not found: org.apache.tapestry5.EventConstants.ACTIVATE
/x1/jenkins/jenkins-slave/workspace/tapestry-trunk-freestyle/tapestry-core/src/main/java/org/apache/tapestry5/model/ComponentModel.java:224:
warning - Tag @link: reference not found: org.apache.tapestry5.EventConstants.ACTIVATE
/x1/jenkins/jenkins-slave/workspace/tapestry-trunk-freestyle/tapestry-core/src/main/java/org/apache/tapestry5/model/ComponentModel.java:224:
warning - Tag @link: missing '#': "MutableComponentModel.doHandleActivationEventContext()"
/x1/jenkins/jenkins-slave/workspace/tapestry-trunk-freestyle/tapestry-core/src/main/java/org/apache/tapestry5/model/ComponentModel.java:224:
warning - Tag @link: can't find MutableComponentModel.doHandleActivationEventContext() in
org.apache.tapestry5.model.ComponentModel
/x1/jenkins/jenkins-slave/workspace/tapestry-trunk-freestyle/tapestry-core/src/main/java/org/apache/tapestry5/model/ComponentModel.java:224:
warning - Tag @see: reference not found: {@link MutableComponentModel.doHandleActivationEventContext()}
/x1/jenkins/jenkins-slave/workspace/tapestry-trunk-freestyle/plastic/src/main/java/org/apache/tapestry5/plastic/PlasticManager.java:229:
warning - Tag @see: can't find createProxyTransformation(Class) in org.apache.tapestry5.plastic.PlasticManager
warning: org/jsr107/ri/annotations/AbstractCacheLookupUtil$ParameterDetails.class(org/jsr107/ri/annotations:AbstractCacheLookupUtil$ParameterDetails.class):
major version 51 is newer than 50, the highest major version supported by this compiler.
It is recommended that the compiler be upgraded.
warning: org/jsr107/ri/annotations/AbstractCacheLookupUtil$MethodKey.class(org/jsr107/ri/annotations:AbstractCacheLookupUtil$MethodKey.class):
major version 51 is newer than 50, the highest major version supported by this compiler.
It is recommended that the compiler be upgraded.
warning: org/jsr107/ri/annotations/CachePutMethodDetails.class(org/jsr107/ri/annotations:CachePutMethodDetails.class):
major version 51 is newer than 50, the highest major version supported by this compiler.
It is recommended that the compiler be upgraded.
warning: org/jsr107/ri/annotations/StaticCacheResultInvocationContext.class(org/jsr107/ri/annotations:StaticCacheResultInvocationContext.class):
major version 51 is newer than 50, the highest major version supported by this compiler.
It is recommended that the compiler be upgraded.
warning: org/jsr107/ri/annotations/DefaultGeneratedCacheKey.class(org/jsr107/ri/annotations:DefaultGeneratedCacheKey.class):
major version 51 is newer than 50, the highest major version supported by this compiler.
It is recommended that the compiler be upgraded.
warning: org/jsr107/ri/annotations/DefaultCacheResolver.class(org/jsr107/ri/annotations:DefaultCacheResolver.class):
major version 51 is newer than 50, the highest major version supported by this compiler.
It is recommended that the compiler be upgraded.
warning: org/jsr107/ri/annotations/ClassFilter.class(org/jsr107/ri/annotations:ClassFilter.class):
major version 51 is newer than 50, the highest major version supported by this compiler.
It is recommended that the compiler be upgraded.
warning: org/jsr107/ri/annotations/CacheResultMethodDetails.class(org/jsr107/ri/annotations:CacheResultMethodDetails.class):
major version 51 is newer than 50, the highest major version supported by this compiler.
It is recommended that the compiler be upgraded.
warning: org/jsr107/ri/annotations/CacheRemoveEntryMethodDetails.class(org/jsr107/ri/annotations:CacheRemoveEntryMethodDetails.class):
major version 51 is newer than 50, the highest major version supported by this compiler.
It is recommended that the compiler be upgraded.
warning: org/jsr107/ri/annotations/CacheRemoveAllMethodDetails.class(org/jsr107/ri/annotations:CacheRemoveAllMethodDetails.class):
major version 51 is newer than 50, the highest major version supported by this compiler.
It is recommended that the compiler be upgraded.
warning: org/jsr107/ri/annotations/CacheParameterDetails.class(org/jsr107/ri/annotations:CacheParameterDetails.class):
major version 51 is newer than 50, the highest major version supported by this compiler.
It is recommended that the compiler be upgraded.
warning: org/jsr107/ri/annotations/CacheMethodDetailsImpl.class(org/jsr107/ri/annotations:CacheMethodDetailsImpl.class):
major version 51 is newer than 50, the highest major version supported by this compiler.
It is recommended that the compiler be upgraded.
warning: org/jsr107/ri/annotations/CacheInvocationParameterImpl.class(org/jsr107/ri/annotations:CacheInvocationParameterImpl.class):
major version 51 is newer than 50, the highest major version supported by this compiler.
It is recommended that the compiler be upgraded.
warning: org/jsr107/ri/annotations/AbstractStaticCacheInvocationContext.class(org/jsr107/ri/annotations:AbstractStaticCacheInvocationContext.class):
major version 51 is newer than 50, the highest major version supported by this compiler.
It is recommended that the compiler be upgraded.
/x1/jenkins/jenkins-slave/workspace/tapestry-trunk-freestyle/tapestry-webresources/src/main/java/org/apache/tapestry5/internal/webresources/ResourceTransformerFactory.java:25:
warning - Tag @link: reference not found: org.apache.tapestry5.webresources.services.ResourceProcessor
/x1/jenkins/jenkins-slave/workspace/tapestry-trunk-freestyle/tapestry-webresources/src/main/java/org/apache/tapestry5/internal/webresources/ResourceTransformerFactory.java:43:
warning - Tag @see: reference not found: org.apache.tapestry5.webresources.services.ResourceProcessorSource
/x1/jenkins/jenkins-slave/workspace/tapestry-trunk-freestyle/tapestry-webresources/src/main/java/org/apache/tapestry5/internal/webresources/ResourceTransformerFactory.java:43:
warning - Tag @see: reference not found: org.apache.tapestry5.webresources.services.ResourceProcessorSource
/x1/jenkins/jenkins-slave/workspace/tapestry-trunk-freestyle/tapestry-core/src/main/java/org/apache/tapestry5/SymbolConstants.java:475:
warning - Tag @see:illegal character: "58" in "https://issues.apache.org/jira/browse/TAP5-2182"
/x1/jenkins/jenkins-slave/workspace/tapestry-trunk-freestyle/tapestry-core/src/main/java/org/apache/tapestry5/SymbolConstants.java:475:
warning - Tag @see:illegal character: "47" in "https://issues.apache.org/jira/browse/TAP5-2182"
/x1/jenkins/jenkins-slave/workspace/tapestry-trunk-freestyle/tapestry-core/src/main/java/org/apache/tapestry5/SymbolConstants.java:475:
warning - Tag @see:illegal character: "47" in "https://issues.apache.org/jira/browse/TAP5-2182"
/x1/jenkins/jenkins-slave/workspace/tapestry-trunk-freestyle/tapestry-core/src/main/java/org/apache/tapestry5/SymbolConstants.java:475:
warning - Tag @see:illegal character: "47" in "https://issues.apache.org/jira/browse/TAP5-2182"
/x1/jenkins/jenkins-slave/workspace/tapestry-trunk-freestyle/tapestry-core/src/main/java/org/apache/tapestry5/SymbolConstants.java:475:
warning - Tag @see:illegal character: "47" in "https://issues.apache.org/jira/browse/TAP5-2182"
/x1/jenkins/jenkins-slave/workspace/tapestry-trunk-freestyle/tapestry-core/src/main/java/org/apache/tapestry5/SymbolConstants.java:475:
warning - Tag @see:illegal character: "47" in "https://issues.apache.org/jira/browse/TAP5-2182"
/x1/jenkins/jenkins-slave/workspace/tapestry-trunk-freestyle/tapestry-core/src/main/java/org/apache/tapestry5/SymbolConstants.java:475:
warning - Tag @see:illegal character: "45" in "https://issues.apache.org/jira/browse/TAP5-2182"
/x1/jenkins/jenkins-slave/workspace/tapestry-trunk-freestyle/tapestry-core/src/main/java/org/apache/tapestry5/SymbolConstants.java:455:
warning - Tag @see:illegal character: "58" in "https://issues.apache.org/jira/browse/TAP5-2182"
/x1/jenkins/jenkins-slave/workspace/tapestry-trunk-freestyle/tapestry-core/src/main/java/org/apache/tapestry5/SymbolConstants.java:455:
warning - Tag @see:illegal character: "47" in "https://issues.apache.org/jira/browse/TAP5-2182"
/x1/jenkins/jenkins-slave/workspace/tapestry-trunk-freestyle/tapestry-core/src/main/java/org/apache/tapestry5/SymbolConstants.java:455:
warning - Tag @see:illegal character: "47" in "https://issues.apache.org/jira/browse/TAP5-2182"
/x1/jenkins/jenkins-slave/workspace/tapestry-trunk-freestyle/tapestry-core/src/main/java/org/apache/tapestry5/SymbolConstants.java:455:
warning - Tag @see:illegal character: "47" in "https://issues.apache.org/jira/browse/TAP5-2182"
/x1/jenkins/jenkins-slave/workspace/tapestry-trunk-freestyle/tapestry-core/src/main/java/org/apache/tapestry5/SymbolConstants.java:455:
warning - Tag @see:illegal character: "47" in "https://issues.apache.org/jira/browse/TAP5-2182"
/x1/jenkins/jenkins-slave/workspace/tapestry-trunk-freestyle/tapestry-core/src/main/java/org/apache/tapestry5/SymbolConstants.java:455:
warning - Tag @see:illegal character: "47" in "https://issues.apache.org/jira/browse/TAP5-2182"
/x1/jenkins/jenkins-slave/workspace/tapestry-trunk-freestyle/tapestry-core/src/main/java/org/apache/tapestry5/SymbolConstants.java:455:
warning - Tag @see:illegal character: "45" in "https://issues.apache.org/jira/browse/TAP5-2182"
/x1/jenkins/jenkins-slave/workspace/tapestry-trunk-freestyle/tapestry-core/src/main/java/org/apache/tapestry5/SymbolConstants.java:444:
warning - Tag @see:illegal character: "58" in "https://issues.apache.org/jira/browse/TAP5-2182"
/x1/jenkins/jenkins-slave/workspace/tapestry-trunk-freestyle/tapestry-core/src/main/java/org/apache/tapestry5/SymbolConstants.java:444:
warning - Tag @see:illegal character: "47" in "https://issues.apache.org/jira/browse/TAP5-2182"
/x1/jenkins/jenkins-slave/workspace/tapestry-trunk-freestyle/tapestry-core/src/main/java/org/apache/tapestry5/SymbolConstants.java:444:
warning - Tag @see:illegal character: "47" in "https://issues.apache.org/jira/browse/TAP5-2182"
/x1/jenkins/jenkins-slave/workspace/tapestry-trunk-freestyle/tapestry-core/src/main/java/org/apache/tapestry5/SymbolConstants.java:444:
warning - Tag @see:illegal character: "47" in "https://issues.apache.org/jira/browse/TAP5-2182"
/x1/jenkins/jenkins-slave/workspace/tapestry-trunk-freestyle/tapestry-core/src/main/java/org/apache/tapestry5/SymbolConstants.java:444:
warning - Tag @see:illegal character: "47" in "https://issues.apache.org/jira/browse/TAP5-2182"
/x1/jenkins/jenkins-slave/workspace/tapestry-trunk-freestyle/tapestry-core/src/main/java/org/apache/tapestry5/SymbolConstants.java:444:
warning - Tag @see:illegal character: "47" in "https://issues.apache.org/jira/browse/TAP5-2182"
/x1/jenkins/jenkins-slave/workspace/tapestry-trunk-freestyle/tapestry-core/src/main/java/org/apache/tapestry5/SymbolConstants.java:444:
warning - Tag @see:illegal character: "45" in "https://issues.apache.org/jira/browse/TAP5-2182"
/x1/jenkins/jenkins-slave/workspace/tapestry-trunk-freestyle/tapestry-core/src/main/java/org/apache/tapestry5/SymbolConstants.java:466:
warning - Tag @see:illegal character: "58" in "https://issues.apache.org/jira/browse/TAP5-2182"
/x1/jenkins/jenkins-slave/workspace/tapestry-trunk-freestyle/tapestry-core/src/main/java/org/apache/tapestry5/SymbolConstants.java:466:
warning - Tag @see:illegal character: "47" in "https://issues.apache.org/jira/browse/TAP5-2182"
/x1/jenkins/jenkins-slave/workspace/tapestry-trunk-freestyle/tapestry-core/src/main/java/org/apache/tapestry5/SymbolConstants.java:466:
warning - Tag @see:illegal character: "47" in "https://issues.apache.org/jira/browse/TAP5-2182"
/x1/jenkins/jenkins-slave/workspace/tapestry-trunk-freestyle/tapestry-core/src/main/java/org/apache/tapestry5/SymbolConstants.java:466:
warning - Tag @see:illegal character: "47" in "https://issues.apache.org/jira/browse/TAP5-2182"
/x1/jenkins/jenkins-slave/workspace/tapestry-trunk-freestyle/tapestry-core/src/main/java/org/apache/tapestry5/SymbolConstants.java:466:
warning - Tag @see:illegal character: "47" in "https://issues.apache.org/jira/browse/TAP5-2182"
/x1/jenkins/jenkins-slave/workspace/tapestry-trunk-freestyle/tapestry-core/src/main/java/org/apache/tapestry5/SymbolConstants.java:466:
warning - Tag @see:illegal character: "47" in "https://issues.apache.org/jira/browse/TAP5-2182"
/x1/jenkins/jenkins-slave/workspace/tapestry-trunk-freestyle/tapestry-core/src/main/java/org/apache/tapestry5/SymbolConstants.java:466:
warning - Tag @see:illegal character: "45" in "https://issues.apache.org/jira/browse/TAP5-2182"
/x1/jenkins/jenkins-slave/workspace/tapestry-trunk-freestyle/tapestry-core/src/main/java/org/apache/tapestry5/SymbolConstants.java:432:
warning - Tag @see:illegal character: "58" in "https://issues.apache.org/jira/browse/TAP5-2182"
/x1/jenkins/jenkins-slave/workspace/tapestry-trunk-freestyle/tapestry-core/src/main/java/org/apache/tapestry5/SymbolConstants.java:432:
warning - Tag @see:illegal character: "47" in "https://issues.apache.org/jira/browse/TAP5-2182"
/x1/jenkins/jenkins-slave/workspace/tapestry-trunk-freestyle/tapestry-core/src/main/java/org/apache/tapestry5/SymbolConstants.java:432:
warning - Tag @see:illegal character: "47" in "https://issues.apache.org/jira/browse/TAP5-2182"
/x1/jenkins/jenkins-slave/workspace/tapestry-trunk-freestyle/tapestry-core/src/main/java/org/apache/tapestry5/SymbolConstants.java:432:
warning - Tag @see:illegal character: "47" in "https://issues.apache.org/jira/browse/TAP5-2182"
/x1/jenkins/jenkins-slave/workspace/tapestry-trunk-freestyle/tapestry-core/src/main/java/org/apache/tapestry5/SymbolConstants.java:432:
warning - Tag @see:illegal character: "47" in "https://issues.apache.org/jira/browse/TAP5-2182"
/x1/jenkins/jenkins-slave/workspace/tapestry-trunk-freestyle/tapestry-core/src/main/java/org/apache/tapestry5/SymbolConstants.java:432:
warning - Tag @see:illegal character: "47" in "https://issues.apache.org/jira/browse/TAP5-2182"
/x1/jenkins/jenkins-slave/workspace/tapestry-trunk-freestyle/tapestry-core/src/main/java/org/apache/tapestry5/SymbolConstants.java:432:
warning - Tag @see:illegal character: "45" in "https://issues.apache.org/jira/browse/TAP5-2182"
/x1/jenkins/jenkins-slave/workspace/tapestry-trunk-freestyle/tapestry-core/src/main/java/org/apache/tapestry5/SymbolConstants.java:421:
warning - Tag @see:illegal character: "58" in "https://issues.apache.org/jira/browse/TAP5-2169"
/x1/jenkins/jenkins-slave/workspace/tapestry-trunk-freestyle/tapestry-core/src/main/java/org/apache/tapestry5/SymbolConstants.java:421:
warning - Tag @see:illegal character: "47" in "https://issues.apache.org/jira/browse/TAP5-2169"
/x1/jenkins/jenkins-slave/workspace/tapestry-trunk-freestyle/tapestry-core/src/main/java/org/apache/tapestry5/SymbolConstants.java:421:
warning - Tag @see:illegal character: "47" in "https://issues.apache.org/jira/browse/TAP5-2169"
/x1/jenkins/jenkins-slave/workspace/tapestry-trunk-freestyle/tapestry-core/src/main/java/org/apache/tapestry5/SymbolConstants.java:421:
warning - Tag @see:illegal character: "47" in "https://issues.apache.org/jira/browse/TAP5-2169"
/x1/jenkins/jenkins-slave/workspace/tapestry-trunk-freestyle/tapestry-core/src/main/java/org/apache/tapestry5/SymbolConstants.java:421:
warning - Tag @see:illegal character: "47" in "https://issues.apache.org/jira/browse/TAP5-2169"
/x1/jenkins/jenkins-slave/workspace/tapestry-trunk-freestyle/tapestry-core/src/main/java/org/apache/tapestry5/SymbolConstants.java:421:
warning - Tag @see:illegal character: "47" in "https://issues.apache.org/jira/browse/TAP5-2169"
/x1/jenkins/jenkins-slave/workspace/tapestry-trunk-freestyle/tapestry-core/src/main/java/org/apache/tapestry5/SymbolConstants.java:421:
warning - Tag @see:illegal character: "45" in "https://issues.apache.org/jira/browse/TAP5-2169"
/x1/jenkins/jenkins-slave/workspace/tapestry-trunk-freestyle/tapestry-core/src/main/java/org/apache/tapestry5/SymbolConstants.java:421:
warning - Tag @see: reference not found: https://issues.apache.org/jira/browse/TAP5-2169
/x1/jenkins/jenkins-slave/workspace/tapestry-trunk-freestyle/tapestry-core/src/main/java/org/apache/tapestry5/SymbolConstants.java:432:
warning - Tag @see: reference not found: https://issues.apache.org/jira/browse/TAP5-2182
/x1/jenkins/jenkins-slave/workspace/tapestry-trunk-freestyle/tapestry-core/src/main/java/org/apache/tapestry5/SymbolConstants.java:444:
warning - Tag @see: reference not found: https://issues.apache.org/jira/browse/TAP5-2182
/x1/jenkins/jenkins-slave/workspace/tapestry-trunk-freestyle/tapestry-core/src/main/java/org/apache/tapestry5/SymbolConstants.java:455:
warning - Tag @see: reference not found: https://issues.apache.org/jira/browse/TAP5-2182
/x1/jenkins/jenkins-slave/workspace/tapestry-trunk-freestyle/tapestry-core/src/main/java/org/apache/tapestry5/SymbolConstants.java:466:
warning - Tag @see: reference not found: https://issues.apache.org/jira/browse/TAP5-2182
/x1/jenkins/jenkins-slave/workspace/tapestry-trunk-freestyle/tapestry-core/src/main/java/org/apache/tapestry5/SymbolConstants.java:475:
warning - Tag @see: reference not found: https://issues.apache.org/jira/browse/TAP5-2182
/x1/jenkins/jenkins-slave/workspace/tapestry-trunk-freestyle/tapestry-core/src/main/java/org/apache/tapestry5/SymbolConstants.java:493:
warning - Tag @see: reference not found: org.apache.tapestry5.services.exceptions.ExceptionReporter
/x1/jenkins/jenkins-slave/workspace/tapestry-trunk-freestyle/tapestry-ioc/src/main/java/org/apache/tapestry5/ioc/ServiceBindingOptions.java:94:
warning - @param argument "<T>" is not a type parameter name.
/x1/jenkins/jenkins-slave/workspace/tapestry-trunk-freestyle/tapestry-core/src/main/java/org/apache/tapestry5/corelib/data/SecureOption.java:22:
warning - Tag @link: reference not found: SelectModel
/x1/jenkins/jenkins-slave/workspace/tapestry-trunk-freestyle/tapestry-core/src/main/java/org/apache/tapestry5/corelib/data/SecureOption.java:22:
warning - Tag @link: reference not found: Select
/x1/jenkins/jenkins-slave/workspace/tapestry-trunk-freestyle/tapestry-core/src/main/java/org/apache/tapestry5/corelib/data/SecureOption.java:22:
warning - Tag @link: reference not found: SelectModel
/x1/jenkins/jenkins-slave/workspace/tapestry-trunk-freestyle/tapestry-core/src/main/java/org/apache/tapestry5/corelib/data/SecureOption.java:22:
warning - Tag @link: reference not found: Select
/x1/jenkins/jenkins-slave/workspace/tapestry-trunk-freestyle/tapestry-webresources/src/main/java/org/apache/tapestry5/internal/webresources/ResourceTransformerFactory.java:25:
warning - Tag @link: reference not found: org.apache.tapestry5.webresources.services.ResourceProcessor
/x1/jenkins/jenkins-slave/workspace/tapestry-trunk-freestyle/tapestry-core/src/main/java/org/apache/tapestry5/corelib/data/SecureOption.java:22:
warning - Tag @link: reference not found: SelectModel
/x1/jenkins/jenkins-slave/workspace/tapestry-trunk-freestyle/tapestry-core/src/main/java/org/apache/tapestry5/corelib/data/SecureOption.java:22:
warning - Tag @link: reference not found: Select
/x1/jenkins/jenkins-slave/workspace/tapestry-trunk-freestyle/tapestry-webresources/src/main/java/org/apache/tapestry5/internal/webresources/ResourceTransformerFactory.java:25:
warning - Tag @link: reference not found: org.apache.tapestry5.webresources.services.ResourceProcessor
/x1/jenkins/jenkins-slave/workspace/tapestry-trunk-freestyle/tapestry-webresources/src/main/java/org/apache/tapestry5/internal/webresources/ResourceTransformerFactory.java:25:
warning - Tag @link: reference not found: org.apache.tapestry5.webresources.services.ResourceProcessor
/x1/jenkins/jenkins-slave/workspace/tapestry-trunk-freestyle/tapestry-core/src/main/java/org/apache/tapestry5/model/MutableComponentModel.java:135:
warning - Tag @link: reference not found: org.apache.tapestry5.EventConstants.ACTIVATE
/x1/jenkins/jenkins-slave/workspace/tapestry-trunk-freestyle/tapestry-core/src/main/java/org/apache/tapestry5/model/ComponentModel.java:224:
warning - Tag @link: reference not found: org.apache.tapestry5.EventConstants.ACTIVATE
/x1/jenkins/jenkins-slave/workspace/tapestry-trunk-freestyle/tapestry-webresources/src/main/java/org/apache/tapestry5/internal/webresources/ResourceTransformerFactory.java:25:
warning - Tag @link: reference not found: org.apache.tapestry5.webresources.services.ResourceProcessor
/x1/jenkins/jenkins-slave/workspace/tapestry-trunk-freestyle/tapestry-core/src/main/java/org/apache/tapestry5/corelib/data/SecureOption.java:22:
warning - Tag @link: reference not found: SelectModel
/x1/jenkins/jenkins-slave/workspace/tapestry-trunk-freestyle/tapestry-core/src/main/java/org/apache/tapestry5/corelib/data/SecureOption.java:22:
warning - Tag @link: reference not found: Select

129 warnings
:plastic:sourcesJar
:plastic:assemble
:plastic:compileTestJava
:plastic:compileTestGroovy
:plastic:processTestResources
:plastic:testClasses
:plastic:test
:plastic:check
:plastic:build
:plastic:uploadPublishedUploading: org/apache/tapestry/plastic/5.4-SNAPSHOT/plastic-5.4-20141124.233020-355.jar
to repository remote at https://repository.apache.org/content/repositories/snapshots
Transferring 568K from remote
Uploaded 568K
Uploading: org/apache/tapestry/plastic/5.4-SNAPSHOT/plastic-5.4-20141124.233020-355-sources.jar
to repository remote at https://repository.apache.org/content/repositories/snapshots
Transferring 775K from remote
Uploaded 775K

:quickstart:compileJava UP-TO-DATE
:quickstart:compileGroovy UP-TO-DATE
:quickstart:processFiltered
:quickstart:processResources
:quickstart:classes
:quickstart:jar
:quickstart:sourcesJar
:quickstart:assemble
:quickstart:compileTestJava UP-TO-DATE
:quickstart:compileTestGroovy UP-TO-DATE
:quickstart:processTestResources UP-TO-DATE
:quickstart:testClasses UP-TO-DATE
:quickstart:test UP-TO-DATE
:quickstart:check UP-TO-DATE
:quickstart:build
:quickstart:uploadPublishedUploading: org/apache/tapestry/quickstart/5.4-SNAPSHOT/quickstart-5.4-20141124.233022-354.jar
to repository remote at https://repository.apache.org/content/repositories/snapshots
Transferring 169K from remote
Uploaded 169K
Uploading: org/apache/tapestry/quickstart/5.4-SNAPSHOT/quickstart-5.4-20141124.233022-354-sources.jar
to repository remote at https://repository.apache.org/content/repositories/snapshots
Transferring 104K from remote
Uploaded 104K

:tapestry-beanvalidator:compileCoffeeScript UP-TO-DATE
:tapestry-beanvalidator:compileJava
:tapestry-beanvalidator:compileGroovy UP-TO-DATE
:tapestry-beanvalidator:processResources UP-TO-DATE
:tapestry-beanvalidator:classes
:tapestry-beanvalidator:jar
:tapestry-beanvalidator:sourcesJar
:tapestry-beanvalidator:assemble
:tapestry-beanvalidator:compileTestJava
:tapestry-beanvalidator:compileTestGroovy UP-TO-DATE
:tapestry-beanvalidator:processTestResources
:tapestry-beanvalidator:testClasses
:tapestry-beanvalidator:test

org.apache.tapestry5.beanvalidator.integration.TapestryBeanValidationIntegrationTests.testStartup
FAILED
    java.net.BindException

9 tests completed, 1 failed, 8 skipped
:tapestry-beanvalidator:test FAILED

FAILURE: Build failed with an exception.

* What went wrong:
Execution failed for task ':tapestry-beanvalidator:test'.
> There were failing tests. See the report at: file:///x1/jenkins/jenkins-slave/workspace/tapestry-trunk-freestyle/tapestry-beanvalidator/build/reports/tests/index.html

* Try:
Run with --stacktrace option to get the stack trace. Run with --info or --debug option to
get more log output.

BUILD FAILED

Total time: 1 mins 16.978 secs
Build step 'Execute shell' marked build as failure
Recording test results
TestNG Reports Processing: START
Looking for TestNG results report in workspace using pattern: **/build/reports/tests/testng-results.xml
Did not find any matching files.

---------------------------------------------------------------------
To unsubscribe, e-mail: dev-unsubscribe@tapestry.apache.org
For additional commands, e-mail: dev-help@tapestry.apache.org


Mime
View raw message