tapestry-dev mailing list archives

Site index · List index
Message view « Date » · « Thread »
Top « Date » · « Thread »
From Apache Jenkins Server <jenk...@builds.apache.org>
Subject Build failed in Jenkins: tapestry-trunk-freestyle #1322
Date Tue, 02 Sep 2014 00:43:31 GMT
See <https://builds.apache.org/job/tapestry-trunk-freestyle/1322/changes>

Changes:

[hlship] TAP5-1934: Kaptcha Component throws NPE after session is expired

[hlship] TAP5-1934: Kaptcha Component throws NPE after session is expired

[hlship] TAP5-2379: Upgrade to Less4j 1.8.1 and ANTL 3.5.2

------------------------------------------
[...truncated 25662 lines...]
                     ClasspathAssetFactory: DEFINED
                          ClasspathScanner: REAL
                     ClasspathURLConverter: REAL
                     ClientBehaviorSupport: DEFINED
                         ClientDataEncoder: DEFINED
              ClientPersistentFieldStorage: DEFINED
             ClientPersistentFieldStrategy: DEFINED
                           ClientWhitelist: DEFINED
                             Compatibility: DEFINED
                       ComponentClassCache: DEFINED
                    ComponentClassResolver: REAL
             ComponentClassTransformWorker: DEFINED
      ComponentClassesInvalidationEventHub: REAL
                  ComponentDefaultProvider: DEFINED
                 ComponentEventLinkEncoder: DEFINED
             ComponentEventLinkTransformer: DEFINED
              ComponentEventRequestHandler: DEFINED
             ComponentEventResultProcessor: DEFINED
          ComponentInstanceResultProcessor: DEFINED
               ComponentInstantiatorSource: DEFINED
                ComponentLibraryInfoSource: DEFINED
     ComponentMessagesInvalidationEventHub: DEFINED
                   ComponentMessagesSource: DEFINED
                      ComponentModelSource: DEFINED
                         ComponentOverride: REAL
       ComponentPageElementResourcesSource: DEFINED
                     ComponentProxyFactory: DEFINED
                   ComponentRequestHandler: DEFINED
          ComponentRequestSelectorAnalyzer: DEFINED
                  ComponentResourceLocator: DEFINED
                           ComponentSource: DEFINED
                  ComponentTemplateLocator: DEFINED
                   ComponentTemplateSource: DEFINED
    ComponentTemplatesInvalidationEventHub: DEFINED
                       CompressionAnalyzer: DEFINED
                       ContentTypeAnalyzer: DEFINED
                                   Context: DEFINED
                       ContextAssetFactory: DEFINED
                     ContextBindingFactory: DEFINED
                        ContextPathEncoder: DEFINED
                       ContextValueEncoder: DEFINED
                                CookieSink: DEFINED
                              CookieSource: DEFINED
                                   Cookies: DEFINED
                       CoreJavaScriptStack: DEFINED
                          DashboardManager: DEFINED
                          DataTypeAnalyzer: DEFINED
                             DateUtilities: DEFINED
                   DefaultDataTypeAnalyzer: DEFINED
              DefaultImplementationBuilder: VIRTUAL
                         DeferredExecution: DEFINED
                        DeprecationWarning: DEFINED
                     DynamicTemplateParser: VIRTUAL
                      EndOfRequestEventHub: REAL
                               Environment: DEFINED
                EnvironmentalShadowBuilder: VIRTUAL
                         ExceptionAnalyzer: DEFINED
                         ExceptionReporter: DEFINED
                          ExceptionTracker: DEFINED
                           FactoryDefaults: REAL
                     FieldTranslatorSource: DEFINED
                    FieldValidationSupport: DEFINED
               FieldValidatorDefaultSource: DEFINED
                      FieldValidatorSource: DEFINED
                    FormControlNameManager: DEFINED
                               FormSupport: DEFINED
                                 Heartbeat: DEFINED
                  HiddenFieldLocationRules: DEFINED
                              Html5Support: DEFINED
                        HttpServletRequest: DEFINED
                 HttpServletRequestHandler: VIRTUAL
                       HttpServletResponse: DEFINED
                        IgnoredPathsFilter: DEFINED
                         InjectionProvider: DEFINED
     InternalComponentInvalidationEventHub: REAL
                   InternalJavaScriptStack: DEFINED
                    InternalRequestGlobals: DEFINED
                  JavaScriptStackAssembler: DEFINED
            JavaScriptStackPathConstructor: DEFINED
                     JavaScriptStackSource: DEFINED
                         JavaScriptSupport: DEFINED
                               LazyAdvisor: DEFINED
                           LinkCreationHub: DEFINED
                                LinkSource: DEFINED
                           LinkTransformer: DEFINED
                        LocalizationSetter: DEFINED
                          LocationRenderer: DEFINED
                              LoggerSource: BUILTIN
                            LoggingAdvisor: DEFINED
                          LoggingDecorator: DEFINED
                            MarkupRenderer: DEFINED
                       MarkupWriterFactory: DEFINED
                          MasterDispatcher: DEFINED
                      MasterObjectProvider: REAL
           MasterStackTraceElementAnalyzer: DEFINED
                     MessageBindingFactory: DEFINED
                           MetaDataLocator: DEFINED
                                MetaWorker: DEFINED
                             ModuleManager: DEFINED
           NullFieldStrategyBindingFactory: DEFINED
                   NullFieldStrategySource: DEFINED
                  NumericTranslatorSupport: DEFINED
                            ObjectRenderer: DEFINED
                          OperationAdvisor: DEFINED
            PageActivationContextCollector: DEFINED
                             PageActivator: DEFINED
                   PageContentTypeAnalyzer: DEFINED
                     PageDocumentGenerator: DEFINED
                        PageElementFactory: DEFINED
                                PageLoader: DEFINED
                        PageMarkupRenderer: DEFINED
                             PagePreloader: VIRTUAL
                      PageRenderLinkSource: DEFINED
                 PageRenderLinkTransformer: DEFINED
                           PageRenderQueue: DEFINED
                  PageRenderRequestHandler: DEFINED
                      PageResponseRenderer: DEFINED
                                PageSource: DEFINED
                     PartialMarkupRenderer: DEFINED
                   PartialTemplateRenderer: DEFINED
                           PathConstructor: DEFINED
                          PeriodicExecutor: DEFINED
                    PersistentFieldManager: DEFINED
                          PersistentLocale: DEFINED
                          PerthreadManager: BUILTIN
                           PipelineBuilder: REAL
                       PlasticProxyFactory: BUILTIN
                        PropBindingFactory: DEFINED
                      PropertiesFileParser: DEFINED
                            PropertyAccess: VIRTUAL
                     PropertyConduitSource: DEFINED
                     PropertyShadowBuilder: VIRTUAL
                       RegistryShutdownHub: BUILTIN
                           RegistryStartup: REAL
                              ReloadHelper: REAL
                                   Request: VIRTUAL
                   RequestExceptionHandler: DEFINED
                            RequestGlobals: DEFINED
                            RequestHandler: DEFINED
                          RequestPageCache: DEFINED
                    RequestSecurityManager: DEFINED
                     ResourceChangeTracker: DEFINED
                   ResourceDigestGenerator: DEFINED
                     ResourceDigestManager: DEFINED
                         ResourceMinimizer: DEFINED
                          ResourceStreamer: DEFINED
                                  Response: VIRTUAL
               ResponseCompressionAnalyzer: DEFINED
                          ResponseRenderer: DEFINED
                        SelectModelFactory: DEFINED
                 ServiceActivityScoreboard: BUILTIN
           ServiceConfigurationListenerHub: DEFINED
                    ServiceLifecycleSource: REAL
                           ServiceOverride: REAL
             ServletApplicationInitializer: REAL
SessionApplicationStatePersistenceStrategy: DEFINED
            SessionPersistedObjectAnalyzer: DEFINED
                           StrategyBuilder: VIRTUAL
                  StreamableResourceSource: DEFINED
                            StringInterner: DEFINED
                      SymbolBindingFactory: DEFINED
                              SymbolSource: REAL
                    TapestrySessionFactory: DEFINED
                            TemplateParser: DEFINED
                              ThreadLocale: DEFINED
                              ThunkCreator: DEFINED
                   TranslateBindingFactory: DEFINED
                TranslatorAlternatesSource: DEFINED
                          TranslatorSource: DEFINED
                               TypeCoercer: REAL
                                URLEncoder: DEFINED
           UnknownActivationContextHandler: DEFINED
                         UpdateListenerHub: DEFINED
                    ValidateBindingFactory: DEFINED
             ValidationConstraintGenerator: DEFINED
                ValidationDecoratorFactory: DEFINED
                            ValidatorMacro: DEFINED
                        ValueEncoderSource: DEFINED
                        ValueLabelProvider: DEFINED

86.89% unrealized services (179/206)

Application 'app' (version 0.0.1) startup time: 43 ms to build IoC Registry, 155 ms overall.

 ______                  __             ____
/_  __/__ ____  ___ ___ / /_______ __  / __/
 / / / _ `/ _ \/ -_|_-</ __/ __/ // / /__ \ 
/_/  \_,_/ .__/\__/___/\__/_/  \_, / /____/
        /_/                   /___/  UNKNOWN (development mode)


Test worker [INFO] AbstractConnector Started SelectChannelConnector@0.0.0.0:9090
Test worker [INFO] SslContextFactory Enabled Protocols [SSLv2Hello, SSLv3, TLSv1] of [SSLv2Hello,
SSLv3, TLSv1]
Test worker [INFO] AbstractConnector Started SslSelectChannelConnector@0.0.0.0:8443
Test worker [INFO] HttpServer Version Jetty/5.1.x
Test worker [INFO] Container Started HttpContext[/selenium-server/driver,/selenium-server/driver]
Test worker [INFO] Container Started HttpContext[/selenium-server,/selenium-server]
Test worker [INFO] Container Started HttpContext[/,/]
Test worker [INFO] Container Started org.openqa.jetty.jetty.servlet.ServletHandler@1488cb6
Test worker [INFO] Container Started HttpContext[/wd,/wd]
Test worker [INFO] SocketListener Started SocketListener on 0.0.0.0:4444
Test worker [INFO] Container Started org.openqa.jetty.jetty.Server@a53380
Test worker [INFO] SeleniumTestCase Executing public void org.apache.tapestry5.integration.activationctx2.ActivationContextIntegrationTests2.checked_context_correct()
qtp19581653-592 [INFO] PageLoader Loaded page 'Index' (en) in 58.399 ms
qtp19581653-589 [INFO] PageLoader Loaded page 'ContextChecked' (en) in 9.756 ms
Test worker [INFO] SeleniumTestCase Executing public void org.apache.tapestry5.integration.activationctx2.ActivationContextIntegrationTests2.checked_context_error()
qtp19581653-605 [INFO] PageActivator Page ContextChecked required an exact activation context,
let's handle this
qtp19581653-605 [WARN] UnknownActivationContextHandler Activate event on page class org.apache.tapestry5.integration.activationctx2.pages.ContextChecked
was fired with context <EventContext: error> but was not handled
Test worker [INFO] SeleniumTestCase Executing public void org.apache.tapestry5.integration.activationctx2.ActivationContextIntegrationTests2.unchecked_context_empty()
qtp19581653-597 [INFO] PageLoader Loaded page 'ContextUnchecked' (en) in 6.493 ms
Test worker [INFO] SeleniumTestCase Executing public void org.apache.tapestry5.integration.activationctx2.ActivationContextIntegrationTests2.unchecked_context_one()
Test worker [INFO] SeleniumTestCase Executing public void org.apache.tapestry5.integration.activationctx2.ActivationContextIntegrationTests2.unchecked_context_two()
Test worker [INFO] SeleniumTestCase Shutting down integration test support ...
Test worker [INFO] SeleniumTestCase Shutting down selenium client ...
Test worker [INFO] SeleniumTestCase Shutting down selenium server ...
Acceptor ServerSocket[addr=0.0.0.0/0.0.0.0,port=0,localport=4444] [INFO] ThreadedServer Stopping
Acceptor ServerSocket[addr=0.0.0.0/0.0.0.0,port=0,localport=4444]
Test worker [INFO] SocketListener Stopped SocketListener on 0.0.0.0:4444
Test worker [INFO] Container Stopped HttpContext[/selenium-server/driver,/selenium-server/driver]
Test worker [INFO] Container Stopped HttpContext[/selenium-server,/selenium-server]
Test worker [INFO] Container Stopped HttpContext[/,/]
Test worker [INFO] Container Stopped org.openqa.jetty.jetty.servlet.ServletHandler@1488cb6
Test worker [INFO] Container Stopped HttpContext[/wd,/wd]
Test worker [INFO] Container Stopped org.openqa.jetty.jetty.Server@a53380
Test worker [INFO] SeleniumTestCase Shutting web server ...
Test worker [INFO] ContextHandler stopped o.e.j.w.WebAppContext{,file:/x1/jenkins/jenkins-slave/workspace/tapestry-trunk-freestyle/tapestry-core/src/test/activationctx2/},/x1/jenkins/jenkins-slave/workspace/tapestry-trunk-freestyle/tapestry-core/src/test/activationctx2
Test worker [ERROR] SerializationSupport Unexpected service proxy provider when clearing the
provider. This may indicate that you have multiple IoC Registries.

1474 tests completed, 1 failed
:tapestry-core:test FAILED

FAILURE: Build failed with an exception.

* What went wrong:
Execution failed for task ':tapestry-core:test'.
> There were failing tests. See the report at: file:///x1/jenkins/jenkins-slave/workspace/tapestry-trunk-freestyle/tapestry-core/build/reports/tests/index.html

* Try:
Run with --stacktrace option to get the stack trace. Run with --info or --debug option to
get more log output.

BUILD FAILED

Total time: 11 mins 23.366 secs
Build step 'Execute shell' marked build as failure
Recording test results
TestNG Reports Processing: START
Looking for TestNG results report in workspace using pattern: **/build/reports/tests/testng-results.xml
Did not find any matching files.
Updating TAP5-2379
Updating TAP5-1934

---------------------------------------------------------------------
To unsubscribe, e-mail: dev-unsubscribe@tapestry.apache.org
For additional commands, e-mail: dev-help@tapestry.apache.org


Mime
View raw message