tapestry-dev mailing list archives

Site index · List index
Message view « Date » · « Thread »
Top « Date » · « Thread »
From Apache Jenkins Server <jenk...@builds.apache.org>
Subject Build failed in Jenkins: tapestry-trunk-freestyle #1210
Date Tue, 06 May 2014 03:47:30 GMT
See <https://builds.apache.org/job/tapestry-trunk-freestyle/1210/changes>

Changes:

[jochen.kemnade] update jQuery to 1.11.1, update RequireJS to 2.1.11

[jochen.kemnade] update SLF4J to 1.7.7

------------------------------------------
[...truncated 29598 lines...]
    0 nanoseconds spent performing 0 L2C puts;
    0 nanoseconds spent performing 0 L2C hits;
    0 nanoseconds spent performing 0 L2C misses;
    0 nanoseconds spent executing 0 flushes (flushing a total of 0 entities and 0 collections);
    0 nanoseconds spent executing 0 partial-flushes (flushing a total of 0 entities and 0
collections)
}
[INFO] SeleniumTestCase Executing public void org.apache.tapestry5.hibernate.integration.TapestryHibernateIntegrationTests.using_cached_with_form()
[INFO] PageLoader Loaded page 'CachedForm' (en) in 107.277 ms
[ERROR] ClientDataEncoder The symbol 'tapestry.hmac-passphrase' has not been configured. This
is used to configure hash-based message authentication of Tapestry data stored in forms, or
in the URL. You application is less secure, and more vulnerable to denial-of-service attacks,
when this symbol is not configured.
[INFO] StatisticalLoggingSessionEventListener Session Metrics {
    6044 nanoseconds spent acquiring 1 JDBC connections;
    0 nanoseconds spent releasing 0 JDBC connections;
    490810 nanoseconds spent preparing 1 JDBC statements;
    70335 nanoseconds spent executing 1 JDBC statements;
    0 nanoseconds spent executing 0 JDBC batches;
    0 nanoseconds spent performing 0 L2C puts;
    0 nanoseconds spent performing 0 L2C hits;
    0 nanoseconds spent performing 0 L2C misses;
    0 nanoseconds spent executing 0 flushes (flushing a total of 0 entities and 0 collections);
    7945 nanoseconds spent executing 1 partial-flushes (flushing a total of 0 entities and
0 collections)
}
[INFO] StatisticalLoggingSessionEventListener Session Metrics {
    7317 nanoseconds spent acquiring 1 JDBC connections;
    0 nanoseconds spent releasing 0 JDBC connections;
    835842 nanoseconds spent preparing 2 JDBC statements;
    168900 nanoseconds spent executing 2 JDBC statements;
    0 nanoseconds spent executing 0 JDBC batches;
    0 nanoseconds spent performing 0 L2C puts;
    0 nanoseconds spent performing 0 L2C hits;
    0 nanoseconds spent performing 0 L2C misses;
    748793 nanoseconds spent executing 1 flushes (flushing a total of 1 entities and 0 collections);
    10011 nanoseconds spent executing 1 partial-flushes (flushing a total of 0 entities and
0 collections)
}
[INFO] StatisticalLoggingSessionEventListener Session Metrics {
    4733 nanoseconds spent acquiring 1 JDBC connections;
    0 nanoseconds spent releasing 0 JDBC connections;
    578063 nanoseconds spent preparing 1 JDBC statements;
    55332 nanoseconds spent executing 1 JDBC statements;
    0 nanoseconds spent executing 0 JDBC batches;
    0 nanoseconds spent performing 0 L2C puts;
    0 nanoseconds spent performing 0 L2C hits;
    0 nanoseconds spent performing 0 L2C misses;
    0 nanoseconds spent executing 0 flushes (flushing a total of 0 entities and 0 collections);
    7431 nanoseconds spent executing 1 partial-flushes (flushing a total of 0 entities and
0 collections)
}
[INFO] StatisticalLoggingSessionEventListener Session Metrics {
    8430 nanoseconds spent acquiring 1 JDBC connections;
    0 nanoseconds spent releasing 0 JDBC connections;
    434553 nanoseconds spent preparing 1 JDBC statements;
    96776 nanoseconds spent executing 1 JDBC statements;
    0 nanoseconds spent executing 0 JDBC batches;
    0 nanoseconds spent performing 0 L2C puts;
    0 nanoseconds spent performing 0 L2C hits;
    0 nanoseconds spent performing 0 L2C misses;
    157516 nanoseconds spent executing 1 flushes (flushing a total of 1 entities and 0 collections);
    0 nanoseconds spent executing 0 partial-flushes (flushing a total of 0 entities and 0
collections)
}
[INFO] StatisticalLoggingSessionEventListener Session Metrics {
    4377 nanoseconds spent acquiring 1 JDBC connections;
    0 nanoseconds spent releasing 0 JDBC connections;
    361041 nanoseconds spent preparing 1 JDBC statements;
    55526 nanoseconds spent executing 1 JDBC statements;
    0 nanoseconds spent executing 0 JDBC batches;
    0 nanoseconds spent performing 0 L2C puts;
    0 nanoseconds spent performing 0 L2C hits;
    0 nanoseconds spent performing 0 L2C misses;
    0 nanoseconds spent executing 0 flushes (flushing a total of 0 entities and 0 collections);
    6319 nanoseconds spent executing 1 partial-flushes (flushing a total of 0 entities and
0 collections)
}
[INFO] StatisticalLoggingSessionEventListener Session Metrics {
    7509 nanoseconds spent acquiring 1 JDBC connections;
    0 nanoseconds spent releasing 0 JDBC connections;
    557573 nanoseconds spent preparing 1 JDBC statements;
    101005 nanoseconds spent executing 1 JDBC statements;
    0 nanoseconds spent executing 0 JDBC batches;
    0 nanoseconds spent performing 0 L2C puts;
    0 nanoseconds spent performing 0 L2C hits;
    0 nanoseconds spent performing 0 L2C misses;
    157139 nanoseconds spent executing 1 flushes (flushing a total of 1 entities and 0 collections);
    0 nanoseconds spent executing 0 partial-flushes (flushing a total of 0 entities and 0
collections)
}
[INFO] StatisticalLoggingSessionEventListener Session Metrics {
    4398 nanoseconds spent acquiring 1 JDBC connections;
    0 nanoseconds spent releasing 0 JDBC connections;
    411030 nanoseconds spent preparing 1 JDBC statements;
    59046 nanoseconds spent executing 1 JDBC statements;
    0 nanoseconds spent executing 0 JDBC batches;
    0 nanoseconds spent performing 0 L2C puts;
    0 nanoseconds spent performing 0 L2C hits;
    0 nanoseconds spent performing 0 L2C misses;
    0 nanoseconds spent executing 0 flushes (flushing a total of 0 entities and 0 collections);
    6325 nanoseconds spent executing 1 partial-flushes (flushing a total of 0 entities and
0 collections)
}
[INFO] SeleniumTestCase Executing public void org.apache.tapestry5.hibernate.integration.TapestryHibernateIntegrationTests.valueencode_all_entity_types()
throws java.lang.Exception
[INFO] PageLoader Loaded page 'EncodeEntities' (en) in 24.571 ms
[INFO] StatisticalLoggingSessionEventListener Session Metrics {
    5567 nanoseconds spent acquiring 1 JDBC connections;
    0 nanoseconds spent releasing 0 JDBC connections;
    425860 nanoseconds spent preparing 1 JDBC statements;
    80153 nanoseconds spent executing 1 JDBC statements;
    0 nanoseconds spent executing 0 JDBC batches;
    0 nanoseconds spent performing 0 L2C puts;
    0 nanoseconds spent performing 0 L2C hits;
    0 nanoseconds spent performing 0 L2C misses;
    0 nanoseconds spent executing 0 flushes (flushing a total of 0 entities and 0 collections);
    6727 nanoseconds spent executing 1 partial-flushes (flushing a total of 0 entities and
0 collections)
}
[INFO] StatisticalLoggingSessionEventListener Session Metrics {
    6147 nanoseconds spent acquiring 1 JDBC connections;
    0 nanoseconds spent releasing 0 JDBC connections;
    1435558 nanoseconds spent preparing 3 JDBC statements;
    214105 nanoseconds spent executing 3 JDBC statements;
    0 nanoseconds spent executing 0 JDBC batches;
    0 nanoseconds spent performing 0 L2C puts;
    0 nanoseconds spent performing 0 L2C hits;
    0 nanoseconds spent performing 0 L2C misses;
    197394 nanoseconds spent executing 1 flushes (flushing a total of 2 entities and 0 collections);
    685248 nanoseconds spent executing 1 partial-flushes (flushing a total of 2 entities and
2 collections)
}
[INFO] StatisticalLoggingSessionEventListener Session Metrics {
    6536 nanoseconds spent acquiring 1 JDBC connections;
    0 nanoseconds spent releasing 0 JDBC connections;
    1142838 nanoseconds spent preparing 2 JDBC statements;
    179412 nanoseconds spent executing 2 JDBC statements;
    0 nanoseconds spent executing 0 JDBC batches;
    0 nanoseconds spent performing 0 L2C puts;
    0 nanoseconds spent performing 0 L2C hits;
    0 nanoseconds spent performing 0 L2C misses;
    0 nanoseconds spent executing 0 flushes (flushing a total of 0 entities and 0 collections);
    143449 nanoseconds spent executing 1 partial-flushes (flushing a total of 1 entities and
1 collections)
}
[ERROR] User Unable to convert client value '9999' into an entity instance.
[INFO] StatisticalLoggingSessionEventListener Session Metrics {
    7017 nanoseconds spent acquiring 1 JDBC connections;
    0 nanoseconds spent releasing 0 JDBC connections;
    1318838 nanoseconds spent preparing 2 JDBC statements;
    180152 nanoseconds spent executing 2 JDBC statements;
    0 nanoseconds spent executing 0 JDBC batches;
    0 nanoseconds spent performing 0 L2C puts;
    0 nanoseconds spent performing 0 L2C hits;
    0 nanoseconds spent performing 0 L2C misses;
    0 nanoseconds spent executing 0 flushes (flushing a total of 0 entities and 0 collections);
    11260 nanoseconds spent executing 1 partial-flushes (flushing a total of 0 entities and
0 collections)
}
[INFO] SeleniumTestCase Shutting down integration test support ...
[INFO] SeleniumTestCase Shutting down selenium client ...
[INFO] SeleniumTestCase Shutting down selenium server ...
[INFO] ThreadedServer Stopping Acceptor ServerSocket[addr=0.0.0.0/0.0.0.0,port=0,localport=4444]
[INFO] SocketListener Stopped SocketListener on 0.0.0.0:4444
[INFO] Container Stopped HttpContext[/selenium-server/driver,/selenium-server/driver]
[INFO] Container Stopped HttpContext[/selenium-server,/selenium-server]
[INFO] Container Stopped HttpContext[/,/]
[INFO] Container Stopped org.openqa.jetty.jetty.servlet.ServletHandler@1b68d78
[INFO] Container Stopped HttpContext[/wd,/wd]
[INFO] Container Stopped org.openqa.jetty.jetty.Server@92de02
[INFO] SeleniumTestCase Shutting web server ...
[INFO] DriverManagerConnectionProviderImpl HHH000030: Cleaning up connection pool [jdbc:hsqldb:mem:test]
[INFO] ContextHandler stopped o.e.j.w.WebAppContext{,file:/x1/jenkins/jenkins-slave/workspace/tapestry-trunk-freestyle/tapestry-hibernate/src/test/webapp/},/x1/jenkins/jenkins-slave/workspace/tapestry-trunk-freestyle/tapestry-hibernate/src/test/webapp
:tapestry-hibernate:check
:tapestry-hibernate:build
:tapestry-hibernate:uploadPublishedUploading: org/apache/tapestry/tapestry-hibernate/5.4-SNAPSHOT/tapestry-hibernate-5.4-20140506.034628-139.jar
to repository remote at https://repository.apache.org/content/repositories/snapshots
Transferring 32K from remote
Uploaded 32K
Uploading: org/apache/tapestry/tapestry-hibernate/5.4-SNAPSHOT/tapestry-hibernate-5.4-20140506.034628-139-sources.jar
to repository remote at https://repository.apache.org/content/repositories/snapshots
Transferring 30K from remote
Uploaded 30K

:tapestry-hibernate-core:sourcesJar
:tapestry-hibernate-core:assemble
:tapestry-hibernate-core:compileTestJavaNote: Some input files use or override a deprecated
API.
Note: Recompile with -Xlint:deprecation for details.

:tapestry-hibernate-core:compileTestGroovy UP-TO-DATE
:tapestry-hibernate-core:processTestResources
:tapestry-hibernate-core:testClasses
:tapestry-hibernate-core:test
[WARN] ConnectionProviderInitiator HHH000022: c3p0 properties were encountered, but the c3p0
provider class was not found on the classpath; these properties are going to be ignored.
[WARN] DriverManagerConnectionProviderImpl HHH000402: Using Hibernate built-in connection
pool (not for production use!)
[INFO] HibernateSessionSourceTest Hibernate startup: 387 ms to configure, 854 ms overall.
[INFO] HibernateSessionSourceTest Configured Hibernate entities: (none)
[WARN] ConnectionProviderInitiator HHH000022: c3p0 properties were encountered, but the c3p0
provider class was not found on the classpath; these properties are going to be ignored.
[WARN] DriverManagerConnectionProviderImpl HHH000402: Using Hibernate built-in connection
pool (not for production use!)
[INFO] HibernateSessionSourceTest Hibernate startup: 44 ms to configure, 290 ms overall.
[INFO] HibernateSessionSourceTest Configured Hibernate entities: org.example.app0.entities.User
:tapestry-hibernate-core:check
:tapestry-hibernate-core:build
:tapestry-hibernate-core:uploadPublishedUploading: org/apache/tapestry/tapestry-hibernate-core/5.4-SNAPSHOT/tapestry-hibernate-core-5.4-20140506.034636-139.jar
to repository remote at https://repository.apache.org/content/repositories/snapshots
Transferring 30K from remote
Uploaded 30K
Uploading: org/apache/tapestry/tapestry-hibernate-core/5.4-SNAPSHOT/tapestry-hibernate-core-5.4-20140506.034636-139-sources.jar
to repository remote at https://repository.apache.org/content/repositories/snapshots
Transferring 32K from remote
Uploaded 32K

:tapestry-internal-test:compileJava
:tapestry-internal-test:compileGroovy UP-TO-DATE
:tapestry-internal-test:processResources
:tapestry-internal-test:classes
:tapestry-internal-test:jar
:tapestry-internal-test:sourcesJar
:tapestry-internal-test:assemble
:tapestry-internal-test:compileTestJava UP-TO-DATE
:tapestry-internal-test:compileTestGroovy UP-TO-DATE
:tapestry-internal-test:processTestResources UP-TO-DATE
:tapestry-internal-test:testClasses UP-TO-DATE
:tapestry-internal-test:test UP-TO-DATE
:tapestry-internal-test:check UP-TO-DATE
:tapestry-internal-test:build
:tapestry-internal-test:uploadPublishedUploading: org/apache/tapestry/tapestry-internal-test/5.4-SNAPSHOT/tapestry-internal-test-5.4-20140506.034649-82.jar
to repository remote at https://repository.apache.org/content/repositories/snapshots
Transferring 3K from remote
Uploaded 3K
Uploading: org/apache/tapestry/tapestry-internal-test/5.4-SNAPSHOT/tapestry-internal-test-5.4-20140506.034649-82-sources.jar
to repository remote at https://repository.apache.org/content/repositories/snapshots
Transferring 3K from remote
Uploaded 3K

:tapestry-ioc:sourcesJar
:tapestry-ioc:assemble
:tapestry-ioc:compileTestJavaNote: /x1/jenkins/jenkins-slave/workspace/tapestry-trunk-freestyle/tapestry-ioc/src/test/java/org/apache/tapestry5/ioc/FieldResourceServiceImpl.java
uses or overrides a deprecated API.
Note: Recompile with -Xlint:deprecation for details.
Note: Some input files use unchecked or unsafe operations.
Note: Recompile with -Xlint:unchecked for details.

:tapestry-ioc:compileTestGroovy
:tapestry-ioc:processTestResources
:tapestry-ioc:testClasses
:tapestry-ioc:test

ioc.specs.ReloadSpec > reload a proxy object FAILED
    org.spockframework.runtime.SpockComparisonFailure at ReloadSpec.groovy:289

700 tests completed, 1 failed, 2 skipped
:tapestry-ioc:test FAILED

FAILURE: Build failed with an exception.

* What went wrong:
Execution failed for task ':tapestry-ioc:test'.
> There were failing tests. See the report at: file:///x1/jenkins/jenkins-slave/workspace/tapestry-trunk-freestyle/tapestry-ioc/build/reports/tests/index.html

* Try:
Run with --stacktrace option to get the stack trace. Run with --info or --debug option to
get more log output.

BUILD FAILED

Total time: 10 mins 45.39 secs
Build step 'Execute shell' marked build as failure
Recording test results
TestNG Reports Processing: START
Looking for TestNG results report in workspace using pattern: **/build/reports/tests/testng-results.xml
Did not find any matching files.

---------------------------------------------------------------------
To unsubscribe, e-mail: dev-unsubscribe@tapestry.apache.org
For additional commands, e-mail: dev-help@tapestry.apache.org


Mime
View raw message