tamaya-commits mailing list archives

Site index · List index
Message view « Date » · « Thread »
Top « Date » · « Thread »
From Apache Jenkins Server <jenk...@builds.apache.org>
Subject Build failed in Jenkins: Tamaya-Sandbox-Master » Apache Tamaya Modules - Documentation #4138
Date Sat, 23 Nov 2019 01:02:58 GMT
See <https://builds.apache.org/job/Tamaya-Sandbox-Master/org.apache.tamaya.ext$tamaya-doc_alpha/4138/display/redirect>

Changes:


------------------------------------------
[INFO]                                                                         
[INFO] ------------------------------------------------------------------------
[INFO] Building Apache Tamaya Modules - Documentation 0.4-incubating-SNAPSHOT
[INFO] ------------------------------------------------------------------------
[INFO] Downloading: https://repo.maven.apache.org/maven2/com/j2html/j2html/1.4.0/j2html-1.4.0.pom
[INFO] Downloaded: https://repo.maven.apache.org/maven2/com/j2html/j2html/1.4.0/j2html-1.4.0.pom
(7 KB at 361.5 KB/sec)
[INFO] Downloading: https://repo.maven.apache.org/maven2/com/j2html/j2html/1.4.0/j2html-1.4.0.jar
[INFO] Downloaded: https://repo.maven.apache.org/maven2/com/j2html/j2html/1.4.0/j2html-1.4.0.jar
(56 KB at 2665.0 KB/sec)
[INFO] ------------------------------------------------------------------------
[INFO] Reactor Summary:
[INFO] 
[INFO] Apache Tamaya Sandbox .............................. SUCCESS [ 43.500 s]
[INFO] Apache Tamaya Modules - Apache Commons ............. FAILURE [  2.311 s]
[INFO] Apache Tamaya Modules - Joda-Time Support .......... SUCCESS [01:35 min]
[INFO] Apache Tamaya Modules - Usage tracker .............. FAILURE [  2.255 s]
[INFO] Apache Tamaya Modules - Documentation .............. FAILURE [  0.542 s]
[INFO] Apache Tamaya Modules - Validation ................. SKIPPED
[INFO] Apache Tamaya Modules - Remote PropertySource ...... FAILURE [  0.443 s]
[INFO] Apache Tamaya Modules - Configured System Properties SUCCESS [ 37.418 s]
[INFO] Apache Tamaya Modules - Apache Camel Support ....... FAILURE [  1.169 s]
[INFO] Apache Tamaya Modules - PropertySources ............ FAILURE [  1.087 s]
[INFO] Apache Tamaya Modules - JMX Support ................ FAILURE [  0.425 s]
[INFO] Apache Tamaya Modules - Metamodel .................. FAILURE [  0.951 s]
[INFO] Apache Tamaya Modules - Units of Measurement Support SUCCESS [ 37.439 s]
[INFO] Apache Tamaya Modules - Vertx Support .............. FAILURE [  1.772 s]
[INFO] Apache Tamaya Modules - JSR 382 Implementation ..... FAILURE [  9.358 s]
[INFO] ------------------------------------------------------------------------
[INFO] BUILD FAILURE
[INFO] ------------------------------------------------------------------------
[INFO] Total time: 05:03 min
[INFO] Finished at: 2019-11-23T01:02:46+00:00
[INFO] Final Memory: 86M/3925M
[INFO] ------------------------------------------------------------------------
[ERROR] Failed to execute goal on project tamaya-commons-config_beta: Could not resolve dependencies
for project org.apache.tamaya.ext:tamaya-commons-config_beta:jar:0.4-incubating-SNAPSHOT:
Could not find artifact org.apache.tamaya.ext:tamaya-formats:jar:0.4-incubating-SNAPSHOT in
Nexus (http://repository.apache.org/snapshots) -> [Help 1]
[ERROR] Failed to execute goal on project tamaya-usagetracker_beta: Could not resolve dependencies
for project org.apache.tamaya.ext:tamaya-usagetracker_beta:jar:0.4-incubating-SNAPSHOT: The
following artifacts could not be resolved: org.apache.tamaya.ext:tamaya-injection-api:jar:0.4-incubating-SNAPSHOT,
org.apache.tamaya.ext:tamaya-events:jar:0.4-incubating-SNAPSHOT, org.apache.tamaya.ext:tamaya-json:jar:0.4-incubating-SNAPSHOT:
Could not find artifact org.apache.tamaya.ext:tamaya-injection-api:jar:0.4-incubating-SNAPSHOT
in Nexus (http://repository.apache.org/snapshots) -> [Help 1]
[ERROR] Failed to execute goal on project tamaya-doc_alpha: Could not resolve dependencies
for project org.apache.tamaya.ext:tamaya-doc_alpha:jar:0.4-incubating-SNAPSHOT: Failure to
find org.apache.tamaya.ext:tamaya-injection-api:jar:0.4-incubating-SNAPSHOT in http://repository.apache.org/snapshots
was cached in the local repository, resolution will not be reattempted until the update interval
of Nexus has elapsed or updates are forced -> [Help 1]
[ERROR] Failed to execute goal on project tamaya-remote_alpha: Could not resolve dependencies
for project org.apache.tamaya.ext:tamaya-remote_alpha:jar:0.4-incubating-SNAPSHOT: Failure
to find org.apache.tamaya.ext:tamaya-json:jar:0.4-incubating-SNAPSHOT in http://repository.apache.org/snapshots
was cached in the local repository, resolution will not be reattempted until the update interval
of Nexus has elapsed or updates are forced -> [Help 1]
[ERROR] Failed to execute goal on project tamaya-camel_beta: Could not resolve dependencies
for project org.apache.tamaya.ext:tamaya-camel_beta:jar:0.4-incubating-SNAPSHOT: Could not
find artifact org.apache.tamaya.ext:tamaya-functions:jar:0.4-incubating-SNAPSHOT in Nexus
(http://repository.apache.org/snapshots) -> [Help 1]
[ERROR] Failed to execute goal on project tamaya-propertysources_alpha: Could not resolve
dependencies for project org.apache.tamaya.ext:tamaya-propertysources_alpha:jar:0.4-incubating-SNAPSHOT:
The following artifacts could not be resolved: org.apache.tamaya.ext:tamaya-resources:jar:0.4-incubating-SNAPSHOT,
org.apache.tamaya.ext:tamaya-formats:jar:0.4-incubating-SNAPSHOT: Could not find artifact
org.apache.tamaya.ext:tamaya-resources:jar:0.4-incubating-SNAPSHOT in Nexus (http://repository.apache.org/snapshots)
-> [Help 1]
[ERROR] Failed to execute goal on project tamaya-management_alpha: Could not resolve dependencies
for project org.apache.tamaya.ext:tamaya-management_alpha:jar:0.4-incubating-SNAPSHOT: Failure
to find org.apache.tamaya.ext:tamaya-functions:jar:0.4-incubating-SNAPSHOT in http://repository.apache.org/snapshots
was cached in the local repository, resolution will not be reattempted until the update interval
of Nexus has elapsed or updates are forced -> [Help 1]
[ERROR] Failed to execute goal on project tamaya-metamodel_alpha: Could not resolve dependencies
for project org.apache.tamaya.ext:tamaya-metamodel_alpha:jar:0.4-incubating-SNAPSHOT: The
following artifacts could not be resolved: org.apache.tamaya.ext:tamaya-injection-api:jar:0.4-incubating-SNAPSHOT,
org.apache.tamaya.ext:tamaya-hocon:jar:0.4-incubating-SNAPSHOT, org.apache.tamaya.ext:tamaya-events:jar:0.4-incubating-SNAPSHOT,
org.apache.tamaya.ext:tamaya-formats:jar:0.4-incubating-SNAPSHOT, org.apache.tamaya.ext:tamaya-resources:jar:0.4-incubating-SNAPSHOT:
Failure to find org.apache.tamaya.ext:tamaya-injection-api:jar:0.4-incubating-SNAPSHOT in
http://repository.apache.org/snapshots was cached in the local repository, resolution will
not be reattempted until the update interval of Nexus has elapsed or updates are forced ->
[Help 1]
[ERROR] Failed to execute goal on project tamaya-vertx-alpha: Could not resolve dependencies
for project org.apache.tamaya.ext:tamaya-vertx-alpha:jar:0.4-incubating-SNAPSHOT: The following
artifacts could not be resolved: org.apache.tamaya.ext:tamaya-injection-api:jar:0.4-incubating-SNAPSHOT,
org.apache.tamaya.ext:tamaya-events:jar:0.4-incubating-SNAPSHOT, org.apache.tamaya.ext:tamaya-injection:jar:0.4-incubating-SNAPSHOT:
Failure to find org.apache.tamaya.ext:tamaya-injection-api:jar:0.4-incubating-SNAPSHOT in
http://repository.apache.org/snapshots was cached in the local repository, resolution will
not be reattempted until the update interval of Nexus has elapsed or updates are forced ->
[Help 1]
[ERROR] Failed to execute goal on project tamaya-jsr382: Could not resolve dependencies for
project org.apache.tamaya.ext:tamaya-jsr382:jar:0.4-incubating-SNAPSHOT: The following artifacts
could not be resolved: org.apache.tamaya.ext:tamaya-injection-api:jar:0.4-incubating-SNAPSHOT,
org.apache.tamaya.ext:tamaya-functions:jar:0.4-incubating-SNAPSHOT, org.apache.tamaya.ext:tamaya-events:jar:0.4-incubating-SNAPSHOT:
Could not find artifact org.apache.tamaya.ext:tamaya-injection-api:jar:0.4-incubating-SNAPSHOT
in jitpack.io (https://jitpack.io) -> [Help 1]
[ERROR] 
[ERROR] To see the full stack trace of the errors, re-run Maven with the -e switch.
[ERROR] Re-run Maven using the -X switch to enable full debug logging.
[ERROR] 
[ERROR] For more information about the errors and possible solutions, please read the following
articles:
[ERROR] [Help 1] http://cwiki.apache.org/confluence/display/MAVEN/DependencyResolutionException
[ERROR] 
[ERROR] After correcting the problems, you can resume the build with the command
[ERROR]   mvn <goals> -rf :tamaya-commons-config_beta

Mime
View raw message