tamaya-commits mailing list archives

Site index · List index
Message view « Date » · « Thread »
Top « Date » · « Thread »
From Apache Jenkins Server <jenk...@builds.apache.org>
Subject Build failed in Jenkins: Tamaya-Extensions-Master-with-Coverage #1804
Date Mon, 11 Nov 2019 19:00:31 GMT
See <https://builds.apache.org/job/Tamaya-Extensions-Master-with-Coverage/1804/display/redirect>

Changes:


------------------------------------------
[...truncated 382.06 KB...]
[INFO] Storing buildNumber: b6172119 at timestamp: 1573498704819
[WARNING] Cannot get the branch information from the git repository: 
Detecting the current branch failed: fatal: ref HEAD is not a symbolic ref

[INFO] ShortRevision tag detected. The value is '8'.
[INFO] Executing: /bin/sh -c cd '<https://builds.apache.org/job/Tamaya-Extensions-Master-with-Coverage/ws/examples/01-resources-example'>
&& 'git' 'rev-parse' '--verify' '--short=8' 'HEAD'
[INFO] Working directory: <https://builds.apache.org/job/Tamaya-Extensions-Master-with-Coverage/ws/examples/01-resources-example>
[INFO] Storing buildScmBranch: UNKNOWN
[INFO] 
[INFO] --- maven-remote-resources-plugin:1.5:process (process-resource-bundles) @ 01-resources-example
---
[INFO] 
[INFO] --- karaf-maven-plugin:4.0.5:features-generate-descriptor (generate) @ 01-resources-example
---
[INFO] Generating feature descriptor file <https://builds.apache.org/job/Tamaya-Extensions-Master-with-Coverage/ws/examples/01-resources-example/target/feature/feature.xml>
[INFO] ...done!
[INFO] 
[INFO] --- maven-resources-plugin:3.1.0:resources (default-resources) @ 01-resources-example
---
[INFO] Using 'UTF-8' encoding to copy filtered resources.
[INFO] Copying 6 resources
[INFO] Copying 3 resources
[INFO] 
[INFO] --- maven-compiler-plugin:3.7.0:compile (default-compile) @ 01-resources-example ---
[INFO] Changes detected - recompiling the module!
[INFO] Compiling 3 source files to <https://builds.apache.org/job/Tamaya-Extensions-Master-with-Coverage/ws/examples/01-resources-example/target/classes>
[WARNING] <https://builds.apache.org/job/Tamaya-Extensions-Master-with-Coverage/ws/examples/01-resources-example/src/main/java/org/apache/tamaya/ext/examples/resources/Main.java>:[22,25]
org.apache.tamaya.ConfigurationProvider in org.apache.tamaya has been deprecated
[INFO] 
[INFO] --- bnd-maven-plugin:3.3.0:bnd-process (default) @ 01-resources-example ---
[INFO] 
[INFO] --- maven-resources-plugin:3.1.0:testResources (default-testResources) @ 01-resources-example
---
[INFO] Using 'UTF-8' encoding to copy filtered resources.
[INFO] skip non existing resourceDirectory <https://builds.apache.org/job/Tamaya-Extensions-Master-with-Coverage/ws/examples/01-resources-example/src/test/resources>
[INFO] Copying 3 resources
[INFO] 
[INFO] --- maven-compiler-plugin:3.7.0:testCompile (default-testCompile) @ 01-resources-example
---
[INFO] No sources to compile
[INFO] 
[INFO] --- maven-surefire-plugin:2.21.0:test (default-test) @ 01-resources-example ---
[JENKINS] Recording test results
[INFO] 
[INFO] --- maven-jar-plugin:3.1.0:jar (default-jar) @ 01-resources-example ---
[INFO] Building jar: <https://builds.apache.org/job/Tamaya-Extensions-Master-with-Coverage/ws/examples/01-resources-example/target/01-resources-example-0.4-incubating.jar>
[INFO] 
[INFO] --- maven-site-plugin:3.7:attach-descriptor (attach-descriptor) @ 01-resources-example
---
[INFO] Skipping because packaging 'jar' is not pom.
[INFO] 
[INFO] --- maven-javadoc-plugin:3.0.1:jar (attach-javadocs) @ 01-resources-example ---
[INFO] Building jar: <https://builds.apache.org/job/Tamaya-Extensions-Master-with-Coverage/ws/examples/01-resources-example/target/01-resources-example-0.4-incubating-javadoc.jar>
[INFO] 
[INFO] >>> maven-source-plugin:3.0.1:jar (source-jar) > generate-sources @ 01-resources-example
>>>
[INFO] 
[INFO] --- maven-enforcer-plugin:3.0.0-M1:enforce (enforce-maven-version) @ 01-resources-example
---
[INFO] 
[INFO] --- maven-enforcer-plugin:3.0.0-M1:enforce (enforce-versions) @ 01-resources-example
---
[INFO] 
[INFO] --- apache-rat-plugin:0.13:check (default) @ 01-resources-example ---
[INFO] Enabled default license matchers.
[INFO] Will parse SCM ignores for exclusions...
[INFO] Finished adding exclusions from SCM ignore files.
[INFO] 62 implicit excludes (use -debug for more details).
[INFO] 12 explicit excludes (use -debug for more details).
[INFO] 10 resources included (use -debug for more details)
[INFO] Rat check: Summary over all files. Unapproved: 0, unknown: 0, generated: 0, approved:
10 licenses.
[INFO] 
[INFO] --- buildnumber-maven-plugin:1.4:create (default) @ 01-resources-example ---
[INFO] ShortRevision tag detected. The value is '8'.
[INFO] Executing: /bin/sh -c cd '<https://builds.apache.org/job/Tamaya-Extensions-Master-with-Coverage/ws/examples/01-resources-example'>
&& 'git' 'rev-parse' '--verify' '--short=8' 'HEAD'
[INFO] Working directory: <https://builds.apache.org/job/Tamaya-Extensions-Master-with-Coverage/ws/examples/01-resources-example>
[INFO] Storing buildNumber: b6172119 at timestamp: 1573498709387
[WARNING] Cannot get the branch information from the git repository: 
Detecting the current branch failed: fatal: ref HEAD is not a symbolic ref

[INFO] ShortRevision tag detected. The value is '8'.
[INFO] Executing: /bin/sh -c cd '<https://builds.apache.org/job/Tamaya-Extensions-Master-with-Coverage/ws/examples/01-resources-example'>
&& 'git' 'rev-parse' '--verify' '--short=8' 'HEAD'
[INFO] Working directory: <https://builds.apache.org/job/Tamaya-Extensions-Master-with-Coverage/ws/examples/01-resources-example>
[INFO] Storing buildScmBranch: UNKNOWN
[WARNING] Failed to getClass for org.apache.maven.plugins.source.SourceJarMojo
[INFO] 
[INFO] <<< maven-source-plugin:3.0.1:jar (source-jar) < generate-sources @ 01-resources-example
<<<
[INFO] 
[INFO] 
[INFO] --- maven-source-plugin:3.0.1:jar (source-jar) @ 01-resources-example ---
[INFO] Building jar: <https://builds.apache.org/job/Tamaya-Extensions-Master-with-Coverage/ws/examples/01-resources-example/target/01-resources-example-0.4-incubating-sources.jar>
[INFO] 
[INFO] --- maven-failsafe-plugin:2.21.0:integration-test (default) @ 01-resources-example
---
[JENKINS] Recording test results
[INFO] 
[INFO] --- maven-failsafe-plugin:2.21.0:verify (default) @ 01-resources-example ---
[JENKINS] Recording test results
[INFO] 
[INFO] --- pitest-maven:1.4.3:mutationCoverage (mutationcoverage) @ 01-resources-example ---
[INFO] Skipping project because:
[INFO]   - Execution of PIT should be skipped.
[INFO]   - Project has no tests, it is empty.
[INFO] 
[INFO] --- maven-install-plugin:2.5.2:install (default-install) @ 01-resources-example ---
[INFO] Installing <https://builds.apache.org/job/Tamaya-Extensions-Master-with-Coverage/ws/examples/01-resources-example/target/01-resources-example-0.4-incubating.jar>
to /home/jenkins/jenkins-slave/maven-repositories/1/org/apache/tamaya/ext/examples/01-resources-example/0.4-incubating/01-resources-example-0.4-incubating.jar
[INFO] Installing <https://builds.apache.org/job/Tamaya-Extensions-Master-with-Coverage/ws/examples/01-resources-example/pom.xml>
to /home/jenkins/jenkins-slave/maven-repositories/1/org/apache/tamaya/ext/examples/01-resources-example/0.4-incubating/01-resources-example-0.4-incubating.pom
[INFO] Installing <https://builds.apache.org/job/Tamaya-Extensions-Master-with-Coverage/ws/examples/01-resources-example/target/feature/feature.xml>
to /home/jenkins/jenkins-slave/maven-repositories/1/org/apache/tamaya/ext/examples/01-resources-example/0.4-incubating/01-resources-example-0.4-incubating-features.xml
[INFO] Installing <https://builds.apache.org/job/Tamaya-Extensions-Master-with-Coverage/ws/examples/01-resources-example/target/01-resources-example-0.4-incubating-javadoc.jar>
to /home/jenkins/jenkins-slave/maven-repositories/1/org/apache/tamaya/ext/examples/01-resources-example/0.4-incubating/01-resources-example-0.4-incubating-javadoc.jar
[INFO] Installing <https://builds.apache.org/job/Tamaya-Extensions-Master-with-Coverage/ws/examples/01-resources-example/target/01-resources-example-0.4-incubating-sources.jar>
to /home/jenkins/jenkins-slave/maven-repositories/1/org/apache/tamaya/ext/examples/01-resources-example/0.4-incubating/01-resources-example-0.4-incubating-sources.jar
[INFO] 
[INFO] ---------------< org.apache.tamaya.ext:tamaya-resolver >----------------
[INFO] Building Apache Tamaya Modules - Placeholder Resolver 0.4-incubating [6/41]
[INFO] --------------------------------[ jar ]---------------------------------
[INFO] 
[INFO] --- maven-clean-plugin:3.1.0:clean (default-clean) @ tamaya-resolver ---
[INFO] 
[INFO] --- maven-enforcer-plugin:3.0.0-M1:enforce (enforce-maven-version) @ tamaya-resolver
---
[INFO] 
[INFO] --- maven-enforcer-plugin:3.0.0-M1:enforce (enforce-versions) @ tamaya-resolver ---
[INFO] 
[INFO] --- apache-rat-plugin:0.13:check (default) @ tamaya-resolver ---
[INFO] Enabled default license matchers.
[INFO] Will parse SCM ignores for exclusions...
[INFO] Finished adding exclusions from SCM ignore files.
[INFO] 62 implicit excludes (use -debug for more details).
[INFO] 12 explicit excludes (use -debug for more details).
[INFO] 26 resources included (use -debug for more details)
[INFO] Rat check: Summary over all files. Unapproved: 0, unknown: 0, generated: 0, approved:
26 licenses.
[INFO] 
[INFO] --- buildnumber-maven-plugin:1.4:create (default) @ tamaya-resolver ---
[INFO] ShortRevision tag detected. The value is '8'.
[INFO] Executing: /bin/sh -c cd '<https://builds.apache.org/job/Tamaya-Extensions-Master-with-Coverage/ws/modules/resolver'>
&& 'git' 'rev-parse' '--verify' '--short=8' 'HEAD'
[INFO] Working directory: <https://builds.apache.org/job/Tamaya-Extensions-Master-with-Coverage/ws/modules/resolver>
[INFO] Storing buildNumber: b6172119 at timestamp: 1573498716562
[WARNING] Cannot get the branch information from the git repository: 
Detecting the current branch failed: fatal: ref HEAD is not a symbolic ref

[INFO] ShortRevision tag detected. The value is '8'.
[INFO] Executing: /bin/sh -c cd '<https://builds.apache.org/job/Tamaya-Extensions-Master-with-Coverage/ws/modules/resolver'>
&& 'git' 'rev-parse' '--verify' '--short=8' 'HEAD'
[INFO] Working directory: <https://builds.apache.org/job/Tamaya-Extensions-Master-with-Coverage/ws/modules/resolver>
[INFO] Storing buildScmBranch: UNKNOWN
[INFO] 
[INFO] --- maven-checkstyle-plugin:3.0.0:check (checkstyle) @ tamaya-resolver ---
[INFO] ------------------------------------------------------------------------
[INFO] Reactor Summary for Apache Tamaya Extensions 0.4-incubating:
[INFO] 
[INFO] Apache Tamaya Extensions ........................... SUCCESS [ 23.999 s]
[INFO] Apache Tamaya Extension Modules .................... SUCCESS [  5.413 s]
[INFO] Apache Tamaya Modules - Resource Locator ........... SUCCESS [01:06 min]
[INFO] Apache Tamaya Extensions Examples .................. SUCCESS [  4.168 s]
[INFO] Apache Tamaya Resource Location Example ............ SUCCESS [  7.396 s]
[INFO] Apache Tamaya Modules - Placeholder Resolver ....... FAILURE [  1.894 s]
[INFO] Apache Tamaya Value Resolution Example ............. SKIPPED
[INFO] Apache Tamaya Modules - Injection Parent ........... SKIPPED
[INFO] Apache Tamaya Modules - Injection API .............. SKIPPED
[INFO] Apache Tamaya Modules - Common Functional Extensions SKIPPED
[INFO] Apache Tamaya Event and dynamic Update Extensions .. SKIPPED
[INFO] Apache Tamaya Modules - Injection Standalone ....... SKIPPED
[INFO] Apache Tamaya Configuration Injection Example ...... SKIPPED
[INFO] Apache Tamaya Modules - Formats Parent ............. SKIPPED
[INFO] Apache Tamaya Modules - Formats Common ............. SKIPPED
[INFO] Apache Tamaya Events Example ....................... SKIPPED
[INFO] Apache Tamaya Spring Integration ................... SKIPPED
[INFO] Apache Tamaya Spring Example ....................... SKIPPED
[INFO] Apache Tamaya Modules - Mutable Configuration ...... SKIPPED
[INFO] Apache Tamaya Modules - Hazelcast PropertySource ... SKIPPED
[INFO] Apache Tamaya Example: Distributed Configuration ... SKIPPED
[INFO] Apache Tamaya Modules - Optional Backend ........... SKIPPED
[INFO] Apache Tamaya Modules - Injection CDI .............. SKIPPED
[INFO] Apache Tamaya Adaptive Configuration Filtering ..... SKIPPED
[INFO] Apache Tamaya JNDI Support ......................... SKIPPED
[INFO] Apache Tamaya Feature Check ........................ SKIPPED
[INFO] Apache Tamaya JSON Support ......................... SKIPPED
[INFO] Apache Tamaya Modules - HJSON Support .............. SKIPPED
[INFO] Apache Tamaya YAML Support ......................... SKIPPED
[INFO] Apache Tamaya Modules - HOCON Support .............. SKIPPED
[INFO] Apache Tamaya :: OSGi Integration :: ALL ........... SKIPPED
[INFO] Apache Tamaya :: OSGi :: Common .................... SKIPPED
[INFO] Apache Tamaya :: OSGi :: Updater ................... SKIPPED
[INFO] Apache Tamaya :: OSGI :: Karaf :: Shell ............ SKIPPED
[INFO] Apache Tamaya :: OSGI :: Karaf :: Features ......... SKIPPED
[INFO] Apache Tamaya :: OSGI :: Gogo :: Shell ............. SKIPPED
[INFO] Apache Tamaya :: OSGI :: Config Injection .......... SKIPPED
[INFO] Apache Tamaya Modules - Collections Support ........ SKIPPED
[INFO] Apache Tamaya Modules - Microprofile API ........... SKIPPED
[INFO] Apache Tamaya Modules - etcd PropertySource ........ SKIPPED
[INFO] Apache Tamaya Modules - Consul PropertySource ...... SKIPPED
[INFO] ------------------------------------------------------------------------
[INFO] BUILD FAILURE
[INFO] ------------------------------------------------------------------------
[INFO] Total time:  02:44 min
[INFO] Finished at: 2019-11-11T18:59:09Z
[INFO] ------------------------------------------------------------------------
Waiting for Jenkins to finish collecting data
[ERROR] Failed to execute goal org.apache.maven.plugins:maven-checkstyle-plugin:3.0.0:check
(checkstyle) on project tamaya-resolver: Failed during checkstyle configuration: Exception
was thrown while processing <https://builds.apache.org/job/Tamaya-Extensions-Master-with-Coverage/ws/modules/resolver/src/test/java/org/apache/tamaya/resolver/ManualSetupTest.java>:
IllegalStateException occurred while parsing file <https://builds.apache.org/job/Tamaya-Extensions-Master-with-Coverage/ws/modules/resolver/src/test/java/org/apache/tamaya/resolver/ManualSetupTest.java.>
<https://builds.apache.org/job/Tamaya-Extensions-Master-with-Coverage/ws/modules/resolver/src/test/java/org/apache/tamaya/resolver/ManualSetupTest.java>:46:1:
expecting RCURLY, found '<<' -> [Help 1]
[ERROR] 
[ERROR] To see the full stack trace of the errors, re-run Maven with the -e switch.
[ERROR] Re-run Maven using the -X switch to enable full debug logging.
[ERROR] 
[ERROR] For more information about the errors and possible solutions, please read the following
articles:
[ERROR] [Help 1] http://cwiki.apache.org/confluence/display/MAVEN/MojoExecutionException
[ERROR] 
[ERROR] After correcting the problems, you can resume the build with the command
[ERROR]   mvn <goals> -rf :tamaya-resolver
[JENKINS] Archiving <https://builds.apache.org/job/Tamaya-Extensions-Master-with-Coverage/ws/modules/pom.xml>
to org.apache.tamaya.ext/tamaya-extensions/0.4-incubating/tamaya-extensions-0.4-incubating.pom
[JENKINS] Archiving <https://builds.apache.org/job/Tamaya-Extensions-Master-with-Coverage/ws/modules/target/feature/feature.xml>
to org.apache.tamaya.ext/tamaya-extensions/0.4-incubating/tamaya-extensions-0.4-incubating-features.xml
[JENKINS] Archiving <https://builds.apache.org/job/Tamaya-Extensions-Master-with-Coverage/ws/modules/events/pom.xml>
to org.apache.tamaya.ext/tamaya-events/0.4-incubating/tamaya-events-0.4-incubating.pom
[JENKINS] Archiving <https://builds.apache.org/job/Tamaya-Extensions-Master-with-Coverage/ws/modules/formats/base/pom.xml>
to org.apache.tamaya.ext/tamaya-formats/0.4-incubating/tamaya-formats-0.4-incubating.pom
[JENKINS] Archiving <https://builds.apache.org/job/Tamaya-Extensions-Master-with-Coverage/ws/modules/features/pom.xml>
to org.apache.tamaya.ext/tamaya-features/0.4-incubating/tamaya-features-0.4-incubating.pom
[JENKINS] Archiving <https://builds.apache.org/job/Tamaya-Extensions-Master-with-Coverage/ws/examples/05-spring-example/pom.xml>
to org.apache.tamaya.ext.examples/05-spring-example/0.4-incubating/05-spring-example-0.4-incubating.pom
[JENKINS] Archiving <https://builds.apache.org/job/Tamaya-Extensions-Master-with-Coverage/ws/modules/formats/pom.xml>
to org.apache.tamaya.ext/tamaya-formats-all/0.4-incubating/tamaya-formats-all-0.4-incubating.pom
[JENKINS] Archiving <https://builds.apache.org/job/Tamaya-Extensions-Master-with-Coverage/ws/pom.xml>
to org.apache.tamaya.ext/tamaya-extensions-all/0.4-incubating/tamaya-extensions-all-0.4-incubating.pom
[JENKINS] Archiving <https://builds.apache.org/job/Tamaya-Extensions-Master-with-Coverage/ws/target/feature/feature.xml>
to org.apache.tamaya.ext/tamaya-extensions-all/0.4-incubating/tamaya-extensions-all-0.4-incubating-features.xml
[Fast Archiver] Compressed 45.72 KB of artifacts by 70.0% relative to #1803
[JENKINS] Archiving <https://builds.apache.org/job/Tamaya-Extensions-Master-with-Coverage/ws/modules/osgi/karaf-shell/pom.xml>
to org.apache.tamaya.ext/tamaya-osgi-karaf-shell/0.4-incubating/tamaya-osgi-karaf-shell-0.4-incubating.pom
[JENKINS] Archiving <https://builds.apache.org/job/Tamaya-Extensions-Master-with-Coverage/ws/modules/formats/hjson/pom.xml>
to org.apache.tamaya.ext/tamaya-hjson/0.4-incubating/tamaya-hjson-0.4-incubating.pom
[JENKINS] Archiving <https://builds.apache.org/job/Tamaya-Extensions-Master-with-Coverage/ws/modules/microprofile/pom.xml>
to org.apache.tamaya.ext/tamaya-microprofile/0.4-incubating/tamaya-microprofile-0.4-incubating.pom
[JENKINS] Archiving <https://builds.apache.org/job/Tamaya-Extensions-Master-with-Coverage/ws/modules/jndi/pom.xml>
to org.apache.tamaya.ext/tamaya-jndi/0.4-incubating/tamaya-jndi-0.4-incubating.pom
[JENKINS] Archiving <https://builds.apache.org/job/Tamaya-Extensions-Master-with-Coverage/ws/modules/osgi/common/pom.xml>
to org.apache.tamaya.ext/tamaya-osgi/0.4-incubating/tamaya-osgi-0.4-incubating.pom
[JENKINS] Archiving <https://builds.apache.org/job/Tamaya-Extensions-Master-with-Coverage/ws/modules/hazelcast/pom.xml>
to org.apache.tamaya.ext/tamaya-hazelcast/0.4-incubating/tamaya-hazelcast-0.4-incubating.pom
[JENKINS] Archiving <https://builds.apache.org/job/Tamaya-Extensions-Master-with-Coverage/ws/examples/03-injection-example/pom.xml>
to org.apache.tamaya.ext.examples/03-injection-example/0.4-incubating/03-injection-example-0.4-incubating.pom
[JENKINS] Archiving <https://builds.apache.org/job/Tamaya-Extensions-Master-with-Coverage/ws/modules/collections/pom.xml>
to org.apache.tamaya.ext/tamaya-collections/0.4-incubating/tamaya-collections-0.4-incubating.pom
[JENKINS] Archiving <https://builds.apache.org/job/Tamaya-Extensions-Master-with-Coverage/ws/modules/optional/pom.xml>
to org.apache.tamaya.ext/tamaya-optional/0.4-incubating/tamaya-optional-0.4-incubating.pom
[JENKINS] Archiving <https://builds.apache.org/job/Tamaya-Extensions-Master-with-Coverage/ws/modules/resolver/pom.xml>
to org.apache.tamaya.ext/tamaya-resolver/0.4-incubating/tamaya-resolver-0.4-incubating.pom
[JENKINS] Archiving <https://builds.apache.org/job/Tamaya-Extensions-Master-with-Coverage/ws/examples/pom.xml>
to org.apache.tamaya.ext.examples/examples/0.4-incubating/examples-0.4-incubating.pom
[JENKINS] Archiving <https://builds.apache.org/job/Tamaya-Extensions-Master-with-Coverage/ws/examples/target/feature/feature.xml>
to org.apache.tamaya.ext.examples/examples/0.4-incubating/examples-0.4-incubating-features.xml
[JENKINS] Archiving <https://builds.apache.org/job/Tamaya-Extensions-Master-with-Coverage/ws/modules/osgi/karaf-features/pom.xml>
to org.apache.tamaya.ext/tamaya-karaf-features/0.4-incubating/tamaya-karaf-features-0.4-incubating.pom
[JENKINS] Archiving <https://builds.apache.org/job/Tamaya-Extensions-Master-with-Coverage/ws/modules/filter/pom.xml>
to org.apache.tamaya.ext/tamaya-filter/0.4-incubating/tamaya-filter-0.4-incubating.pom
[JENKINS] Archiving <https://builds.apache.org/job/Tamaya-Extensions-Master-with-Coverage/ws/modules/spring/pom.xml>
to org.apache.tamaya.ext/tamaya-spring/0.4-incubating/tamaya-spring-0.4-incubating.pom
[JENKINS] Archiving <https://builds.apache.org/job/Tamaya-Extensions-Master-with-Coverage/ws/examples/02-resolver-example/pom.xml>
to org.apache.tamaya.ext.examples/02-resolver-example/0.4-incubating/02-resolver-example-0.4-incubating.pom
[JENKINS] Archiving <https://builds.apache.org/job/Tamaya-Extensions-Master-with-Coverage/ws/modules/osgi/pom.xml>
to org.apache.tamaya.ext/tamaya-osgi-all/0.4-incubating/tamaya-osgi-all-0.4-incubating.pom
[JENKINS] Archiving <https://builds.apache.org/job/Tamaya-Extensions-Master-with-Coverage/ws/modules/osgi/updater/pom.xml>
to org.apache.tamaya.ext/tamaya-osgi-updater/0.4-incubating/tamaya-osgi-updater-0.4-incubating.pom
[JENKINS] Archiving <https://builds.apache.org/job/Tamaya-Extensions-Master-with-Coverage/ws/modules/injection/cdi/pom.xml>
to org.apache.tamaya.ext/tamaya-cdi/0.4-incubating/tamaya-cdi-0.4-incubating.pom
[JENKINS] Archiving <https://builds.apache.org/job/Tamaya-Extensions-Master-with-Coverage/ws/modules/formats/yaml/pom.xml>
to org.apache.tamaya.ext/tamaya-yaml/0.4-incubating/tamaya-yaml-0.4-incubating.pom
[JENKINS] Archiving <https://builds.apache.org/job/Tamaya-Extensions-Master-with-Coverage/ws/modules/mutable-config/pom.xml>
to org.apache.tamaya.ext/tamaya-mutable-config/0.4-incubating/tamaya-mutable-config-0.4-incubating.pom
[JENKINS] Archiving <https://builds.apache.org/job/Tamaya-Extensions-Master-with-Coverage/ws/modules/injection/injection-api/pom.xml>
to org.apache.tamaya.ext/tamaya-injection-api/0.4-incubating/tamaya-injection-api-0.4-incubating.pom
[JENKINS] Archiving <https://builds.apache.org/job/Tamaya-Extensions-Master-with-Coverage/ws/modules/etcd/pom.xml>
to org.apache.tamaya.ext/tamaya-etcd/0.4-incubating/tamaya-etcd-0.4-incubating.pom
[JENKINS] Archiving <https://builds.apache.org/job/Tamaya-Extensions-Master-with-Coverage/ws/modules/resources/pom.xml>
to org.apache.tamaya.ext/tamaya-resources/0.4-incubating/tamaya-resources-0.4-incubating.pom
[JENKINS] Archiving <https://builds.apache.org/job/Tamaya-Extensions-Master-with-Coverage/ws/modules/resources/target/tamaya-resources-0.4-incubating.jar>
to org.apache.tamaya.ext/tamaya-resources/0.4-incubating/tamaya-resources-0.4-incubating.jar
[JENKINS] Archiving <https://builds.apache.org/job/Tamaya-Extensions-Master-with-Coverage/ws/modules/resources/target/feature/feature.xml>
to org.apache.tamaya.ext/tamaya-resources/0.4-incubating/tamaya-resources-0.4-incubating-features.xml
[JENKINS] Archiving <https://builds.apache.org/job/Tamaya-Extensions-Master-with-Coverage/ws/modules/resources/target/tamaya-resources-0.4-incubating-javadoc.jar>
to org.apache.tamaya.ext/tamaya-resources/0.4-incubating/tamaya-resources-0.4-incubating-javadoc.jar
[JENKINS] Archiving <https://builds.apache.org/job/Tamaya-Extensions-Master-with-Coverage/ws/modules/resources/target/tamaya-resources-0.4-incubating-sources.jar>
to org.apache.tamaya.ext/tamaya-resources/0.4-incubating/tamaya-resources-0.4-incubating-sources.jar
[JENKINS] Archiving <https://builds.apache.org/job/Tamaya-Extensions-Master-with-Coverage/ws/examples/04-events-example/pom.xml>
to org.apache.tamaya.ext.examples/04-events-example/0.4-incubating/04-events-example-0.4-incubating.pom
[JENKINS] Archiving <https://builds.apache.org/job/Tamaya-Extensions-Master-with-Coverage/ws/modules/formats/json/pom.xml>
to org.apache.tamaya.ext/tamaya-json/0.4-incubating/tamaya-json-0.4-incubating.pom
[JENKINS] Archiving <https://builds.apache.org/job/Tamaya-Extensions-Master-with-Coverage/ws/modules/osgi/gogo-shell/pom.xml>
to org.apache.tamaya.ext/tamaya-osgi-gogo-shell/0.4-incubating/tamaya-osgi-gogo-shell-0.4-incubating.pom
[JENKINS] Archiving <https://builds.apache.org/job/Tamaya-Extensions-Master-with-Coverage/ws/modules/osgi/injection/pom.xml>
to org.apache.tamaya.ext/tamaya-osgi-injection/0.4-incubating/tamaya-osgi-injection-0.4-incubating.pom
[JENKINS] Archiving <https://builds.apache.org/job/Tamaya-Extensions-Master-with-Coverage/ws/modules/injection/pom.xml>
to org.apache.tamaya.ext/tamaya-injection-all/0.4-incubating/tamaya-injection-all-0.4-incubating.pom
[JENKINS] Archiving <https://builds.apache.org/job/Tamaya-Extensions-Master-with-Coverage/ws/examples/01-resources-example/pom.xml>
to org.apache.tamaya.ext.examples/01-resources-example/0.4-incubating/01-resources-example-0.4-incubating.pom
[JENKINS] Archiving <https://builds.apache.org/job/Tamaya-Extensions-Master-with-Coverage/ws/examples/01-resources-example/target/01-resources-example-0.4-incubating.jar>
to org.apache.tamaya.ext.examples/01-resources-example/0.4-incubating/01-resources-example-0.4-incubating.jar
[JENKINS] Archiving <https://builds.apache.org/job/Tamaya-Extensions-Master-with-Coverage/ws/examples/01-resources-example/target/feature/feature.xml>
to org.apache.tamaya.ext.examples/01-resources-example/0.4-incubating/01-resources-example-0.4-incubating-features.xml
[JENKINS] Archiving <https://builds.apache.org/job/Tamaya-Extensions-Master-with-Coverage/ws/examples/01-resources-example/target/01-resources-example-0.4-incubating-javadoc.jar>
to org.apache.tamaya.ext.examples/01-resources-example/0.4-incubating/01-resources-example-0.4-incubating-javadoc.jar
[JENKINS] Archiving <https://builds.apache.org/job/Tamaya-Extensions-Master-with-Coverage/ws/examples/01-resources-example/target/01-resources-example-0.4-incubating-sources.jar>
to org.apache.tamaya.ext.examples/01-resources-example/0.4-incubating/01-resources-example-0.4-incubating-sources.jar
[JENKINS] Archiving <https://builds.apache.org/job/Tamaya-Extensions-Master-with-Coverage/ws/modules/functions/pom.xml>
to org.apache.tamaya.ext/tamaya-functions/0.4-incubating/tamaya-functions-0.4-incubating.pom
[JENKINS] Archiving <https://builds.apache.org/job/Tamaya-Extensions-Master-with-Coverage/ws/modules/consul/pom.xml>
to org.apache.tamaya.ext/tamaya-consul/0.4-incubating/tamaya-consul-0.4-incubating.pom
[JENKINS] Archiving <https://builds.apache.org/job/Tamaya-Extensions-Master-with-Coverage/ws/examples/06-distributed/pom.xml>
to org.apache.tamaya.ext.examples/06-distributed-example/0.4-incubating/06-distributed-example-0.4-incubating.pom
[JENKINS] Archiving <https://builds.apache.org/job/Tamaya-Extensions-Master-with-Coverage/ws/modules/formats/hocon/pom.xml>
to org.apache.tamaya.ext/tamaya-hocon/0.4-incubating/tamaya-hocon-0.4-incubating.pom
[JENKINS] Archiving <https://builds.apache.org/job/Tamaya-Extensions-Master-with-Coverage/ws/modules/injection/standalone/pom.xml>
to org.apache.tamaya.ext/tamaya-injection/0.4-incubating/tamaya-injection-0.4-incubating.pom
channel stopped
Not sending mail to unregistered user atsticks@gmail.com

Mime
View raw message