tamaya-commits mailing list archives

Site index · List index
Message view « Date » · « Thread »
Top « Date » · « Thread »
From Apache Jenkins Server <jenk...@builds.apache.org>
Subject Build failed in Jenkins: Tamaya-Sandbox-Master #4135
Date Fri, 22 Nov 2019 00:46:00 GMT
See <https://builds.apache.org/job/Tamaya-Sandbox-Master/4135/display/redirect>

Changes:


------------------------------------------
[...truncated 156.66 KB...]
[INFO] Downloaded: https://repo.maven.apache.org/maven2/io/netty/netty-codec-dns/4.1.30.Final/netty-codec-dns-4.1.30.Final.jar
(54 KB at 2819.7 KB/sec)
[INFO] Downloaded: https://repo.maven.apache.org/maven2/io/vertx/vertx-unit/3.6.3/vertx-unit-3.6.3.jar
(97 KB at 1256.3 KB/sec)
[INFO] Downloaded: https://repo.maven.apache.org/maven2/io/netty/netty-resolver-dns/4.1.30.Final/netty-resolver-dns-4.1.30.Final.jar
(126 KB at 1607.1 KB/sec)
[INFO] Downloaded: https://repo.maven.apache.org/maven2/io/vertx/vertx-core/3.6.3/vertx-core-3.6.3.jar
(1193 KB at 11249.6 KB/sec)
[INFO] Downloading: http://repository.apache.org/snapshots/org/apache/tamaya/ext/tamaya-injection/0.4-incubating-SNAPSHOT/tamaya-injection-0.4-incubating-SNAPSHOT.jar
[INFO]                                                                         
[INFO] ------------------------------------------------------------------------
[INFO] Building Apache Tamaya Modules - JSR 382 Implementation 0.4-incubating-SNAPSHOT
[INFO] ------------------------------------------------------------------------
[INFO] Downloading: https://jitpack.io/com/github/eclipse/ConfigJSR/f739e6d322dbf4eab62d5ffb121c5b0a9e63c2d4/ConfigJSR-f739e6d322dbf4eab62d5ffb121c5b0a9e63c2d4.pom
[INFO] Downloaded: https://jitpack.io/com/github/eclipse/ConfigJSR/f739e6d322dbf4eab62d5ffb121c5b0a9e63c2d4/ConfigJSR-f739e6d322dbf4eab62d5ffb121c5b0a9e63c2d4.pom
(872 B at 1.1 KB/sec)
[INFO] Downloading: https://jitpack.io/com/github/eclipse/ConfigJSR/javaconfig-api/f739e6d322dbf4eab62d5ffb121c5b0a9e63c2d4/javaconfig-api-f739e6d322dbf4eab62d5ffb121c5b0a9e63c2d4.pom
[INFO] Downloaded: https://jitpack.io/com/github/eclipse/ConfigJSR/javaconfig-api/f739e6d322dbf4eab62d5ffb121c5b0a9e63c2d4/javaconfig-api-f739e6d322dbf4eab62d5ffb121c5b0a9e63c2d4.pom
(4 KB at 4.5 KB/sec)
[INFO] Downloading: https://jitpack.io/com/github/eclipse/ConfigJSR/javaconfig-parent/f739e6d322dbf4eab62d5ffb121c5b0a9e63c2d4/javaconfig-parent-f739e6d322dbf4eab62d5ffb121c5b0a9e63c2d4.pom
[INFO] Downloaded: https://jitpack.io/com/github/eclipse/ConfigJSR/javaconfig-parent/f739e6d322dbf4eab62d5ffb121c5b0a9e63c2d4/javaconfig-parent-f739e6d322dbf4eab62d5ffb121c5b0a9e63c2d4.pom
(10 KB at 19.8 KB/sec)
[INFO] Downloading: https://jitpack.io/com/github/eclipse/ConfigJSR/javaconfig-tck/f739e6d322dbf4eab62d5ffb121c5b0a9e63c2d4/javaconfig-tck-f739e6d322dbf4eab62d5ffb121c5b0a9e63c2d4.pom
[INFO] Downloaded: https://jitpack.io/com/github/eclipse/ConfigJSR/javaconfig-tck/f739e6d322dbf4eab62d5ffb121c5b0a9e63c2d4/javaconfig-tck-f739e6d322dbf4eab62d5ffb121c5b0a9e63c2d4.pom
(5 KB at 9.4 KB/sec)
[INFO] Downloading: https://jitpack.io/javax/enterprise/cdi-api/2.0/cdi-api-2.0.pom
[INFO] Downloading: https://repo.maven.apache.org/maven2/javax/enterprise/cdi-api/2.0/cdi-api-2.0.pom
[INFO] Downloaded: https://repo.maven.apache.org/maven2/javax/enterprise/cdi-api/2.0/cdi-api-2.0.pom
(8 KB at 440.3 KB/sec)
[INFO] Downloading: https://jitpack.io/org/jboss/weld/weld-parent/36/weld-parent-36.pom
[INFO] Downloading: https://repo.maven.apache.org/maven2/org/jboss/weld/weld-parent/36/weld-parent-36.pom
[INFO] Downloaded: https://repo.maven.apache.org/maven2/org/jboss/weld/weld-parent/36/weld-parent-36.pom
(29 KB at 1663.7 KB/sec)
[INFO] Downloading: https://jitpack.io/org/jboss/weld/se/weld-se-shaded/3.0.1.Final/weld-se-shaded-3.0.1.Final.pom
[INFO] Downloading: https://repo.maven.apache.org/maven2/org/jboss/weld/se/weld-se-shaded/3.0.1.Final/weld-se-shaded-3.0.1.Final.pom
[INFO] Downloaded: https://repo.maven.apache.org/maven2/org/jboss/weld/se/weld-se-shaded/3.0.1.Final/weld-se-shaded-3.0.1.Final.pom
(5 KB at 354.6 KB/sec)
[INFO] Downloading: https://jitpack.io/org/jboss/weld/se/weld-se-parent/3.0.1.Final/weld-se-parent-3.0.1.Final.pom
[INFO] Downloading: https://repo.maven.apache.org/maven2/org/jboss/weld/se/weld-se-parent/3.0.1.Final/weld-se-parent-3.0.1.Final.pom
[INFO] Downloaded: https://repo.maven.apache.org/maven2/org/jboss/weld/se/weld-se-parent/3.0.1.Final/weld-se-parent-3.0.1.Final.pom
(2 KB at 92.1 KB/sec)
[INFO] Downloading: https://jitpack.io/org/jboss/weld/weld-core-parent/3.0.1.Final/weld-core-parent-3.0.1.Final.pom
[INFO] Downloading: https://repo.maven.apache.org/maven2/org/jboss/weld/weld-core-parent/3.0.1.Final/weld-core-parent-3.0.1.Final.pom
[INFO] Downloaded: https://repo.maven.apache.org/maven2/org/jboss/weld/weld-core-parent/3.0.1.Final/weld-core-parent-3.0.1.Final.pom
(32 KB at 1953.5 KB/sec)
[INFO] Downloading: https://jitpack.io/org/jboss/weld/weld-api-bom/3.0.SP1/weld-api-bom-3.0.SP1.pom
[INFO] Downloading: https://repo.maven.apache.org/maven2/org/jboss/weld/weld-api-bom/3.0.SP1/weld-api-bom-3.0.SP1.pom
[INFO] Downloaded: https://repo.maven.apache.org/maven2/org/jboss/weld/weld-api-bom/3.0.SP1/weld-api-bom-3.0.SP1.pom
(5 KB at 356.4 KB/sec)
[INFO] Downloading: https://jitpack.io/org/jboss/weld/weld-api-parent/3.0.SP1/weld-api-parent-3.0.SP1.pom
[INFO] Downloading: https://repo.maven.apache.org/maven2/org/jboss/weld/weld-api-parent/3.0.SP1/weld-api-parent-3.0.SP1.pom
[INFO] Downloaded: https://repo.maven.apache.org/maven2/org/jboss/weld/weld-api-parent/3.0.SP1/weld-api-parent-3.0.SP1.pom
(9 KB at 605.6 KB/sec)
[INFO] Downloading: https://jitpack.io/org/testng/testng/6.9.9/testng-6.9.9.pom
[INFO] Downloading: https://repo.maven.apache.org/maven2/org/testng/testng/6.9.9/testng-6.9.9.pom
[INFO] Downloaded: https://repo.maven.apache.org/maven2/org/testng/testng/6.9.9/testng-6.9.9.pom
(3 KB at 151.1 KB/sec)
[INFO] Downloading: https://jitpack.io/org/jboss/shrinkwrap/resolver/shrinkwrap-resolver-depchain/2.2.6/shrinkwrap-resolver-depchain-2.2.6.pom
[INFO] Downloading: https://repo.maven.apache.org/maven2/org/jboss/shrinkwrap/resolver/shrinkwrap-resolver-depchain/2.2.6/shrinkwrap-resolver-depchain-2.2.6.pom
[INFO] Downloaded: https://repo.maven.apache.org/maven2/org/jboss/shrinkwrap/resolver/shrinkwrap-resolver-depchain/2.2.6/shrinkwrap-resolver-depchain-2.2.6.pom
(3 KB at 62.3 KB/sec)
[INFO] Downloading: https://jitpack.io/org/jboss/shrinkwrap/resolver/shrinkwrap-resolver-parent/2.2.6/shrinkwrap-resolver-parent-2.2.6.pom
[INFO] Downloading: https://repo.maven.apache.org/maven2/org/jboss/shrinkwrap/resolver/shrinkwrap-resolver-parent/2.2.6/shrinkwrap-resolver-parent-2.2.6.pom
[INFO] Downloaded: https://repo.maven.apache.org/maven2/org/jboss/shrinkwrap/resolver/shrinkwrap-resolver-parent/2.2.6/shrinkwrap-resolver-parent-2.2.6.pom
(14 KB at 854.2 KB/sec)
[INFO] Downloading: https://jitpack.io/org/jboss/shrinkwrap/resolver/shrinkwrap-resolver-api/2.2.4/shrinkwrap-resolver-api-2.2.4.pom
[INFO] Downloading: https://repo.maven.apache.org/maven2/org/jboss/shrinkwrap/resolver/shrinkwrap-resolver-api/2.2.4/shrinkwrap-resolver-api-2.2.4.pom
[INFO] Downloaded: https://repo.maven.apache.org/maven2/org/jboss/shrinkwrap/resolver/shrinkwrap-resolver-api/2.2.4/shrinkwrap-resolver-api-2.2.4.pom
(2 KB at 21.1 KB/sec)
[INFO] Downloading: https://jitpack.io/org/jboss/shrinkwrap/resolver/shrinkwrap-resolver-parent/2.2.4/shrinkwrap-resolver-parent-2.2.4.pom
[INFO] Downloading: https://repo.maven.apache.org/maven2/org/jboss/shrinkwrap/resolver/shrinkwrap-resolver-parent/2.2.4/shrinkwrap-resolver-parent-2.2.4.pom
[INFO] Downloaded: https://repo.maven.apache.org/maven2/org/jboss/shrinkwrap/resolver/shrinkwrap-resolver-parent/2.2.4/shrinkwrap-resolver-parent-2.2.4.pom
(14 KB at 854.2 KB/sec)
[INFO] Downloading: https://jitpack.io/org/jboss/shrinkwrap/resolver/shrinkwrap-resolver-spi/2.2.4/shrinkwrap-resolver-spi-2.2.4.pom
[INFO] Downloading: https://repo.maven.apache.org/maven2/org/jboss/shrinkwrap/resolver/shrinkwrap-resolver-spi/2.2.4/shrinkwrap-resolver-spi-2.2.4.pom
[INFO] Downloaded: https://repo.maven.apache.org/maven2/org/jboss/shrinkwrap/resolver/shrinkwrap-resolver-spi/2.2.4/shrinkwrap-resolver-spi-2.2.4.pom
(2 KB at 83.1 KB/sec)
[INFO] Downloading: https://jitpack.io/org/jboss/shrinkwrap/resolver/shrinkwrap-resolver-api-maven/2.2.4/shrinkwrap-resolver-api-maven-2.2.4.pom
[INFO] Downloading: https://repo.maven.apache.org/maven2/org/jboss/shrinkwrap/resolver/shrinkwrap-resolver-api-maven/2.2.4/shrinkwrap-resolver-api-maven-2.2.4.pom
[INFO] Downloaded: https://repo.maven.apache.org/maven2/org/jboss/shrinkwrap/resolver/shrinkwrap-resolver-api-maven/2.2.4/shrinkwrap-resolver-api-maven-2.2.4.pom
(3 KB at 145.1 KB/sec)
[INFO] Downloading: https://jitpack.io/org/jboss/shrinkwrap/resolver/shrinkwrap-resolver-spi-maven/2.2.4/shrinkwrap-resolver-spi-maven-2.2.4.pom
[INFO] Downloading: https://repo.maven.apache.org/maven2/org/jboss/shrinkwrap/resolver/shrinkwrap-resolver-spi-maven/2.2.4/shrinkwrap-resolver-spi-maven-2.2.4.pom
[INFO] Downloaded: https://repo.maven.apache.org/maven2/org/jboss/shrinkwrap/resolver/shrinkwrap-resolver-spi-maven/2.2.4/shrinkwrap-resolver-spi-maven-2.2.4.pom
(2 KB at 97.1 KB/sec)
[INFO] Downloading: https://jitpack.io/org/jboss/shrinkwrap/resolver/shrinkwrap-resolver-api-maven-archive/2.2.4/shrinkwrap-resolver-api-maven-archive-2.2.4.pom
[INFO] Downloading: https://repo.maven.apache.org/maven2/org/jboss/shrinkwrap/resolver/shrinkwrap-resolver-api-maven-archive/2.2.4/shrinkwrap-resolver-api-maven-archive-2.2.4.pom
[INFO] Downloaded: https://repo.maven.apache.org/maven2/org/jboss/shrinkwrap/resolver/shrinkwrap-resolver-api-maven-archive/2.2.4/shrinkwrap-resolver-api-maven-archive-2.2.4.pom
(2 KB at 19.0 KB/sec)
[INFO] Downloading: https://jitpack.io/org/jboss/shrinkwrap/resolver/shrinkwrap-resolver-impl-maven/2.2.4/shrinkwrap-resolver-impl-maven-2.2.4.pom
[INFO] Downloading: https://repo.maven.apache.org/maven2/org/jboss/shrinkwrap/resolver/shrinkwrap-resolver-impl-maven/2.2.4/shrinkwrap-resolver-impl-maven-2.2.4.pom
[INFO] Downloaded: https://repo.maven.apache.org/maven2/org/jboss/shrinkwrap/resolver/shrinkwrap-resolver-impl-maven/2.2.4/shrinkwrap-resolver-impl-maven-2.2.4.pom
(18 KB at 1094.2 KB/sec)
[INFO] Downloading: https://jitpack.io/org/eclipse/aether/aether-connector-basic/1.0.0.v20140518/aether-connector-basic-1.0.0.v20140518.pom
[INFO] Downloading: https://repo.maven.apache.org/maven2/org/eclipse/aether/aether-connector-basic/1.0.0.v20140518/aether-connector-basic-1.0.0.v20140518.pom
[INFO] Downloaded: https://repo.maven.apache.org/maven2/org/eclipse/aether/aether-connector-basic/1.0.0.v20140518/aether-connector-basic-1.0.0.v20140518.pom
(3 KB at 199.2 KB/sec)
[INFO] Downloading: https://jitpack.io/org/eclipse/aether/aether-transport-wagon/1.0.0.v20140518/aether-transport-wagon-1.0.0.v20140518.pom
[INFO] Downloading: https://repo.maven.apache.org/maven2/org/eclipse/aether/aether-transport-wagon/1.0.0.v20140518/aether-transport-wagon-1.0.0.v20140518.pom
[INFO] Downloaded: https://repo.maven.apache.org/maven2/org/eclipse/aether/aether-transport-wagon/1.0.0.v20140518/aether-transport-wagon-1.0.0.v20140518.pom
(4 KB at 256.9 KB/sec)
[INFO] Downloading: https://jitpack.io/org/apache/maven/wagon/wagon-file/2.6/wagon-file-2.6.pom
[INFO] Downloading: https://repo.maven.apache.org/maven2/org/apache/maven/wagon/wagon-file/2.6/wagon-file-2.6.pom
[INFO] Downloaded: https://repo.maven.apache.org/maven2/org/apache/maven/wagon/wagon-file/2.6/wagon-file-2.6.pom
(2 KB at 104.5 KB/sec)
[INFO] Downloading: https://jitpack.io/org/jboss/shrinkwrap/resolver/shrinkwrap-resolver-impl-maven-archive/2.2.4/shrinkwrap-resolver-impl-maven-archive-2.2.4.pom
[INFO] Downloading: https://repo.maven.apache.org/maven2/org/jboss/shrinkwrap/resolver/shrinkwrap-resolver-impl-maven-archive/2.2.4/shrinkwrap-resolver-impl-maven-archive-2.2.4.pom
[INFO] Downloaded: https://repo.maven.apache.org/maven2/org/jboss/shrinkwrap/resolver/shrinkwrap-resolver-impl-maven-archive/2.2.4/shrinkwrap-resolver-impl-maven-archive-2.2.4.pom
(4 KB at 41.2 KB/sec)
[INFO] Downloading: https://jitpack.io/org/jboss/shrinkwrap/resolver/shrinkwrap-resolver-spi-maven-archive/2.2.4/shrinkwrap-resolver-spi-maven-archive-2.2.4.pom
[INFO] Downloading: https://repo.maven.apache.org/maven2/org/jboss/shrinkwrap/resolver/shrinkwrap-resolver-spi-maven-archive/2.2.4/shrinkwrap-resolver-spi-maven-archive-2.2.4.pom
[INFO] Downloaded: https://repo.maven.apache.org/maven2/org/jboss/shrinkwrap/resolver/shrinkwrap-resolver-spi-maven-archive/2.2.4/shrinkwrap-resolver-spi-maven-archive-2.2.4.pom
(2 KB at 121.7 KB/sec)
[INFO] Downloading: https://jitpack.io/org/codehaus/plexus/plexus-compiler-javac/2.3/plexus-compiler-javac-2.3.pom
[INFO] Downloading: https://repo.maven.apache.org/maven2/org/codehaus/plexus/plexus-compiler-javac/2.3/plexus-compiler-javac-2.3.pom
[INFO] Downloaded: https://repo.maven.apache.org/maven2/org/codehaus/plexus/plexus-compiler-javac/2.3/plexus-compiler-javac-2.3.pom
(769 B at 57.8 KB/sec)
[INFO] Downloading: https://jitpack.io/org/codehaus/plexus/plexus-compilers/2.3/plexus-compilers-2.3.pom
[INFO] Downloading: https://repo.maven.apache.org/maven2/org/codehaus/plexus/plexus-compilers/2.3/plexus-compilers-2.3.pom
[INFO] Downloaded: https://repo.maven.apache.org/maven2/org/codehaus/plexus/plexus-compilers/2.3/plexus-compilers-2.3.pom
(2 KB at 97.3 KB/sec)
[INFO] Downloading: https://jitpack.io/org/codehaus/plexus/plexus-compiler/2.3/plexus-compiler-2.3.pom
[INFO] Downloading: https://repo.maven.apache.org/maven2/org/codehaus/plexus/plexus-compiler/2.3/plexus-compiler-2.3.pom
[INFO] Downloaded: https://repo.maven.apache.org/maven2/org/codehaus/plexus/plexus-compiler/2.3/plexus-compiler-2.3.pom
(5 KB at 342.1 KB/sec)
[INFO] Downloading: https://jitpack.io/org/codehaus/plexus/plexus-compiler-api/2.3/plexus-compiler-api-2.3.pom
[INFO] Downloading: https://repo.maven.apache.org/maven2/org/codehaus/plexus/plexus-compiler-api/2.3/plexus-compiler-api-2.3.pom
[INFO] Downloaded: https://repo.maven.apache.org/maven2/org/codehaus/plexus/plexus-compiler-api/2.3/plexus-compiler-api-2.3.pom
(865 B at 60.3 KB/sec)
[INFO] Downloading: https://jitpack.io/org/apache/tamaya/tamaya-core/0.4-incubating-SNAPSHOT/maven-metadata.xml
[INFO] Downloading: https://jitpack.io/org/apache/tamaya/tamaya-spisupport/0.4-incubating-SNAPSHOT/maven-metadata.xml
[INFO] Downloading: https://jitpack.io/org/apache/tamaya/tamaya-api/0.4-incubating-SNAPSHOT/maven-metadata.xml
[INFO] Downloading: https://jitpack.io/org/apache/tamaya/ext/tamaya-injection-api/0.4-incubating-SNAPSHOT/maven-metadata.xml
[INFO] Downloading: https://jitpack.io/org/apache/tamaya/ext/tamaya-functions/0.4-incubating-SNAPSHOT/maven-metadata.xml
[INFO] Downloading: https://jitpack.io/org/apache/tamaya/ext/tamaya-events/0.4-incubating-SNAPSHOT/maven-metadata.xml
[INFO] Downloading: https://jitpack.io/org/apache/tamaya/ext/tamaya-injection-api/0.4-incubating-SNAPSHOT/tamaya-injection-api-0.4-incubating-SNAPSHOT.jar
[INFO] Downloading: https://jitpack.io/org/apache/tamaya/ext/tamaya-functions/0.4-incubating-SNAPSHOT/tamaya-functions-0.4-incubating-SNAPSHOT.jar
[INFO] Downloading: https://jitpack.io/org/apache/tamaya/ext/tamaya-events/0.4-incubating-SNAPSHOT/tamaya-events-0.4-incubating-SNAPSHOT.jar
[INFO] Downloading: https://jitpack.io/com/github/eclipse/ConfigJSR/javaconfig-api/f739e6d322dbf4eab62d5ffb121c5b0a9e63c2d4/javaconfig-api-f739e6d322dbf4eab62d5ffb121c5b0a9e63c2d4.jar
[INFO] Downloading: https://jitpack.io/com/github/eclipse/ConfigJSR/f739e6d322dbf4eab62d5ffb121c5b0a9e63c2d4/ConfigJSR-f739e6d322dbf4eab62d5ffb121c5b0a9e63c2d4.jar
[INFO] Downloading: https://jitpack.io/com/github/eclipse/ConfigJSR/javaconfig-tck/f739e6d322dbf4eab62d5ffb121c5b0a9e63c2d4/javaconfig-tck-f739e6d322dbf4eab62d5ffb121c5b0a9e63c2d4.jar
[INFO] Downloading: https://jitpack.io/javax/enterprise/cdi-api/2.0/cdi-api-2.0.jar
[INFO] Downloading: https://jitpack.io/org/jboss/weld/se/weld-se-shaded/3.0.1.Final/weld-se-shaded-3.0.1.Final.jar
[INFO] Downloading: https://jitpack.io/org/testng/testng/6.9.9/testng-6.9.9.jar
[INFO] Downloading: https://jitpack.io/org/jboss/shrinkwrap/resolver/shrinkwrap-resolver-api/2.2.4/shrinkwrap-resolver-api-2.2.4.jar
[INFO] Downloading: https://jitpack.io/org/jboss/shrinkwrap/resolver/shrinkwrap-resolver-spi/2.2.4/shrinkwrap-resolver-spi-2.2.4.jar
[INFO] Downloading: https://jitpack.io/org/jboss/shrinkwrap/resolver/shrinkwrap-resolver-api-maven/2.2.4/shrinkwrap-resolver-api-maven-2.2.4.jar
[INFO] Downloading: https://jitpack.io/org/jboss/shrinkwrap/resolver/shrinkwrap-resolver-spi-maven/2.2.4/shrinkwrap-resolver-spi-maven-2.2.4.jar
[INFO] Downloading: https://jitpack.io/org/jboss/shrinkwrap/resolver/shrinkwrap-resolver-api-maven-archive/2.2.4/shrinkwrap-resolver-api-maven-archive-2.2.4.jar
[INFO] Downloading: https://jitpack.io/org/jboss/shrinkwrap/resolver/shrinkwrap-resolver-impl-maven/2.2.4/shrinkwrap-resolver-impl-maven-2.2.4.jar
[INFO] Downloading: https://jitpack.io/org/eclipse/aether/aether-connector-basic/1.0.0.v20140518/aether-connector-basic-1.0.0.v20140518.jar
[INFO] Downloaded: https://jitpack.io/com/github/eclipse/ConfigJSR/javaconfig-api/f739e6d322dbf4eab62d5ffb121c5b0a9e63c2d4/javaconfig-api-f739e6d322dbf4eab62d5ffb121c5b0a9e63c2d4.jar
(17 KB at 29.7 KB/sec)
[INFO] Downloading: https://jitpack.io/org/eclipse/aether/aether-transport-wagon/1.0.0.v20140518/aether-transport-wagon-1.0.0.v20140518.jar
[INFO] Downloading: https://jitpack.io/org/apache/maven/wagon/wagon-provider-api/2.6/wagon-provider-api-2.6.jar
[INFO] Downloading: https://jitpack.io/org/apache/maven/wagon/wagon-file/2.6/wagon-file-2.6.jar
[INFO] Downloading: https://jitpack.io/org/jboss/shrinkwrap/resolver/shrinkwrap-resolver-impl-maven-archive/2.2.4/shrinkwrap-resolver-impl-maven-archive-2.2.4.jar
[INFO] Downloading: https://jitpack.io/org/jboss/shrinkwrap/resolver/shrinkwrap-resolver-spi-maven-archive/2.2.4/shrinkwrap-resolver-spi-maven-archive-2.2.4.jar
[INFO] Downloading: https://jitpack.io/org/codehaus/plexus/plexus-compiler-javac/2.3/plexus-compiler-javac-2.3.jar
[INFO] Downloading: https://jitpack.io/org/codehaus/plexus/plexus-compiler-api/2.3/plexus-compiler-api-2.3.jar
[INFO] Downloaded: https://jitpack.io/com/github/eclipse/ConfigJSR/f739e6d322dbf4eab62d5ffb121c5b0a9e63c2d4/ConfigJSR-f739e6d322dbf4eab62d5ffb121c5b0a9e63c2d4.jar
(290 B at 0.4 KB/sec)
[INFO] Downloaded: https://jitpack.io/com/github/eclipse/ConfigJSR/javaconfig-tck/f739e6d322dbf4eab62d5ffb121c5b0a9e63c2d4/javaconfig-tck-f739e6d322dbf4eab62d5ffb121c5b0a9e63c2d4.jar
(77 KB at 87.3 KB/sec)
[INFO] Downloading: https://repo.maven.apache.org/maven2/javax/enterprise/cdi-api/2.0/cdi-api-2.0.jar
[INFO] Downloading: https://repo.maven.apache.org/maven2/org/jboss/weld/se/weld-se-shaded/3.0.1.Final/weld-se-shaded-3.0.1.Final.jar
[INFO] Downloading: https://repo.maven.apache.org/maven2/org/testng/testng/6.9.9/testng-6.9.9.jar
[INFO] Downloading: https://repo.maven.apache.org/maven2/org/jboss/shrinkwrap/resolver/shrinkwrap-resolver-api/2.2.4/shrinkwrap-resolver-api-2.2.4.jar
[INFO] Downloading: https://repo.maven.apache.org/maven2/org/jboss/shrinkwrap/resolver/shrinkwrap-resolver-spi/2.2.4/shrinkwrap-resolver-spi-2.2.4.jar
[INFO] Downloaded: https://repo.maven.apache.org/maven2/org/jboss/shrinkwrap/resolver/shrinkwrap-resolver-spi/2.2.4/shrinkwrap-resolver-spi-2.2.4.jar
(18 KB at 1042.1 KB/sec)
[INFO] Downloading: https://repo.maven.apache.org/maven2/org/jboss/shrinkwrap/resolver/shrinkwrap-resolver-api-maven/2.2.4/shrinkwrap-resolver-api-maven-2.2.4.jar
[INFO] Downloaded: https://repo.maven.apache.org/maven2/javax/enterprise/cdi-api/2.0/cdi-api-2.0.jar
(112 KB at 3834.7 KB/sec)
[INFO] Downloading: https://repo.maven.apache.org/maven2/org/jboss/shrinkwrap/resolver/shrinkwrap-resolver-spi-maven/2.2.4/shrinkwrap-resolver-spi-maven-2.2.4.jar
[INFO] Downloaded: https://repo.maven.apache.org/maven2/org/jboss/shrinkwrap/resolver/shrinkwrap-resolver-api/2.2.4/shrinkwrap-resolver-api-2.2.4.jar
(22 KB at 677.6 KB/sec)
[INFO] Downloading: https://repo.maven.apache.org/maven2/org/jboss/shrinkwrap/resolver/shrinkwrap-resolver-api-maven-archive/2.2.4/shrinkwrap-resolver-api-maven-archive-2.2.4.jar
[INFO] Downloaded: https://repo.maven.apache.org/maven2/org/jboss/shrinkwrap/resolver/shrinkwrap-resolver-api-maven/2.2.4/shrinkwrap-resolver-api-maven-2.2.4.jar
(52 KB at 1483.3 KB/sec)
[INFO] Downloading: https://repo.maven.apache.org/maven2/org/jboss/shrinkwrap/resolver/shrinkwrap-resolver-impl-maven/2.2.4/shrinkwrap-resolver-impl-maven-2.2.4.jar
[INFO] Downloaded: https://repo.maven.apache.org/maven2/org/jboss/shrinkwrap/resolver/shrinkwrap-resolver-spi-maven/2.2.4/shrinkwrap-resolver-spi-maven-2.2.4.jar
(4 KB at 87.1 KB/sec)
[INFO] Downloading: https://repo.maven.apache.org/maven2/org/eclipse/aether/aether-connector-basic/1.0.0.v20140518/aether-connector-basic-1.0.0.v20140518.jar
[INFO] Downloaded: https://repo.maven.apache.org/maven2/org/eclipse/aether/aether-connector-basic/1.0.0.v20140518/aether-connector-basic-1.0.0.v20140518.jar
(36 KB at 665.1 KB/sec)
[INFO] Downloading: https://repo.maven.apache.org/maven2/org/eclipse/aether/aether-transport-wagon/1.0.0.v20140518/aether-transport-wagon-1.0.0.v20140518.jar
[INFO] Downloaded: https://repo.maven.apache.org/maven2/org/jboss/shrinkwrap/resolver/shrinkwrap-resolver-impl-maven/2.2.4/shrinkwrap-resolver-impl-maven-2.2.4.jar
(156 KB at 2725.7 KB/sec)
[INFO] Downloading: https://repo.maven.apache.org/maven2/org/apache/maven/wagon/wagon-provider-api/2.6/wagon-provider-api-2.6.jar
[INFO] Downloaded: https://repo.maven.apache.org/maven2/org/eclipse/aether/aether-transport-wagon/1.0.0.v20140518/aether-transport-wagon-1.0.0.v20140518.jar
(25 KB at 370.0 KB/sec)
[INFO] Downloading: https://repo.maven.apache.org/maven2/org/apache/maven/wagon/wagon-file/2.6/wagon-file-2.6.jar
[INFO] Downloaded: https://repo.maven.apache.org/maven2/org/apache/maven/wagon/wagon-provider-api/2.6/wagon-provider-api-2.6.jar
(52 KB at 723.1 KB/sec)
[INFO] Downloading: https://repo.maven.apache.org/maven2/org/jboss/shrinkwrap/resolver/shrinkwrap-resolver-impl-maven-archive/2.2.4/shrinkwrap-resolver-impl-maven-archive-2.2.4.jar
[INFO] Downloaded: https://repo.maven.apache.org/maven2/org/testng/testng/6.9.9/testng-6.9.9.jar
(850 KB at 10490.1 KB/sec)
[INFO] Downloading: https://repo.maven.apache.org/maven2/org/jboss/shrinkwrap/resolver/shrinkwrap-resolver-spi-maven-archive/2.2.4/shrinkwrap-resolver-spi-maven-archive-2.2.4.jar
[INFO] Downloaded: https://repo.maven.apache.org/maven2/org/apache/maven/wagon/wagon-file/2.6/wagon-file-2.6.jar
(12 KB at 136.1 KB/sec)
[INFO] Downloading: https://repo.maven.apache.org/maven2/org/codehaus/plexus/plexus-compiler-javac/2.3/plexus-compiler-javac-2.3.jar
[INFO] Downloaded: https://repo.maven.apache.org/maven2/org/jboss/shrinkwrap/resolver/shrinkwrap-resolver-impl-maven-archive/2.2.4/shrinkwrap-resolver-impl-maven-archive-2.2.4.jar
(50 KB at 566.7 KB/sec)
[INFO] Downloading: https://repo.maven.apache.org/maven2/org/codehaus/plexus/plexus-compiler-api/2.3/plexus-compiler-api-2.3.jar
[INFO] Downloaded: https://repo.maven.apache.org/maven2/org/codehaus/plexus/plexus-compiler-javac/2.3/plexus-compiler-javac-2.3.jar
(19 KB at 200.7 KB/sec)
[INFO] Downloaded: https://repo.maven.apache.org/maven2/org/jboss/shrinkwrap/resolver/shrinkwrap-resolver-spi-maven-archive/2.2.4/shrinkwrap-resolver-spi-maven-archive-2.2.4.jar
(6 KB at 60.1 KB/sec)
[INFO] Downloaded: https://repo.maven.apache.org/maven2/org/codehaus/plexus/plexus-compiler-api/2.3/plexus-compiler-api-2.3.jar
(25 KB at 237.1 KB/sec)
[INFO] Downloaded: https://repo.maven.apache.org/maven2/org/jboss/shrinkwrap/resolver/shrinkwrap-resolver-api-maven-archive/2.2.4/shrinkwrap-resolver-api-maven-archive-2.2.4.jar
(7 KB at 55.3 KB/sec)
[INFO] Downloaded: https://repo.maven.apache.org/maven2/org/jboss/weld/se/weld-se-shaded/3.0.1.Final/weld-se-shaded-3.0.1.Final.jar
(2400 KB at 9561.6 KB/sec)
[INFO] ------------------------------------------------------------------------
[INFO] Reactor Summary:
[INFO] 
[INFO] Apache Tamaya Sandbox .............................. SUCCESS [ 42.903 s]
[INFO] Apache Tamaya Modules - Apache Commons ............. FAILURE [  1.724 s]
[INFO] Apache Tamaya Modules - Joda-Time Support .......... SUCCESS [01:25 min]
[INFO] Apache Tamaya Modules - Usage tracker .............. FAILURE [  1.867 s]
[INFO] Apache Tamaya Modules - Documentation .............. FAILURE [  0.530 s]
[INFO] Apache Tamaya Modules - Validation ................. SKIPPED
[INFO] Apache Tamaya Modules - Remote PropertySource ...... FAILURE [  0.438 s]
[INFO] Apache Tamaya Modules - Configured System Properties SUCCESS [ 34.698 s]
[INFO] Apache Tamaya Modules - Apache Camel Support ....... FAILURE [  1.203 s]
[INFO] Apache Tamaya Modules - PropertySources ............ FAILURE [  1.049 s]
[INFO] Apache Tamaya Modules - JMX Support ................ FAILURE [  0.415 s]
[INFO] Apache Tamaya Modules - Metamodel .................. FAILURE [  0.908 s]
[INFO] Apache Tamaya Modules - Units of Measurement Support SUCCESS [ 34.550 s]
[INFO] Apache Tamaya Modules - Vertx Support .............. FAILURE [  1.428 s]
[INFO] Apache Tamaya Modules - JSR 382 Implementation ..... FAILURE [  9.345 s]
[INFO] ------------------------------------------------------------------------
[INFO] BUILD FAILURE
[INFO] ------------------------------------------------------------------------
[INFO] Total time: 04:44 min
[INFO] Finished at: 2019-11-22T00:45:42+00:00
[INFO] Final Memory: 86M/3925M
[INFO] ------------------------------------------------------------------------
[ERROR] Failed to execute goal on project tamaya-commons-config_beta: Could not resolve dependencies
for project org.apache.tamaya.ext:tamaya-commons-config_beta:jar:0.4-incubating-SNAPSHOT:
Could not find artifact org.apache.tamaya.ext:tamaya-formats:jar:0.4-incubating-SNAPSHOT in
Nexus (http://repository.apache.org/snapshots) -> [Help 1]
[ERROR] Failed to execute goal on project tamaya-usagetracker_beta: Could not resolve dependencies
for project org.apache.tamaya.ext:tamaya-usagetracker_beta:jar:0.4-incubating-SNAPSHOT: The
following artifacts could not be resolved: org.apache.tamaya.ext:tamaya-injection-api:jar:0.4-incubating-SNAPSHOT,
org.apache.tamaya.ext:tamaya-events:jar:0.4-incubating-SNAPSHOT, org.apache.tamaya.ext:tamaya-json:jar:0.4-incubating-SNAPSHOT:
Could not find artifact org.apache.tamaya.ext:tamaya-injection-api:jar:0.4-incubating-SNAPSHOT
in Nexus (http://repository.apache.org/snapshots) -> [Help 1]
[ERROR] Failed to execute goal on project tamaya-doc_alpha: Could not resolve dependencies
for project org.apache.tamaya.ext:tamaya-doc_alpha:jar:0.4-incubating-SNAPSHOT: Failure to
find org.apache.tamaya.ext:tamaya-injection-api:jar:0.4-incubating-SNAPSHOT in http://repository.apache.org/snapshots
was cached in the local repository, resolution will not be reattempted until the update interval
of Nexus has elapsed or updates are forced -> [Help 1]
[ERROR] Failed to execute goal on project tamaya-remote_alpha: Could not resolve dependencies
for project org.apache.tamaya.ext:tamaya-remote_alpha:jar:0.4-incubating-SNAPSHOT: Failure
to find org.apache.tamaya.ext:tamaya-json:jar:0.4-incubating-SNAPSHOT in http://repository.apache.org/snapshots
was cached in the local repository, resolution will not be reattempted until the update interval
of Nexus has elapsed or updates are forced -> [Help 1]
[ERROR] Failed to execute goal on project tamaya-camel_beta: Could not resolve dependencies
for project org.apache.tamaya.ext:tamaya-camel_beta:jar:0.4-incubating-SNAPSHOT: Could not
find artifact org.apache.tamaya.ext:tamaya-functions:jar:0.4-incubating-SNAPSHOT in Nexus
(http://repository.apache.org/snapshots) -> [Help 1]
[ERROR] Failed to execute goal on project tamaya-propertysources_alpha: Could not resolve
dependencies for project org.apache.tamaya.ext:tamaya-propertysources_alpha:jar:0.4-incubating-SNAPSHOT:
The following artifacts could not be resolved: org.apache.tamaya.ext:tamaya-resources:jar:0.4-incubating-SNAPSHOT,
org.apache.tamaya.ext:tamaya-formats:jar:0.4-incubating-SNAPSHOT: Could not find artifact
org.apache.tamaya.ext:tamaya-resources:jar:0.4-incubating-SNAPSHOT in Nexus (http://repository.apache.org/snapshots)
-> [Help 1]
[ERROR] Failed to execute goal on project tamaya-management_alpha: Could not resolve dependencies
for project org.apache.tamaya.ext:tamaya-management_alpha:jar:0.4-incubating-SNAPSHOT: Failure
to find org.apache.tamaya.ext:tamaya-functions:jar:0.4-incubating-SNAPSHOT in http://repository.apache.org/snapshots
was cached in the local repository, resolution will not be reattempted until the update interval
of Nexus has elapsed or updates are forced -> [Help 1]
[ERROR] Failed to execute goal on project tamaya-metamodel_alpha: Could not resolve dependencies
for project org.apache.tamaya.ext:tamaya-metamodel_alpha:jar:0.4-incubating-SNAPSHOT: The
following artifacts could not be resolved: org.apache.tamaya.ext:tamaya-injection-api:jar:0.4-incubating-SNAPSHOT,
org.apache.tamaya.ext:tamaya-hocon:jar:0.4-incubating-SNAPSHOT, org.apache.tamaya.ext:tamaya-events:jar:0.4-incubating-SNAPSHOT,
org.apache.tamaya.ext:tamaya-formats:jar:0.4-incubating-SNAPSHOT, org.apache.tamaya.ext:tamaya-resources:jar:0.4-incubating-SNAPSHOT:
Failure to find org.apache.tamaya.ext:tamaya-injection-api:jar:0.4-incubating-SNAPSHOT in
http://repository.apache.org/snapshots was cached in the local repository, resolution will
not be reattempted until the update interval of Nexus has elapsed or updates are forced ->
[Help 1]
[ERROR] Failed to execute goal on project tamaya-vertx-alpha: Could not resolve dependencies
for project org.apache.tamaya.ext:tamaya-vertx-alpha:jar:0.4-incubating-SNAPSHOT: The following
artifacts could not be resolved: org.apache.tamaya.ext:tamaya-injection-api:jar:0.4-incubating-SNAPSHOT,
org.apache.tamaya.ext:tamaya-events:jar:0.4-incubating-SNAPSHOT, org.apache.tamaya.ext:tamaya-injection:jar:0.4-incubating-SNAPSHOT:
Failure to find org.apache.tamaya.ext:tamaya-injection-api:jar:0.4-incubating-SNAPSHOT in
http://repository.apache.org/snapshots was cached in the local repository, resolution will
not be reattempted until the update interval of Nexus has elapsed or updates are forced ->
[Help 1]
[ERROR] Failed to execute goal on project tamaya-jsr382: Could not resolve dependencies for
project org.apache.tamaya.ext:tamaya-jsr382:jar:0.4-incubating-SNAPSHOT: The following artifacts
could not be resolved: org.apache.tamaya.ext:tamaya-injection-api:jar:0.4-incubating-SNAPSHOT,
org.apache.tamaya.ext:tamaya-functions:jar:0.4-incubating-SNAPSHOT, org.apache.tamaya.ext:tamaya-events:jar:0.4-incubating-SNAPSHOT:
Could not find artifact org.apache.tamaya.ext:tamaya-injection-api:jar:0.4-incubating-SNAPSHOT
in jitpack.io (https://jitpack.io) -> [Help 1]
[ERROR] 
[ERROR] To see the full stack trace of the errors, re-run Maven with the -e switch.
[ERROR] Re-run Maven using the -X switch to enable full debug logging.
[ERROR] 
[ERROR] For more information about the errors and possible solutions, please read the following
articles:
[ERROR] [Help 1] http://cwiki.apache.org/confluence/display/MAVEN/DependencyResolutionException
[ERROR] 
[ERROR] After correcting the problems, you can resume the build with the command
[ERROR]   mvn <goals> -rf :tamaya-commons-config_beta
[JENKINS] Archiving <https://builds.apache.org/job/Tamaya-Sandbox-Master/ws/documentation/pom.xml>
to org.apache.tamaya.ext/tamaya-doc_alpha/0.4-incubating-SNAPSHOT/tamaya-doc_alpha-0.4-incubating-SNAPSHOT.pom
[JENKINS] Archiving <https://builds.apache.org/job/Tamaya-Sandbox-Master/ws/validation/pom.xml>
to org.apache.tamaya.ext/tamaya-validation_alpha/0.4-incubating-SNAPSHOT/tamaya-validation_alpha-0.4-incubating-SNAPSHOT.pom
[JENKINS] Archiving <https://builds.apache.org/job/Tamaya-Sandbox-Master/ws/apache-commons/pom.xml>
to org.apache.tamaya.ext/tamaya-commons-config_beta/0.4-incubating-SNAPSHOT/tamaya-commons-config_beta-0.4-incubating-SNAPSHOT.pom
[JENKINS] Archiving <https://builds.apache.org/job/Tamaya-Sandbox-Master/ws/pom.xml>
to org.apache.tamaya.ext/tamaya-sandbox/0.4-incubating-SNAPSHOT/tamaya-sandbox-0.4-incubating-SNAPSHOT.pom
[JENKINS] Archiving <https://builds.apache.org/job/Tamaya-Sandbox-Master/ws/target/feature/feature.xml>
to org.apache.tamaya.ext/tamaya-sandbox/0.4-incubating-20191122.004137-3061/tamaya-sandbox-0.4-incubating-20191122.004137-3061-features.xml
[JENKINS] Archiving <https://builds.apache.org/job/Tamaya-Sandbox-Master/ws/vertx/pom.xml>
to org.apache.tamaya.ext/tamaya-vertx-alpha/0.4-incubating-SNAPSHOT/tamaya-vertx-alpha-0.4-incubating-SNAPSHOT.pom
[JENKINS] Archiving <https://builds.apache.org/job/Tamaya-Sandbox-Master/ws/uom/pom.xml>
to org.apache.tamaya.ext/tamaya-uom_beta/0.4-incubating-SNAPSHOT/tamaya-uom_beta-0.4-incubating-SNAPSHOT.pom
[JENKINS] Archiving <https://builds.apache.org/job/Tamaya-Sandbox-Master/ws/uom/target/tamaya-uom_beta-0.4-incubating-SNAPSHOT.jar>
to org.apache.tamaya.ext/tamaya-uom_beta/0.4-incubating-20191122.004444-2999/tamaya-uom_beta-0.4-incubating-20191122.004444-2999.jar
[JENKINS] Archiving <https://builds.apache.org/job/Tamaya-Sandbox-Master/ws/uom/target/feature/feature.xml>
to org.apache.tamaya.ext/tamaya-uom_beta/0.4-incubating-20191122.004444-2999/tamaya-uom_beta-0.4-incubating-20191122.004444-2999-features.xml
[JENKINS] Archiving <https://builds.apache.org/job/Tamaya-Sandbox-Master/ws/uom/target/tamaya-uom_beta-0.4-incubating-SNAPSHOT-javadoc.jar>
to org.apache.tamaya.ext/tamaya-uom_beta/0.4-incubating-20191122.004444-2999/tamaya-uom_beta-0.4-incubating-20191122.004444-2999-javadoc.jar
[JENKINS] Archiving <https://builds.apache.org/job/Tamaya-Sandbox-Master/ws/uom/target/tamaya-uom_beta-0.4-incubating-SNAPSHOT-sources.jar>
to org.apache.tamaya.ext/tamaya-uom_beta/0.4-incubating-20191122.004444-2999/tamaya-uom_beta-0.4-incubating-20191122.004444-2999-sources.jar
[JENKINS] Archiving <https://builds.apache.org/job/Tamaya-Sandbox-Master/ws/jodatime/pom.xml>
to org.apache.tamaya.ext/tamaya-jodatime_beta/0.4-incubating-SNAPSHOT/tamaya-jodatime_beta-0.4-incubating-SNAPSHOT.pom
[JENKINS] Archiving <https://builds.apache.org/job/Tamaya-Sandbox-Master/ws/jodatime/target/tamaya-jodatime_beta-0.4-incubating-SNAPSHOT.jar>
to org.apache.tamaya.ext/tamaya-jodatime_beta/0.4-incubating-20191122.004301-3027/tamaya-jodatime_beta-0.4-incubating-20191122.004301-3027.jar
[JENKINS] Archiving <https://builds.apache.org/job/Tamaya-Sandbox-Master/ws/jodatime/target/feature/feature.xml>
to org.apache.tamaya.ext/tamaya-jodatime_beta/0.4-incubating-20191122.004301-3027/tamaya-jodatime_beta-0.4-incubating-20191122.004301-3027-features.xml
[JENKINS] Archiving <https://builds.apache.org/job/Tamaya-Sandbox-Master/ws/jodatime/target/tamaya-jodatime_beta-0.4-incubating-SNAPSHOT-javadoc.jar>
to org.apache.tamaya.ext/tamaya-jodatime_beta/0.4-incubating-20191122.004301-3027/tamaya-jodatime_beta-0.4-incubating-20191122.004301-3027-javadoc.jar
[JENKINS] Archiving <https://builds.apache.org/job/Tamaya-Sandbox-Master/ws/jodatime/target/tamaya-jodatime_beta-0.4-incubating-SNAPSHOT-sources.jar>
to org.apache.tamaya.ext/tamaya-jodatime_beta/0.4-incubating-20191122.004301-3027/tamaya-jodatime_beta-0.4-incubating-20191122.004301-3027-sources.jar
[JENKINS] Archiving <https://builds.apache.org/job/Tamaya-Sandbox-Master/ws/configured-sysprops/pom.xml>
to org.apache.tamaya.ext/tamaya-sysprops_beta/0.4-incubating-SNAPSHOT/tamaya-sysprops_beta-0.4-incubating-SNAPSHOT.pom
[JENKINS] Archiving <https://builds.apache.org/job/Tamaya-Sandbox-Master/ws/configured-sysprops/target/tamaya-sysprops_beta-0.4-incubating-SNAPSHOT.jar>
to org.apache.tamaya.ext/tamaya-sysprops_beta/0.4-incubating-20191122.004351-3026/tamaya-sysprops_beta-0.4-incubating-20191122.004351-3026.jar
[JENKINS] Archiving <https://builds.apache.org/job/Tamaya-Sandbox-Master/ws/configured-sysprops/target/feature/feature.xml>
to org.apache.tamaya.ext/tamaya-sysprops_beta/0.4-incubating-20191122.004351-3026/tamaya-sysprops_beta-0.4-incubating-20191122.004351-3026-features.xml
[JENKINS] Archiving <https://builds.apache.org/job/Tamaya-Sandbox-Master/ws/configured-sysprops/target/tamaya-sysprops_beta-0.4-incubating-SNAPSHOT-javadoc.jar>
to org.apache.tamaya.ext/tamaya-sysprops_beta/0.4-incubating-20191122.004351-3026/tamaya-sysprops_beta-0.4-incubating-20191122.004351-3026-javadoc.jar
[JENKINS] Archiving <https://builds.apache.org/job/Tamaya-Sandbox-Master/ws/configured-sysprops/target/tamaya-sysprops_beta-0.4-incubating-SNAPSHOT-sources.jar>
to org.apache.tamaya.ext/tamaya-sysprops_beta/0.4-incubating-20191122.004351-3026/tamaya-sysprops_beta-0.4-incubating-20191122.004351-3026-sources.jar
[JENKINS] Archiving <https://builds.apache.org/job/Tamaya-Sandbox-Master/ws/metamodel/pom.xml>
to org.apache.tamaya.ext/tamaya-metamodel_alpha/0.4-incubating-SNAPSHOT/tamaya-metamodel_alpha-0.4-incubating-SNAPSHOT.pom
[JENKINS] Archiving <https://builds.apache.org/job/Tamaya-Sandbox-Master/ws/usagetracker/pom.xml>
to org.apache.tamaya.ext/tamaya-usagetracker_beta/0.4-incubating-SNAPSHOT/tamaya-usagetracker_beta-0.4-incubating-SNAPSHOT.pom
[JENKINS] Archiving <https://builds.apache.org/job/Tamaya-Sandbox-Master/ws/camel/pom.xml>
to org.apache.tamaya.ext/tamaya-camel_beta/0.4-incubating-SNAPSHOT/tamaya-camel_beta-0.4-incubating-SNAPSHOT.pom
[JENKINS] Archiving <https://builds.apache.org/job/Tamaya-Sandbox-Master/ws/remote/pom.xml>
to org.apache.tamaya.ext/tamaya-remote_alpha/0.4-incubating-SNAPSHOT/tamaya-remote_alpha-0.4-incubating-SNAPSHOT.pom
[JENKINS] Archiving <https://builds.apache.org/job/Tamaya-Sandbox-Master/ws/management/pom.xml>
to org.apache.tamaya.ext/tamaya-management_alpha/0.4-incubating-SNAPSHOT/tamaya-management_alpha-0.4-incubating-SNAPSHOT.pom
[JENKINS] Archiving <https://builds.apache.org/job/Tamaya-Sandbox-Master/ws/configjsr/pom.xml>
to org.apache.tamaya.ext/tamaya-jsr382/0.4-incubating-SNAPSHOT/tamaya-jsr382-0.4-incubating-SNAPSHOT.pom
[JENKINS] Archiving <https://builds.apache.org/job/Tamaya-Sandbox-Master/ws/propertysources/pom.xml>
to org.apache.tamaya.ext/tamaya-propertysources_alpha/0.4-incubating-SNAPSHOT/tamaya-propertysources_alpha-0.4-incubating-SNAPSHOT.pom
Sending e-mails to: commits@tamaya.apache.org
No mail will be sent out, as 'Tamaya-Sandbox-Master » Apache Tamaya Modules - Validation
#4135' does not have a result yet. Please make sure you set a proper result in case of pipeline/build
scripts.
Sending e-mails to: commits@tamaya.apache.org
No mail will be sent out, as 'Tamaya-Sandbox-Master » Apache Tamaya Sandbox #4135' does
not have a result yet. Please make sure you set a proper result in case of pipeline/build
scripts.
Sending e-mails to: commits@tamaya.apache.org
No mail will be sent out, as 'Tamaya-Sandbox-Master » Apache Tamaya Modules - Units of
Measurement Support #4135' does not have a result yet. Please make sure you set a proper result
in case of pipeline/build scripts.
No mail will be sent out, as 'Tamaya-Sandbox-Master » Apache Tamaya Modules - Joda-Time
Support #4135' does not have a result yet. Please make sure you set a proper result in case
of pipeline/build scripts.
No mail will be sent out, as 'Tamaya-Sandbox-Master » Apache Tamaya Modules - Configured
System Properties #4135' does not have a result yet. Please make sure you set a proper result
in case of pipeline/build scripts.
Sending e-mails to: commits@tamaya.apache.org
Sending e-mails to: commits@tamaya.apache.org
Sending e-mails to: commits@tamaya.apache.org
Sending e-mails to: commits@tamaya.apache.org
Sending e-mails to: commits@tamaya.apache.org
Sending e-mails to: commits@tamaya.apache.org
Sending e-mails to: commits@tamaya.apache.org
channel stopped

Mime
View raw message