tamaya-commits mailing list archives

Site index · List index
Message view « Date » · « Thread »
Top « Date » · « Thread »
From Apache Jenkins Server <jenk...@builds.apache.org>
Subject Build failed in Jenkins: Tamaya-Branch-Master-with-Coverage #1320
Date Tue, 12 Nov 2019 08:16:30 GMT
See <https://builds.apache.org/job/Tamaya-Branch-Master-with-Coverage/1320/display/redirect>

Changes:


------------------------------------------
[...truncated 984 B...]
 > git fetch --tags --progress https://gitbox.apache.org/repos/asf/incubator-tamaya.git
+refs/heads/*:refs/remotes/origin/*
 > git rev-parse refs/remotes/origin/master^{commit} # timeout=10
 > git rev-parse refs/remotes/origin/origin/master^{commit} # timeout=10
Checking out Revision 0ad439201f16ba1ddcc6b5c9ffb65e0a8a067301 (refs/remotes/origin/master)
 > git config core.sparsecheckout # timeout=10
 > git checkout -f 0ad439201f16ba1ddcc6b5c9ffb65e0a8a067301
Commit message: "TAMAYA-408 Added checksums and updated copyright years in NOTICE."
 > git rev-list --no-walk 0ad439201f16ba1ddcc6b5c9ffb65e0a8a067301 # timeout=10
Parsing POMs
Modules changed, recalculating dependency graph
Established TCP socket on 40477
maven33-agent.jar already up to date
maven33-interceptor.jar already up to date
maven3-interceptor-commons.jar already up to date
[Tamaya-Branch-Master-with-Coverage] $ /home/jenkins/tools/java/latest1.8/bin/java -Xmx2g
-Xms2g -cp /home/jenkins/jenkins-slave/maven33-agent.jar:/home/jenkins/tools/maven/apache-maven-3.3.9/boot/plexus-classworlds-2.5.2.jar:/home/jenkins/tools/maven/apache-maven-3.3.9/conf/logging
jenkins.maven3.agent.Maven33Main /home/jenkins/tools/maven/apache-maven-3.3.9 /home/jenkins/jenkins-slave/remoting.jar
/home/jenkins/jenkins-slave/maven33-interceptor.jar /home/jenkins/jenkins-slave/maven3-interceptor-commons.jar
40477
<===[JENKINS REMOTING CAPACITY]===>   channel started
Executing Maven:  -B -f <https://builds.apache.org/job/Tamaya-Branch-Master-with-Coverage/ws/pom.xml>
-Dmaven.repo.local=/home/jenkins/jenkins-slave/maven-repositories/0 -P coverage clean install
deploy
[INFO] Scanning for projects...
[INFO] ------------------------------------------------------------------------
[INFO] Reactor Build Order:
[INFO] 
[INFO] Apache Tamaya Base
[INFO] Apache Tamaya Build Configuration
[INFO] Apache Tamaya Code - all
[INFO] Apache Tamaya Core API
[INFO] Apache Tamaya Core SPI Support
[INFO] Apache Tamaya Core Implementation
[INFO] Apache Tamaya Core Examples
[INFO] Apache Tamaya Minimal Example
[INFO] Apache Tamaya Custom Propertysource Example
[INFO]                                                                         
[INFO] ------------------------------------------------------------------------
[INFO] Building Apache Tamaya Base 0.4-incubating
[INFO] ------------------------------------------------------------------------
[INFO] 
[INFO] --- maven-clean-plugin:3.1.0:clean (default-clean) @ tamaya-all ---
[INFO] Deleting <https://builds.apache.org/job/Tamaya-Branch-Master-with-Coverage/ws/target>
[INFO] 
[INFO] --- maven-enforcer-plugin:3.0.0-M1:enforce (enforce-maven-version) @ tamaya-all ---
[INFO] 
[INFO] --- maven-enforcer-plugin:3.0.0-M1:enforce (enforce-versions) @ tamaya-all ---
[INFO] 
[INFO] --- apache-rat-plugin:0.13:check (default) @ tamaya-all ---
[INFO] Enabled default license matchers.
[INFO] Will parse SCM ignores for exclusions...
[INFO] Parsing exclusions from <https://builds.apache.org/job/Tamaya-Branch-Master-with-Coverage/ws/.gitignore>
[INFO] Finished adding exclusions from SCM ignore files.
[INFO] 84 implicit excludes (use -debug for more details).
[INFO] 11 explicit excludes (use -debug for more details).
[INFO] 2 resources included (use -debug for more details)
[INFO] Rat check: Summary over all files. Unapproved: 0, unknown: 0, generated: 0, approved:
2 licenses.
[INFO] 
[INFO] --- buildnumber-maven-plugin:1.4:create (default) @ tamaya-all ---
[INFO] ShortRevision tag detected. The value is '8'.
[INFO] Executing: /bin/sh -c cd '<https://builds.apache.org/job/Tamaya-Branch-Master-with-Coverage/ws/'>
&& 'git' 'rev-parse' '--verify' '--short=8' 'HEAD'
[INFO] Working directory: <https://builds.apache.org/job/Tamaya-Branch-Master-with-Coverage/ws/>
[INFO] Storing buildNumber: 0ad43920 at timestamp: 1573546527144
[WARNING] Cannot get the branch information from the git repository: 
Detecting the current branch failed: fatal: ref HEAD is not a symbolic ref

[INFO] ShortRevision tag detected. The value is '8'.
[INFO] Executing: /bin/sh -c cd '<https://builds.apache.org/job/Tamaya-Branch-Master-with-Coverage/ws/'>
&& 'git' 'rev-parse' '--verify' '--short=8' 'HEAD'
[INFO] Working directory: <https://builds.apache.org/job/Tamaya-Branch-Master-with-Coverage/ws/>
[INFO] Storing buildScmBranch: UNKNOWN
[INFO] 
[INFO] --- jacoco-maven-plugin:0.8.4:prepare-agent (default) @ tamaya-all ---
[INFO] argLine set to -javaagent:/home/jenkins/jenkins-slave/maven-repositories/0/org/jacoco/org.jacoco.agent/0.8.4/org.jacoco.agent-0.8.4-runtime.jar=destfile=<https://builds.apache.org/job/Tamaya-Branch-Master-with-Coverage/ws/target/jacoco.exec>
[INFO] 
[INFO] --- maven-remote-resources-plugin:1.5:process (process-resource-bundles) @ tamaya-all
---
[INFO] 
[INFO] --- karaf-maven-plugin:4.0.5:features-generate-descriptor (generate) @ tamaya-all ---
[INFO] Generating feature descriptor file <https://builds.apache.org/job/Tamaya-Branch-Master-with-Coverage/ws/target/feature/feature.xml>
[INFO] ...done!
[INFO] 
[INFO] --- bnd-maven-plugin:3.3.0:bnd-process (default) @ tamaya-all ---
[INFO] skip project with packaging=pom
[INFO] 
[INFO] --- jacoco-maven-plugin:0.8.4:report (report) @ tamaya-all ---
[INFO] Skipping JaCoCo execution due to missing execution data file.
[INFO] 
[INFO] --- maven-site-plugin:3.7:attach-descriptor (attach-descriptor) @ tamaya-all ---
[INFO] No site descriptor found: nothing to attach.
[INFO] 
[INFO] --- maven-javadoc-plugin:3.0.1:jar (attach-javadocs) @ tamaya-all ---
[INFO] Not executing Javadoc as the project is not a Java classpath-capable package
[INFO] 
[INFO] >>> maven-source-plugin:3.0.1:jar (source-jar) > generate-sources @ tamaya-all
>>>
[INFO] 
[INFO] --- maven-enforcer-plugin:3.0.0-M1:enforce (enforce-maven-version) @ tamaya-all ---
[INFO] 
[INFO] --- maven-enforcer-plugin:3.0.0-M1:enforce (enforce-versions) @ tamaya-all ---
[INFO] 
[INFO] --- apache-rat-plugin:0.13:check (default) @ tamaya-all ---
[INFO] Enabled default license matchers.
[INFO] Will parse SCM ignores for exclusions...
[INFO] Parsing exclusions from <https://builds.apache.org/job/Tamaya-Branch-Master-with-Coverage/ws/.gitignore>
[INFO] Finished adding exclusions from SCM ignore files.
[INFO] 84 implicit excludes (use -debug for more details).
[INFO] 11 explicit excludes (use -debug for more details).
[INFO] 2 resources included (use -debug for more details)
[INFO] Rat check: Summary over all files. Unapproved: 0, unknown: 0, generated: 0, approved:
2 licenses.
[INFO] 
[INFO] --- buildnumber-maven-plugin:1.4:create (default) @ tamaya-all ---
[INFO] 
[INFO] --- jacoco-maven-plugin:0.8.4:prepare-agent (default) @ tamaya-all ---
[INFO] argLine set to -javaagent:/home/jenkins/jenkins-slave/maven-repositories/0/org/jacoco/org.jacoco.agent/0.8.4/org.jacoco.agent-0.8.4-runtime.jar=destfile=<https://builds.apache.org/job/Tamaya-Branch-Master-with-Coverage/ws/target/jacoco.exec>
[WARNING] Failed to getClass for org.apache.maven.plugins.source.SourceJarMojo
[INFO] 
[INFO] <<< maven-source-plugin:3.0.1:jar (source-jar) < generate-sources @ tamaya-all
<<<
[INFO] 
[INFO] --- maven-source-plugin:3.0.1:jar (source-jar) @ tamaya-all ---
[INFO] 
[INFO] --- maven-failsafe-plugin:2.22.0:integration-test (default) @ tamaya-all ---
[INFO] No tests to run.
[JENKINS] Recording test results
[INFO] 
[INFO] --- maven-failsafe-plugin:2.22.0:verify (default) @ tamaya-all ---
[JENKINS] Recording test results[INFO] 

[INFO] --- pitest-maven:1.2.5:mutationCoverage (mutationcoverage) @ tamaya-all ---
[INFO] Skipping project because:
[INFO]   - Packaging is POM.
[INFO]   - Project has no tests, it is empty.
[INFO] 
[INFO] --- maven-install-plugin:2.5.2:install (default-install) @ tamaya-all ---
[INFO] Installing <https://builds.apache.org/job/Tamaya-Branch-Master-with-Coverage/ws/pom.xml>
to /home/jenkins/jenkins-slave/maven-repositories/0/org/apache/tamaya/tamaya-all/0.4-incubating/tamaya-all-0.4-incubating.pom
[INFO] Installing <https://builds.apache.org/job/Tamaya-Branch-Master-with-Coverage/ws/target/feature/feature.xml>
to /home/jenkins/jenkins-slave/maven-repositories/0/org/apache/tamaya/tamaya-all/0.4-incubating/tamaya-all-0.4-incubating-features.xml
[INFO] 
[INFO] --- maven-enforcer-plugin:3.0.0-M1:enforce (enforce-maven-version) @ tamaya-all ---
[INFO] 
[INFO] --- maven-enforcer-plugin:3.0.0-M1:enforce (enforce-versions) @ tamaya-all ---
[INFO] 
[INFO] --- apache-rat-plugin:0.13:check (default) @ tamaya-all ---
[INFO] Enabled default license matchers.
[INFO] Will parse SCM ignores for exclusions...
[INFO] Parsing exclusions from <https://builds.apache.org/job/Tamaya-Branch-Master-with-Coverage/ws/.gitignore>
[INFO] Finished adding exclusions from SCM ignore files.
[INFO] 84 implicit excludes (use -debug for more details).
[INFO] 11 explicit excludes (use -debug for more details).
[INFO] 2 resources included (use -debug for more details)
[INFO] Rat check: Summary over all files. Unapproved: 0, unknown: 0, generated: 0, approved:
2 licenses.
[INFO] 
[INFO] --- buildnumber-maven-plugin:1.4:create (default) @ tamaya-all ---
[INFO] 
[INFO] --- jacoco-maven-plugin:0.8.4:prepare-agent (default) @ tamaya-all ---
[INFO] argLine set to -javaagent:/home/jenkins/jenkins-slave/maven-repositories/0/org/jacoco/org.jacoco.agent/0.8.4/org.jacoco.agent-0.8.4-runtime.jar=destfile=<https://builds.apache.org/job/Tamaya-Branch-Master-with-Coverage/ws/target/jacoco.exec>
[INFO] 
[INFO] --- maven-remote-resources-plugin:1.5:process (process-resource-bundles) @ tamaya-all
---
[INFO] 
[INFO] --- karaf-maven-plugin:4.0.5:features-generate-descriptor (generate) @ tamaya-all ---
[INFO] Generating feature descriptor file <https://builds.apache.org/job/Tamaya-Branch-Master-with-Coverage/ws/target/feature/feature.xml>
[INFO] ...done!
[INFO] 
[INFO] --- bnd-maven-plugin:3.3.0:bnd-process (default) @ tamaya-all ---
[INFO] skip project with packaging=pom
[INFO] 
[INFO] --- jacoco-maven-plugin:0.8.4:report (report) @ tamaya-all ---
[INFO] Skipping JaCoCo execution due to missing execution data file.
[INFO] 
[INFO] --- maven-site-plugin:3.7:attach-descriptor (attach-descriptor) @ tamaya-all ---
[INFO] No site descriptor found: nothing to attach.
[INFO] 
[INFO] --- maven-javadoc-plugin:3.0.1:jar (attach-javadocs) @ tamaya-all ---
[INFO] Not executing Javadoc as the project is not a Java classpath-capable package
[INFO] 
[INFO] >>> maven-source-plugin:3.0.1:jar (source-jar) > generate-sources @ tamaya-all
>>>
[INFO] 
[INFO] --- maven-enforcer-plugin:3.0.0-M1:enforce (enforce-maven-version) @ tamaya-all ---
[INFO] 
[INFO] --- maven-enforcer-plugin:3.0.0-M1:enforce (enforce-versions) @ tamaya-all ---
[INFO] 
[INFO] --- apache-rat-plugin:0.13:check (default) @ tamaya-all ---
[INFO] Enabled default license matchers.
[INFO] Will parse SCM ignores for exclusions...
[INFO] Parsing exclusions from <https://builds.apache.org/job/Tamaya-Branch-Master-with-Coverage/ws/.gitignore>
[INFO] Finished adding exclusions from SCM ignore files.
[INFO] 84 implicit excludes (use -debug for more details).
[INFO] 11 explicit excludes (use -debug for more details).
[INFO] 2 resources included (use -debug for more details)
[INFO] Rat check: Summary over all files. Unapproved: 0, unknown: 0, generated: 0, approved:
2 licenses.
[INFO] 
[INFO] --- buildnumber-maven-plugin:1.4:create (default) @ tamaya-all ---
[INFO] 
[INFO] --- jacoco-maven-plugin:0.8.4:prepare-agent (default) @ tamaya-all ---
[INFO] argLine set to -javaagent:/home/jenkins/jenkins-slave/maven-repositories/0/org/jacoco/org.jacoco.agent/0.8.4/org.jacoco.agent-0.8.4-runtime.jar=destfile=<https://builds.apache.org/job/Tamaya-Branch-Master-with-Coverage/ws/target/jacoco.exec>
[WARNING] Failed to getClass for org.apache.maven.plugins.source.SourceJarMojo
[INFO] 
[INFO] <<< maven-source-plugin:3.0.1:jar (source-jar) < generate-sources @ tamaya-all
<<<
[INFO] 
[INFO] --- maven-source-plugin:3.0.1:jar (source-jar) @ tamaya-all ---
[INFO] 
[INFO] --- maven-failsafe-plugin:2.22.0:integration-test (default) @ tamaya-all ---
[INFO] No tests to run.
[INFO] Skipping execution of surefire because it has already been run for this configuration
[JENKINS] Recording test results
[INFO] 
[INFO] --- maven-failsafe-plugin:2.22.0:verify (default) @ tamaya-all ---
[JENKINS] Recording test results[INFO] 
[INFO] --- pitest-maven:1.2.5:mutationCoverage (mutationcoverage) @ tamaya-all ---

[INFO] Skipping project because:
[INFO]   - Packaging is POM.
[INFO]   - Project has no tests, it is empty.
[INFO] 
[INFO] --- maven-install-plugin:2.5.2:install (default-install) @ tamaya-all ---
[INFO] Installing <https://builds.apache.org/job/Tamaya-Branch-Master-with-Coverage/ws/pom.xml>
to /home/jenkins/jenkins-slave/maven-repositories/0/org/apache/tamaya/tamaya-all/0.4-incubating/tamaya-all-0.4-incubating.pom
[INFO] Installing <https://builds.apache.org/job/Tamaya-Branch-Master-with-Coverage/ws/target/feature/feature.xml>
to /home/jenkins/jenkins-slave/maven-repositories/0/org/apache/tamaya/tamaya-all/0.4-incubating/tamaya-all-0.4-incubating-features.xml
[INFO] Installing <https://builds.apache.org/job/Tamaya-Branch-Master-with-Coverage/ws/target/feature/feature.xml>
to /home/jenkins/jenkins-slave/maven-repositories/0/org/apache/tamaya/tamaya-all/0.4-incubating/tamaya-all-0.4-incubating-features.xml
[INFO] 
[INFO] --- maven-deploy-plugin:2.8.2:deploy (default-deploy) @ tamaya-all ---
[INFO] Uploading: https://repository.apache.org/service/local/staging/deploy/maven2/org/apache/tamaya/tamaya-all/0.4-incubating/tamaya-all-0.4-incubating.pom
[INFO] ------------------------------------------------------------------------
[INFO] Reactor Summary:
[INFO] 
[INFO] Apache Tamaya Base ................................. FAILURE [ 34.135 s]
[INFO] Apache Tamaya Build Configuration .................. SKIPPED
[INFO] Apache Tamaya Code - all ........................... SKIPPED
[INFO] Apache Tamaya Core API ............................. SKIPPED
[INFO] Apache Tamaya Core SPI Support ..................... SKIPPED
[INFO] Apache Tamaya Core Implementation .................. SKIPPED
[INFO] Apache Tamaya Core Examples ........................ SKIPPED
[INFO] Apache Tamaya Minimal Example ...................... SKIPPED
[INFO] Apache Tamaya Custom Propertysource Example ........ SKIPPED
[INFO] ------------------------------------------------------------------------
[INFO] BUILD FAILURE
[INFO] ------------------------------------------------------------------------
[INFO] Total time: 49.019 s
[INFO] Finished at: 2019-11-12T08:16:09+00:00
[INFO] Final Memory: 67M/1963M
[INFO] ------------------------------------------------------------------------
[ERROR] Failed to execute goal org.apache.maven.plugins:maven-deploy-plugin:2.8.2:deploy (default-deploy)
on project tamaya-all: Failed to deploy artifacts: Could not transfer artifact org.apache.tamaya:tamaya-all:pom:0.4-incubating
from/to apache.releases.https (https://repository.apache.org/service/local/staging/deploy/maven2):
Failed to transfer file: https://repository.apache.org/service/local/staging/deploy/maven2/org/apache/tamaya/tamaya-all/0.4-incubating/tamaya-all-0.4-incubating.pom.
Return code is: 401, ReasonPhrase: Unauthorized. -> [Help 1]
[ERROR] 
[ERROR] To see the full stack trace of the errors, re-run Maven with the -e switch.
[ERROR] Re-run Maven using the -X switch to enable full debug logging.
[ERROR] 
[ERROR] For more information about the errors and possible solutions, please read the following
articles:
[ERROR] [Help 1] http://cwiki.apache.org/confluence/display/MAVEN/MojoExecutionException
[JENKINS] Archiving <https://builds.apache.org/job/Tamaya-Branch-Master-with-Coverage/ws/pom.xml>
to org.apache.tamaya/tamaya-all/0.4-incubating/tamaya-all-0.4-incubating.pom
[JENKINS] Archiving <https://builds.apache.org/job/Tamaya-Branch-Master-with-Coverage/ws/target/feature/feature.xml>
to org.apache.tamaya/tamaya-all/0.4-incubating/tamaya-all-0.4-incubating-features.xml
[JENKINS] Archiving <https://builds.apache.org/job/Tamaya-Branch-Master-with-Coverage/ws/buildconfigurations/pom.xml>
to org.apache.tamaya/buildconfigurations/0.4-incubating/buildconfigurations-0.4-incubating.pom
[JENKINS] Archiving <https://builds.apache.org/job/Tamaya-Branch-Master-with-Coverage/ws/code/core/pom.xml>
to org.apache.tamaya/tamaya-core/0.4-incubating/tamaya-core-0.4-incubating.pom
[JENKINS] Archiving <https://builds.apache.org/job/Tamaya-Branch-Master-with-Coverage/ws/code/api/pom.xml>
to org.apache.tamaya/tamaya-api/0.4-incubating/tamaya-api-0.4-incubating.pom
[JENKINS] Archiving <https://builds.apache.org/job/Tamaya-Branch-Master-with-Coverage/ws/code/spi-support/pom.xml>
to org.apache.tamaya/tamaya-spisupport/0.4-incubating/tamaya-spisupport-0.4-incubating.pom
[JENKINS] Archiving <https://builds.apache.org/job/Tamaya-Branch-Master-with-Coverage/ws/examples/01-minimal/pom.xml>
to org.apache.tamaya.examples/01-minimal/0.4-incubating/01-minimal-0.4-incubating.pom
[JENKINS] Archiving <https://builds.apache.org/job/Tamaya-Branch-Master-with-Coverage/ws/examples/pom.xml>
to org.apache.tamaya.examples/examples/0.4-incubating/examples-0.4-incubating.pom
[JENKINS] Archiving <https://builds.apache.org/job/Tamaya-Branch-Master-with-Coverage/ws/code/pom.xml>
to org.apache.tamaya/tamaya-code/0.4-incubating/tamaya-code-0.4-incubating.pom
[JENKINS] Archiving <https://builds.apache.org/job/Tamaya-Branch-Master-with-Coverage/ws/examples/02-custom-property-source/pom.xml>
to org.apache.tamaya.examples/02-custom-property-source/0.4-incubating/02-custom-property-source-0.4-incubating.pom
channel stopped
Not sending mail to unregistered user atsticks@gmail.com

Mime
View raw message