tamaya-commits mailing list archives

Site index · List index
Message view « Date » · « Thread »
Top « Date » · « Thread »
From Apache Jenkins Server <jenk...@builds.apache.org>
Subject Build failed in Jenkins: Tamaya-Master-branch #1969
Date Fri, 28 Jun 2019 21:47:27 GMT
See <https://builds.apache.org/job/Tamaya-Master-branch/1969/display/redirect?page=changes>

Changes:

[github] LHF: Fix build, construct hierarchy provoking RTE

------------------------------------------
[...truncated 71.97 KB...]
[INFO] 
[INFO] --- maven-clean-plugin:3.1.0:clean (default-clean) @ tamaya-api ---
[INFO] 
[INFO] --- maven-enforcer-plugin:3.0.0-M1:enforce (enforce-maven-version) @ tamaya-api ---
[INFO] 
[INFO] --- maven-enforcer-plugin:3.0.0-M1:enforce (enforce-versions) @ tamaya-api ---
[INFO] 
[INFO] --- apache-rat-plugin:0.13:check (default) @ tamaya-api ---
[INFO] Enabled default license matchers.
[INFO] Will parse SCM ignores for exclusions...
[INFO] Finished adding exclusions from SCM ignore files.
[INFO] 62 implicit excludes (use -debug for more details).
[INFO] 11 explicit excludes (use -debug for more details).
[INFO] 52 resources included (use -debug for more details)
[INFO] Rat check: Summary over all files. Unapproved: 0, unknown: 0, generated: 0, approved:
52 licenses.
[INFO] 
[INFO] --- buildnumber-maven-plugin:1.4:create (default) @ tamaya-api ---
[INFO] 
[INFO] --- maven-checkstyle-plugin:3.0.0:check (checkstyle) @ tamaya-api ---
[INFO] There is 1 error reported by Checkstyle 8.19 with buildconfigurations/src/main/resources/checkstyle/style.xml
ruleset.
[ERROR] src/test/java/org/apache/tamaya/TypeLiteralTest.java:[118,1] (whitespace) FileTabCharacter:
File contains tab characters (this is the first instance).
[INFO]                                                                         
[INFO] ------------------------------------------------------------------------
[INFO] Skipping Apache Tamaya Core SPI Support
[INFO] This project has been banned from the build due to previous failures.
[INFO] ------------------------------------------------------------------------
[INFO]                                                                         
[INFO] ------------------------------------------------------------------------
[INFO] Skipping Apache Tamaya Core Implementation
[INFO] This project has been banned from the build due to previous failures.
[INFO] ------------------------------------------------------------------------
[INFO]                                                                         
[INFO] ------------------------------------------------------------------------
[INFO] Building Apache Tamaya Core Examples 0.4-incubating-SNAPSHOT
[INFO] ------------------------------------------------------------------------
[INFO] 
[INFO] --- maven-clean-plugin:3.1.0:clean (default-clean) @ examples ---
[INFO] 
[INFO] --- maven-enforcer-plugin:3.0.0-M1:enforce (enforce-maven-version) @ examples ---
[INFO] 
[INFO] --- maven-enforcer-plugin:3.0.0-M1:enforce (enforce-versions) @ examples ---
[INFO] 
[INFO] --- apache-rat-plugin:0.13:check (default) @ examples ---
[INFO] Enabled default license matchers.
[INFO] Will parse SCM ignores for exclusions...
[INFO] Finished adding exclusions from SCM ignore files.
[INFO] 64 implicit excludes (use -debug for more details).
[INFO] 11 explicit excludes (use -debug for more details).
[INFO] 1 resources included (use -debug for more details)
[INFO] Rat check: Summary over all files. Unapproved: 0, unknown: 0, generated: 0, approved:
1 licenses.
[INFO] 
[INFO] --- buildnumber-maven-plugin:1.4:create (default) @ examples ---
[INFO] 
[INFO] --- jacoco-maven-plugin:0.8.4:prepare-agent (default) @ examples ---
[INFO] argLine set to -javaagent:/home/jenkins/jenkins-slave/maven-repositories/0/org/jacoco/org.jacoco.agent/0.8.4/org.jacoco.agent-0.8.4-runtime.jar=destfile=<https://builds.apache.org/job/Tamaya-Master-branch/ws/examples/target/jacoco.exec>
[INFO] 
[INFO] --- maven-remote-resources-plugin:1.5:process (process-resource-bundles) @ examples
---
[INFO] 
[INFO] --- karaf-maven-plugin:4.0.5:features-generate-descriptor (generate) @ examples ---
[INFO] Generating feature descriptor file <https://builds.apache.org/job/Tamaya-Master-branch/ws/examples/target/feature/feature.xml>
[INFO] ...done!
[INFO] 
[INFO] --- bnd-maven-plugin:3.3.0:bnd-process (default) @ examples ---
[INFO] skip project with packaging=pom
[INFO] 
[INFO] --- jacoco-maven-plugin:0.8.4:report (report) @ examples ---
[INFO] Skipping JaCoCo execution due to missing execution data file.
[INFO] 
[INFO] --- maven-site-plugin:3.7:attach-descriptor (attach-descriptor) @ examples ---
[INFO] No site descriptor found: nothing to attach.
[INFO] 
[INFO] --- maven-javadoc-plugin:3.0.1:jar (attach-javadocs) @ examples ---
[INFO] Not executing Javadoc as the project is not a Java classpath-capable package
[INFO] 
[INFO] >>> maven-source-plugin:3.0.1:jar (source-jar) > generate-sources @ examples
>>>
[INFO] 
[INFO] --- maven-enforcer-plugin:3.0.0-M1:enforce (enforce-maven-version) @ examples ---
[INFO] 
[INFO] --- maven-enforcer-plugin:3.0.0-M1:enforce (enforce-versions) @ examples ---
[INFO] 
[INFO] --- apache-rat-plugin:0.13:check (default) @ examples ---
[INFO] Enabled default license matchers.
[INFO] Will parse SCM ignores for exclusions...
[INFO] Finished adding exclusions from SCM ignore files.
[INFO] 64 implicit excludes (use -debug for more details).
[INFO] 11 explicit excludes (use -debug for more details).
[INFO] 1 resources included (use -debug for more details)
[INFO] Rat check: Summary over all files. Unapproved: 0, unknown: 0, generated: 0, approved:
1 licenses.
[INFO] 
[INFO] --- buildnumber-maven-plugin:1.4:create (default) @ examples ---
[INFO] 
[INFO] --- jacoco-maven-plugin:0.8.4:prepare-agent (default) @ examples ---
[INFO] argLine set to -javaagent:/home/jenkins/jenkins-slave/maven-repositories/0/org/jacoco/org.jacoco.agent/0.8.4/org.jacoco.agent-0.8.4-runtime.jar=destfile=<https://builds.apache.org/job/Tamaya-Master-branch/ws/examples/target/jacoco.exec>
[WARNING] Failed to getClass for org.apache.maven.plugins.source.SourceJarMojo
[INFO] 
[INFO] <<< maven-source-plugin:3.0.1:jar (source-jar) < generate-sources @ examples
<<<
[INFO] 
[INFO] --- maven-source-plugin:3.0.1:jar (source-jar) @ examples ---
[INFO] 
[INFO] --- maven-failsafe-plugin:2.22.0:integration-test (default) @ examples ---
[INFO] No tests to run.
[JENKINS] Recording test results
[INFO] 
[INFO] --- maven-failsafe-plugin:2.22.0:verify (default) @ examples ---
[JENKINS] Recording test results
[INFO] 
[INFO] --- maven-install-plugin:2.5.2:install (default-install) @ examples ---
[INFO] Installing <https://builds.apache.org/job/Tamaya-Master-branch/ws/examples/pom.xml>
to /home/jenkins/jenkins-slave/maven-repositories/0/org/apache/tamaya/examples/examples/0.4-incubating-SNAPSHOT/examples-0.4-incubating-SNAPSHOT.pom
[INFO] Installing <https://builds.apache.org/job/Tamaya-Master-branch/ws/examples/target/feature/feature.xml>
to /home/jenkins/jenkins-slave/maven-repositories/0/org/apache/tamaya/examples/examples/0.4-incubating-SNAPSHOT/examples-0.4-incubating-SNAPSHOT-features.xml
[INFO] 
[INFO] --- maven-enforcer-plugin:3.0.0-M1:enforce (enforce-maven-version) @ examples ---
[INFO] 
[INFO] --- maven-enforcer-plugin:3.0.0-M1:enforce (enforce-versions) @ examples ---
[INFO] 
[INFO] --- apache-rat-plugin:0.13:check (default) @ examples ---
[INFO] Enabled default license matchers.
[INFO] Will parse SCM ignores for exclusions...
[INFO] Finished adding exclusions from SCM ignore files.
[INFO] 64 implicit excludes (use -debug for more details).
[INFO] 11 explicit excludes (use -debug for more details).
[INFO] 1 resources included (use -debug for more details)
[INFO] Rat check: Summary over all files. Unapproved: 0, unknown: 0, generated: 0, approved:
1 licenses.
[INFO] 
[INFO] --- buildnumber-maven-plugin:1.4:create (default) @ examples ---
[INFO] 
[INFO] --- jacoco-maven-plugin:0.8.4:prepare-agent (default) @ examples ---
[INFO] argLine set to -javaagent:/home/jenkins/jenkins-slave/maven-repositories/0/org/jacoco/org.jacoco.agent/0.8.4/org.jacoco.agent-0.8.4-runtime.jar=destfile=<https://builds.apache.org/job/Tamaya-Master-branch/ws/examples/target/jacoco.exec>
[INFO] 
[INFO] --- maven-remote-resources-plugin:1.5:process (process-resource-bundles) @ examples
---
[INFO] 
[INFO] --- karaf-maven-plugin:4.0.5:features-generate-descriptor (generate) @ examples ---
[INFO] Generating feature descriptor file <https://builds.apache.org/job/Tamaya-Master-branch/ws/examples/target/feature/feature.xml>
[INFO] ...done!
[INFO] 
[INFO] --- bnd-maven-plugin:3.3.0:bnd-process (default) @ examples ---
[INFO] skip project with packaging=pom
[INFO] 
[INFO] --- jacoco-maven-plugin:0.8.4:report (report) @ examples ---
[INFO] Skipping JaCoCo execution due to missing execution data file.
[INFO] 
[INFO] --- maven-site-plugin:3.7:attach-descriptor (attach-descriptor) @ examples ---
[INFO] No site descriptor found: nothing to attach.
[INFO] 
[INFO] --- maven-javadoc-plugin:3.0.1:jar (attach-javadocs) @ examples ---
[INFO] Not executing Javadoc as the project is not a Java classpath-capable package
[INFO] 
[INFO] >>> maven-source-plugin:3.0.1:jar (source-jar) > generate-sources @ examples
>>>
[INFO] 
[INFO] --- maven-enforcer-plugin:3.0.0-M1:enforce (enforce-maven-version) @ examples ---
[INFO] 
[INFO] --- maven-enforcer-plugin:3.0.0-M1:enforce (enforce-versions) @ examples ---
[INFO] 
[INFO] --- apache-rat-plugin:0.13:check (default) @ examples ---
[INFO] Enabled default license matchers.
[INFO] Will parse SCM ignores for exclusions...
[INFO] Finished adding exclusions from SCM ignore files.
[INFO] 64 implicit excludes (use -debug for more details).
[INFO] 11 explicit excludes (use -debug for more details).
[INFO] 1 resources included (use -debug for more details)
[INFO] Rat check: Summary over all files. Unapproved: 0, unknown: 0, generated: 0, approved:
1 licenses.
[INFO] 
[INFO] --- buildnumber-maven-plugin:1.4:create (default) @ examples ---
[INFO] 
[INFO] --- jacoco-maven-plugin:0.8.4:prepare-agent (default) @ examples ---
[INFO] argLine set to -javaagent:/home/jenkins/jenkins-slave/maven-repositories/0/org/jacoco/org.jacoco.agent/0.8.4/org.jacoco.agent-0.8.4-runtime.jar=destfile=<https://builds.apache.org/job/Tamaya-Master-branch/ws/examples/target/jacoco.exec>
[WARNING] Failed to getClass for org.apache.maven.plugins.source.SourceJarMojo
[INFO] 
[INFO] <<< maven-source-plugin:3.0.1:jar (source-jar) < generate-sources @ examples
<<<
[INFO] 
[INFO] --- maven-source-plugin:3.0.1:jar (source-jar) @ examples ---
[INFO] 
[INFO] --- maven-failsafe-plugin:2.22.0:integration-test (default) @ examples ---
[INFO] No tests to run.
[INFO] Skipping execution of surefire because it has already been run for this configuration
[JENKINS] Recording test results
[INFO] 
[INFO] --- maven-failsafe-plugin:2.22.0:verify (default) @ examples ---
[JENKINS] Recording test results
[INFO] 
[INFO] --- maven-install-plugin:2.5.2:install (default-install) @ examples ---
[INFO] Installing <https://builds.apache.org/job/Tamaya-Master-branch/ws/examples/pom.xml>
to /home/jenkins/jenkins-slave/maven-repositories/0/org/apache/tamaya/examples/examples/0.4-incubating-SNAPSHOT/examples-0.4-incubating-SNAPSHOT.pom
[INFO] Installing <https://builds.apache.org/job/Tamaya-Master-branch/ws/examples/target/feature/feature.xml>
to /home/jenkins/jenkins-slave/maven-repositories/0/org/apache/tamaya/examples/examples/0.4-incubating-SNAPSHOT/examples-0.4-incubating-SNAPSHOT-features.xml
[INFO] Installing <https://builds.apache.org/job/Tamaya-Master-branch/ws/examples/target/feature/feature.xml>
to /home/jenkins/jenkins-slave/maven-repositories/0/org/apache/tamaya/examples/examples/0.4-incubating-SNAPSHOT/examples-0.4-incubating-SNAPSHOT-features.xml
[INFO] 
[INFO] --- maven-deploy-plugin:2.8.2:deploy (default-deploy) @ examples ---
[INFO] Skipping artifact deployment
[INFO]                                                                         
[INFO] ------------------------------------------------------------------------
[INFO] Skipping Apache Tamaya Minimal Example
[INFO] This project has been banned from the build due to previous failures.
[INFO] ------------------------------------------------------------------------
[INFO]                                                                         
[INFO] ------------------------------------------------------------------------
[INFO] Skipping Apache Tamaya Custom Propertysource Example
[INFO] This project has been banned from the build due to previous failures.
[INFO] ------------------------------------------------------------------------
[INFO]                                                                         
[INFO] ------------------------------------------------------------------------
[INFO] Skipping Apache Tamaya Distribution
[INFO] This project has been banned from the build due to previous failures.
[INFO] ------------------------------------------------------------------------
[INFO] ------------------------------------------------------------------------
[INFO] Reactor Summary:
[INFO] 
[INFO] Apache Tamaya Base ................................. SUCCESS [ 40.994 s]
[INFO] Apache Tamaya Build Configuration .................. SUCCESS [ 11.751 s]
[INFO] Apache Tamaya Code - all ........................... SUCCESS [ 16.208 s]
[INFO] Apache Tamaya Core API ............................. FAILURE [  4.260 s]
[INFO] Apache Tamaya Core SPI Support ..................... SKIPPED
[INFO] Apache Tamaya Core Implementation .................. SKIPPED
[INFO] Apache Tamaya Core Examples ........................ SUCCESS [  8.730 s]
[INFO] Apache Tamaya Minimal Example ...................... SKIPPED
[INFO] Apache Tamaya Custom Propertysource Example ........ SKIPPED
[INFO] Apache Tamaya Distribution ......................... SKIPPED
[INFO] ------------------------------------------------------------------------
[INFO] BUILD FAILURE
[INFO] ------------------------------------------------------------------------
[INFO] Total time: 01:53 min
[INFO] Finished at: 2019-06-28T21:47:09+00:00
[INFO] Final Memory: 75M/3925M
[INFO] ------------------------------------------------------------------------
[ERROR] Failed to execute goal org.apache.maven.plugins:maven-checkstyle-plugin:3.0.0:check
(checkstyle) on project tamaya-api: You have 1 Checkstyle violation. -> [Help 1]
[ERROR] 
[ERROR] To see the full stack trace of the errors, re-run Maven with the -e switch.
[ERROR] Re-run Maven using the -X switch to enable full debug logging.
[ERROR] 
[ERROR] For more information about the errors and possible solutions, please read the following
articles:
[ERROR] [Help 1] http://cwiki.apache.org/confluence/display/MAVEN/MojoFailureException
[ERROR] 
[ERROR] After correcting the problems, you can resume the build with the command
[ERROR]   mvn <goals> -rf :tamaya-api
[JENKINS] Archiving <https://builds.apache.org/job/Tamaya-Master-branch/ws/pom.xml>
to org.apache.tamaya/tamaya-all/0.4-incubating-SNAPSHOT/tamaya-all-0.4-incubating-SNAPSHOT.pom
[JENKINS] Archiving <https://builds.apache.org/job/Tamaya-Master-branch/ws/target/feature/feature.xml>
to org.apache.tamaya/tamaya-all/0.4-incubating-20190628.214552-1955/tamaya-all-0.4-incubating-20190628.214552-1955-features.xml
[JENKINS] Archiving <https://builds.apache.org/job/Tamaya-Master-branch/ws/buildconfigurations/pom.xml>
to org.apache.tamaya/buildconfigurations/0.4-incubating-SNAPSHOT/buildconfigurations-0.4-incubating-SNAPSHOT.pom
[JENKINS] Archiving <https://builds.apache.org/job/Tamaya-Master-branch/ws/buildconfigurations/target/buildconfigurations-0.4-incubating-SNAPSHOT.jar>
to org.apache.tamaya/buildconfigurations/0.4-incubating-SNAPSHOT/buildconfigurations-0.4-incubating-SNAPSHOT.jar
[JENKINS] Archiving <https://builds.apache.org/job/Tamaya-Master-branch/ws/buildconfigurations/target/feature/feature.xml>
to org.apache.tamaya/buildconfigurations/0.4-incubating-SNAPSHOT/buildconfigurations-0.4-incubating-SNAPSHOT-features.xml
[JENKINS] Archiving <https://builds.apache.org/job/Tamaya-Master-branch/ws/buildconfigurations/target/buildconfigurations-0.4-incubating-SNAPSHOT-sources.jar>
to org.apache.tamaya/buildconfigurations/0.4-incubating-SNAPSHOT/buildconfigurations-0.4-incubating-SNAPSHOT-sources.jar
[JENKINS] Archiving <https://builds.apache.org/job/Tamaya-Master-branch/ws/code/core/pom.xml>
to org.apache.tamaya/tamaya-core/0.4-incubating-SNAPSHOT/tamaya-core-0.4-incubating-SNAPSHOT.pom
[JENKINS] Archiving <https://builds.apache.org/job/Tamaya-Master-branch/ws/code/api/pom.xml>
to org.apache.tamaya/tamaya-api/0.4-incubating-SNAPSHOT/tamaya-api-0.4-incubating-SNAPSHOT.pom
[JENKINS] Archiving <https://builds.apache.org/job/Tamaya-Master-branch/ws/code/spi-support/pom.xml>
to org.apache.tamaya/tamaya-spisupport/0.4-incubating-SNAPSHOT/tamaya-spisupport-0.4-incubating-SNAPSHOT.pom
[JENKINS] Archiving <https://builds.apache.org/job/Tamaya-Master-branch/ws/examples/01-minimal/pom.xml>
to org.apache.tamaya.examples/01-minimal/0.4-incubating-SNAPSHOT/01-minimal-0.4-incubating-SNAPSHOT.pom
[JENKINS] Archiving <https://builds.apache.org/job/Tamaya-Master-branch/ws/distribution/pom.xml>
to org.apache.tamaya/tamaya-distribution/0.4-incubating-SNAPSHOT/tamaya-distribution-0.4-incubating-SNAPSHOT.pom
[JENKINS] Archiving <https://builds.apache.org/job/Tamaya-Master-branch/ws/examples/pom.xml>
to org.apache.tamaya.examples/examples/0.4-incubating-SNAPSHOT/examples-0.4-incubating-SNAPSHOT.pom
[JENKINS] Archiving <https://builds.apache.org/job/Tamaya-Master-branch/ws/examples/target/feature/feature.xml>
to org.apache.tamaya.examples/examples/0.4-incubating-SNAPSHOT/examples-0.4-incubating-SNAPSHOT-features.xml
[JENKINS] Archiving <https://builds.apache.org/job/Tamaya-Master-branch/ws/code/pom.xml>
to org.apache.tamaya/tamaya-code/0.4-incubating-SNAPSHOT/tamaya-code-0.4-incubating-SNAPSHOT.pom
[JENKINS] Archiving <https://builds.apache.org/job/Tamaya-Master-branch/ws/code/target/feature/feature.xml>
to org.apache.tamaya/tamaya-code/0.4-incubating-20190628.214629-1957/tamaya-code-0.4-incubating-20190628.214629-1957-features.xml
[JENKINS] Archiving <https://builds.apache.org/job/Tamaya-Master-branch/ws/examples/02-custom-property-source/pom.xml>
to org.apache.tamaya.examples/02-custom-property-source/0.4-incubating-SNAPSHOT/02-custom-property-source-0.4-incubating-SNAPSHOT.pom
channel stopped
Not sending mail to unregistered user noreply@github.com

Mime
View raw message