tamaya-commits mailing list archives

Site index · List index
Message view « Date » · « Thread »
Top « Date » · « Thread »
From Apache Jenkins Server <jenk...@builds.apache.org>
Subject Build failed in Jenkins: Tamaya-Extensions-Master-with-Coverage #1429
Date Tue, 14 May 2019 14:55:27 GMT
See <https://builds.apache.org/job/Tamaya-Extensions-Master-with-Coverage/1429/display/redirect?page=changes>

Changes:

[atsticks] TAMAYA-398 TAMAYA-399 TAMAYA-400 TAMAYA-401 TAMAYA-402 TAMAYA-403

[atsticks] Fixed quality issues.

------------------------------------------
[...truncated 140.59 KB...]
[INFO] ShortRevision tag detected. The value is '8'.
[INFO] Executing: /bin/sh -c cd '<https://builds.apache.org/job/Tamaya-Extensions-Master-with-Coverage/ws/modules'>
&& 'git' 'rev-parse' '--verify' '--short=8' 'HEAD'
[INFO] Working directory: <https://builds.apache.org/job/Tamaya-Extensions-Master-with-Coverage/ws/modules>
[INFO] Storing buildScmBranch: UNKNOWN
[INFO] 
[INFO] --- maven-checkstyle-plugin:3.0.0:check (checkstyle) @ tamaya-extensions ---
[WARNING] Failed to getClass for org.apache.maven.plugins.source.SourceJarMojo
[INFO] 
[INFO] <<< maven-source-plugin:3.0.1:jar (source-jar) < generate-sources @ tamaya-extensions
<<<
[INFO] 
[INFO] 
[INFO] --- maven-source-plugin:3.0.1:jar (source-jar) @ tamaya-extensions ---
[INFO] 
[INFO] --- maven-failsafe-plugin:2.21.0:integration-test (default) @ tamaya-extensions ---
[INFO] No tests to run.
[JENKINS] Recording test results
[INFO] 
[INFO] --- maven-failsafe-plugin:2.21.0:verify (default) @ tamaya-extensions ---
[JENKINS] Recording test results[INFO] 
[INFO] --- pitest-maven:1.4.3:mutationCoverage (mutationcoverage) @ tamaya-extensions ---

[INFO] Skipping project because:
[INFO]   - Packaging is POM.
[INFO]   - Project has no tests, it is empty.
[INFO] 
[INFO] --- maven-install-plugin:2.5.2:install (default-install) @ tamaya-extensions ---
[INFO] Installing <https://builds.apache.org/job/Tamaya-Extensions-Master-with-Coverage/ws/modules/pom.xml>
to /home/jenkins/jenkins-slave/maven-repositories/0/org/apache/tamaya/ext/tamaya-extensions/0.4-incubating-SNAPSHOT/tamaya-extensions-0.4-incubating-SNAPSHOT.pom
[INFO] Installing <https://builds.apache.org/job/Tamaya-Extensions-Master-with-Coverage/ws/modules/target/feature/feature.xml>
to /home/jenkins/jenkins-slave/maven-repositories/0/org/apache/tamaya/ext/tamaya-extensions/0.4-incubating-SNAPSHOT/tamaya-extensions-0.4-incubating-SNAPSHOT-features.xml
[INFO] 
[INFO] ---------------< org.apache.tamaya.ext:tamaya-resources >---------------
[INFO] Building Apache Tamaya Modules - Resource Locator 0.4-incubating-SNAPSHOT [3/41]
[INFO] --------------------------------[ jar ]---------------------------------
[INFO] Downloading from central: https://repo.maven.apache.org/maven2/org/revapi/revapi-maven-plugin/0.10.5/revapi-maven-plugin-0.10.5.pom
[INFO] Downloaded from central: https://repo.maven.apache.org/maven2/org/revapi/revapi-maven-plugin/0.10.5/revapi-maven-plugin-0.10.5.pom
(14 kB at 1.1 MB/s)
[INFO] Downloading from central: https://repo.maven.apache.org/maven2/org/revapi/revapi-build/37/revapi-build-37.pom
[INFO] Downloaded from central: https://repo.maven.apache.org/maven2/org/revapi/revapi-build/37/revapi-build-37.pom
(21 kB at 1.7 MB/s)
[INFO] Downloading from central: https://repo.maven.apache.org/maven2/org/revapi/revapi-parent/11/revapi-parent-11.pom
[INFO] Downloaded from central: https://repo.maven.apache.org/maven2/org/revapi/revapi-parent/11/revapi-parent-11.pom
(14 kB at 877 kB/s)
[INFO] Downloading from central: https://repo.maven.apache.org/maven2/org/revapi/revapi-maven-plugin/0.10.5/revapi-maven-plugin-0.10.5.jar
[INFO] Downloaded from central: https://repo.maven.apache.org/maven2/org/revapi/revapi-maven-plugin/0.10.5/revapi-maven-plugin-0.10.5.jar
(137 kB at 3.6 MB/s)
[INFO] Downloading from central: https://repo.maven.apache.org/maven2/org/apache/maven/plugins/maven-resources-plugin/3.1.0/maven-resources-plugin-3.1.0.pom
[INFO] Downloaded from central: https://repo.maven.apache.org/maven2/org/apache/maven/plugins/maven-resources-plugin/3.1.0/maven-resources-plugin-3.1.0.pom
(7.2 kB at 716 kB/s)
[INFO] Downloading from central: https://repo.maven.apache.org/maven2/org/apache/maven/plugins/maven-resources-plugin/3.1.0/maven-resources-plugin-3.1.0.jar
[INFO] Downloaded from central: https://repo.maven.apache.org/maven2/org/apache/maven/plugins/maven-resources-plugin/3.1.0/maven-resources-plugin-3.1.0.jar
(32 kB at 2.0 MB/s)
[INFO] Downloading from Nexus: http://repository.apache.org/snapshots/org/apache/tamaya/tamaya-api/0.4-incubating-SNAPSHOT/maven-metadata.xml
[INFO] Downloaded from Nexus: http://repository.apache.org/snapshots/org/apache/tamaya/tamaya-api/0.4-incubating-SNAPSHOT/maven-metadata.xml
(1.5 kB at 3.8 kB/s)
[INFO] Downloading from Nexus: http://repository.apache.org/snapshots/org/apache/tamaya/tamaya-api/0.4-incubating-SNAPSHOT/tamaya-api-0.4-incubating-20190514.081752-1790.pom
[INFO] Downloaded from Nexus: http://repository.apache.org/snapshots/org/apache/tamaya/tamaya-api/0.4-incubating-SNAPSHOT/tamaya-api-0.4-incubating-20190514.081752-1790.pom
(2.9 kB at 8.1 kB/s)
[INFO] Downloading from Nexus: http://repository.apache.org/snapshots/org/apache/tamaya/tamaya-code/0.4-incubating-SNAPSHOT/maven-metadata.xml
[INFO] Downloaded from Nexus: http://repository.apache.org/snapshots/org/apache/tamaya/tamaya-code/0.4-incubating-SNAPSHOT/maven-metadata.xml
(856 B at 2.3 kB/s)
[INFO] Downloading from Nexus: http://repository.apache.org/snapshots/org/apache/tamaya/tamaya-code/0.4-incubating-SNAPSHOT/tamaya-code-0.4-incubating-20190514.081538-1802.pom
[INFO] Downloaded from Nexus: http://repository.apache.org/snapshots/org/apache/tamaya/tamaya-code/0.4-incubating-SNAPSHOT/tamaya-code-0.4-incubating-20190514.081538-1802.pom
(1.5 kB at 4.1 kB/s)
[INFO] Downloading from Nexus: http://repository.apache.org/snapshots/org/apache/tamaya/tamaya-all/0.4-incubating-SNAPSHOT/maven-metadata.xml
[INFO] Downloaded from Nexus: http://repository.apache.org/snapshots/org/apache/tamaya/tamaya-all/0.4-incubating-SNAPSHOT/maven-metadata.xml
(1.1 kB at 2.8 kB/s)
[INFO] Downloading from Nexus: http://repository.apache.org/snapshots/org/apache/tamaya/tamaya-all/0.4-incubating-SNAPSHOT/tamaya-all-0.4-incubating-20190514.081459-1800.pom
[INFO] Downloaded from Nexus: http://repository.apache.org/snapshots/org/apache/tamaya/tamaya-all/0.4-incubating-SNAPSHOT/tamaya-all-0.4-incubating-20190514.081459-1800.pom
(45 kB at 74 kB/s)
[INFO] Downloading from Nexus: http://repository.apache.org/snapshots/org/apache/tamaya/tamaya-core/0.4-incubating-SNAPSHOT/maven-metadata.xml
[INFO] Downloaded from Nexus: http://repository.apache.org/snapshots/org/apache/tamaya/tamaya-core/0.4-incubating-SNAPSHOT/maven-metadata.xml
(1.5 kB at 3.8 kB/s)
[INFO] Downloading from Nexus: http://repository.apache.org/snapshots/org/apache/tamaya/tamaya-core/0.4-incubating-SNAPSHOT/tamaya-core-0.4-incubating-20190514.082323-1747.pom
[INFO] Downloaded from Nexus: http://repository.apache.org/snapshots/org/apache/tamaya/tamaya-core/0.4-incubating-SNAPSHOT/tamaya-core-0.4-incubating-20190514.082323-1747.pom
(4.1 kB at 11 kB/s)
[INFO] Downloading from Nexus: http://repository.apache.org/snapshots/org/apache/tamaya/tamaya-spisupport/0.4-incubating-SNAPSHOT/maven-metadata.xml
[INFO] Downloaded from Nexus: http://repository.apache.org/snapshots/org/apache/tamaya/tamaya-spisupport/0.4-incubating-SNAPSHOT/maven-metadata.xml
(1.5 kB at 4.0 kB/s)
[INFO] Downloading from Nexus: http://repository.apache.org/snapshots/org/apache/tamaya/tamaya-spisupport/0.4-incubating-SNAPSHOT/tamaya-spisupport-0.4-incubating-20190514.082059-1462.pom
[INFO] Downloaded from Nexus: http://repository.apache.org/snapshots/org/apache/tamaya/tamaya-spisupport/0.4-incubating-SNAPSHOT/tamaya-spisupport-0.4-incubating-20190514.082059-1462.pom
(3.1 kB at 8.1 kB/s)
[INFO] Downloading from maven-central: https://repo1.maven.org/maven2/org/assertj/assertj-core/3.10.0/assertj-core-3.10.0.pom
[INFO] Downloaded from maven-central: https://repo1.maven.org/maven2/org/assertj/assertj-core/3.10.0/assertj-core-3.10.0.pom
(11 kB at 406 kB/s)
[INFO] Downloading from maven-central: https://repo1.maven.org/maven2/org/assertj/assertj-parent-pom/2.1.9/assertj-parent-pom-2.1.9.pom
[INFO] Downloaded from maven-central: https://repo1.maven.org/maven2/org/assertj/assertj-parent-pom/2.1.9/assertj-parent-pom-2.1.9.pom
(15 kB at 1.0 MB/s)
[INFO] Downloading from Nexus: http://repository.apache.org/snapshots/org/apache/tamaya/tamaya-api/0.4-incubating-SNAPSHOT/tamaya-api-0.4-incubating-20190514.081752-1790.jar
[INFO] Downloading from Nexus: http://repository.apache.org/snapshots/org/apache/tamaya/tamaya-core/0.4-incubating-SNAPSHOT/tamaya-core-0.4-incubating-20190514.082323-1747.jar
[INFO] Downloading from Nexus: http://repository.apache.org/snapshots/org/apache/tamaya/tamaya-spisupport/0.4-incubating-SNAPSHOT/tamaya-spisupport-0.4-incubating-20190514.082059-1462.jar
[INFO] Downloaded from Nexus: http://repository.apache.org/snapshots/org/apache/tamaya/tamaya-core/0.4-incubating-SNAPSHOT/tamaya-core-0.4-incubating-20190514.082323-1747.jar
(94 kB at 164 kB/s)
[INFO] Downloaded from Nexus: http://repository.apache.org/snapshots/org/apache/tamaya/tamaya-spisupport/0.4-incubating-SNAPSHOT/tamaya-spisupport-0.4-incubating-20190514.082059-1462.jar
(96 kB at 166 kB/s)
[INFO] Downloaded from Nexus: http://repository.apache.org/snapshots/org/apache/tamaya/tamaya-api/0.4-incubating-SNAPSHOT/tamaya-api-0.4-incubating-20190514.081752-1790.jar
(53 kB at 89 kB/s)
[INFO] Downloading from maven-central: https://repo1.maven.org/maven2/org/assertj/assertj-core/3.10.0/assertj-core-3.10.0.jar
[INFO] Downloaded from maven-central: https://repo1.maven.org/maven2/org/assertj/assertj-core/3.10.0/assertj-core-3.10.0.jar
(4.0 MB at 11 MB/s)
[INFO] 
[INFO] --- maven-clean-plugin:3.1.0:clean (default-clean) @ tamaya-resources ---
[INFO] 
[INFO] --- maven-enforcer-plugin:3.0.0-M1:enforce (enforce-maven-version) @ tamaya-resources
---
[INFO] 
[INFO] --- maven-enforcer-plugin:3.0.0-M1:enforce (enforce-versions) @ tamaya-resources ---
[INFO] 
[INFO] --- apache-rat-plugin:0.13:check (default) @ tamaya-resources ---
[INFO] Enabled default license matchers.
[INFO] Will parse SCM ignores for exclusions...
[INFO] Finished adding exclusions from SCM ignore files.
[INFO] 62 implicit excludes (use -debug for more details).
[INFO] 12 explicit excludes (use -debug for more details).
[INFO] 34 resources included (use -debug for more details)
[INFO] Rat check: Summary over all files. Unapproved: 0, unknown: 0, generated: 0, approved:
34 licenses.
[INFO] 
[INFO] --- buildnumber-maven-plugin:1.4:create (default) @ tamaya-resources ---
[INFO] ShortRevision tag detected. The value is '8'.
[INFO] Executing: /bin/sh -c cd '<https://builds.apache.org/job/Tamaya-Extensions-Master-with-Coverage/ws/modules/resources'>
&& 'git' 'rev-parse' '--verify' '--short=8' 'HEAD'
[INFO] Working directory: <https://builds.apache.org/job/Tamaya-Extensions-Master-with-Coverage/ws/modules/resources>
[INFO] Storing buildNumber: 5c155d2a at timestamp: 1557845635954
[WARNING] Cannot get the branch information from the git repository: 
Detecting the current branch failed: fatal: ref HEAD is not a symbolic ref

[INFO] ShortRevision tag detected. The value is '8'.
[INFO] Executing: /bin/sh -c cd '<https://builds.apache.org/job/Tamaya-Extensions-Master-with-Coverage/ws/modules/resources'>
&& 'git' 'rev-parse' '--verify' '--short=8' 'HEAD'
[INFO] Working directory: <https://builds.apache.org/job/Tamaya-Extensions-Master-with-Coverage/ws/modules/resources>
[INFO] Storing buildScmBranch: UNKNOWN
[INFO] 
[INFO] --- maven-checkstyle-plugin:3.0.0:check (checkstyle) @ tamaya-resources ---
[INFO] 
[INFO] --- maven-remote-resources-plugin:1.5:process (process-resource-bundles) @ tamaya-resources
---
[INFO] 
[INFO] --- karaf-maven-plugin:4.0.5:features-generate-descriptor (generate) @ tamaya-resources
---
[INFO] Downloading from Nexus: http://repository.apache.org/snapshots/org/apache/tamaya/ext/tamaya-resources/0.4-incubating-SNAPSHOT/maven-metadata.xml
[INFO] Downloaded from Nexus: http://repository.apache.org/snapshots/org/apache/tamaya/ext/tamaya-resources/0.4-incubating-SNAPSHOT/maven-metadata.xml
(1.5 kB at 3.9 kB/s)
[INFO] Generating feature descriptor file <https://builds.apache.org/job/Tamaya-Extensions-Master-with-Coverage/ws/modules/resources/target/feature/feature.xml>
[INFO] ...done!
[INFO] 
[INFO] --- maven-resources-plugin:3.1.0:resources (default-resources) @ tamaya-resources ---
[INFO] Using 'UTF-8' encoding to copy filtered resources.
[INFO] Copying 2 resources
[INFO] Copying 3 resources
[INFO] 
[INFO] --- maven-compiler-plugin:3.7.0:compile (default-compile) @ tamaya-resources ---
[INFO] Changes detected - recompiling the module!
[INFO] Compiling 16 source files to <https://builds.apache.org/job/Tamaya-Extensions-Master-with-Coverage/ws/modules/resources/target/classes>
[INFO] -------------------------------------------------------------
[WARNING] COMPILATION WARNING : 
[INFO] -------------------------------------------------------------
[WARNING] <https://builds.apache.org/job/Tamaya-Extensions-Master-with-Coverage/ws/modules/resources/src/main/java/org/apache/tamaya/resource/AbstractPathPropertySourceProvider.java>:[209,24]
isScannable() in org.apache.tamaya.spi.PropertySource has been deprecated
[INFO] 1 warning
[INFO] -------------------------------------------------------------
[INFO] -------------------------------------------------------------
[ERROR] COMPILATION ERROR : 
[INFO] -------------------------------------------------------------
[ERROR] <https://builds.apache.org/job/Tamaya-Extensions-Master-with-Coverage/ws/modules/resources/src/main/java/org/apache/tamaya/resource/internal/ClassPathResourceLocator.java>:[56,27]
incompatible types: java.util.Enumeration<java.net.URL> cannot be converted to java.util.Collection<java.net.URL>
[ERROR] <https://builds.apache.org/job/Tamaya-Extensions-Master-with-Coverage/ws/modules/resources/src/main/java/org/apache/tamaya/resource/internal/ClasspathCollector.java>:[120,27]
incompatible types: java.util.Enumeration<java.net.URL> cannot be converted to java.util.Collection<java.net.URL>
[INFO] 2 errors 
[INFO] -------------------------------------------------------------
[INFO] ------------------------------------------------------------------------
[INFO] Reactor Summary for Apache Tamaya Extensions 0.4-incubating-SNAPSHOT:
[INFO] 
[INFO] Apache Tamaya Extensions ........................... SUCCESS [ 19.198 s]
[INFO] Apache Tamaya Extension Modules .................... SUCCESS [  5.553 s]
[INFO] Apache Tamaya Modules - Resource Locator ........... FAILURE [ 10.216 s]
[INFO] Apache Tamaya Extensions Examples .................. SKIPPED
[INFO] Apache Tamaya Resource Location Example ............ SKIPPED
[INFO] Apache Tamaya Modules - Placeholder Resolver ....... SKIPPED
[INFO] Apache Tamaya Value Resolution Example ............. SKIPPED
[INFO] Apache Tamaya Modules - Injection Parent ........... SKIPPED
[INFO] Apache Tamaya Modules - Injection API .............. SKIPPED
[INFO] Apache Tamaya Modules - Common Functional Extensions SKIPPED
[INFO] Apache Tamaya Event and dynamic Update Extensions .. SKIPPED
[INFO] Apache Tamaya Modules - Injection Standalone ....... SKIPPED
[INFO] Apache Tamaya Configuration Injection Example ...... SKIPPED
[INFO] Apache Tamaya Modules - Formats Parent ............. SKIPPED
[INFO] Apache Tamaya Modules - Formats Common ............. SKIPPED
[INFO] Apache Tamaya Events Example ....................... SKIPPED
[INFO] Apache Tamaya Spring Integration ................... SKIPPED
[INFO] Apache Tamaya Spring Example ....................... SKIPPED
[INFO] Apache Tamaya Modules - Optional Backend ........... SKIPPED
[INFO] Apache Tamaya Modules - Injection CDI .............. SKIPPED
[INFO] Apache Tamaya Modules - Mutable Configuration ...... SKIPPED
[INFO] Apache Tamaya Adaptive Configuration Filtering ..... SKIPPED
[INFO] Apache Tamaya JNDI Support ......................... SKIPPED
[INFO] Apache Tamaya Feature Check ........................ SKIPPED
[INFO] Apache Tamaya JSON Support ......................... SKIPPED
[INFO] Apache Tamaya Modules - HJSON Support .............. SKIPPED
[INFO] Apache Tamaya YAML Support ......................... SKIPPED
[INFO] Apache Tamaya Modules - HOCON Support .............. SKIPPED
[INFO] Apache Tamaya :: OSGi Integration :: ALL ........... SKIPPED
[INFO] Apache Tamaya :: OSGi :: Common .................... SKIPPED
[INFO] Apache Tamaya :: OSGi :: Updater ................... SKIPPED
[INFO] Apache Tamaya :: OSGI :: Karaf :: Shell ............ SKIPPED
[INFO] Apache Tamaya :: OSGI :: Karaf :: Features ......... SKIPPED
[INFO] Apache Tamaya :: OSGI :: Gogo :: Shell ............. SKIPPED
[INFO] Apache Tamaya :: OSGI :: Config Injection .......... SKIPPED
[INFO] Apache Tamaya Modules - Collections Support ........ SKIPPED
[INFO] Apache Tamaya Modules - Microprofile API ........... SKIPPED
[INFO] Apache Tamaya Modules - Hazelcast PropertySource ... SKIPPED
[INFO] Apache Tamaya Modules - etcd PropertySource ........ SKIPPED
[INFO] Apache Tamaya Modules - Consul PropertySource ...... SKIPPED
[INFO] Apache Tamaya Extension Distribution ............... SKIPPED
[INFO] ------------------------------------------------------------------------
[INFO] BUILD FAILURE
[INFO] ------------------------------------------------------------------------
[INFO] Total time:  01:00 min
[INFO] Finished at: 2019-05-14T14:54:08Z
[INFO] ------------------------------------------------------------------------
Waiting for Jenkins to finish collecting data[ERROR] Failed to execute goal org.apache.maven.plugins:maven-compiler-plugin:3.7.0:compile
(default-compile) on project tamaya-resources: Compilation failure: Compilation failure:
[ERROR] <https://builds.apache.org/job/Tamaya-Extensions-Master-with-Coverage/ws/modules/resources/src/main/java/org/apache/tamaya/resource/internal/ClassPathResourceLocator.java>:[56,27]
incompatible types: java.util.Enumeration<java.net.URL> cannot be converted to java.util.Collection<java.net.URL>
[ERROR] <https://builds.apache.org/job/Tamaya-Extensions-Master-with-Coverage/ws/modules/resources/src/main/java/org/apache/tamaya/resource/internal/ClasspathCollector.java>:[120,27]
incompatible types: java.util.Enumeration<java.net.URL> cannot be converted to java.util.Collection<java.net.URL>
[ERROR] -> [Help 1]
[ERROR] 
[ERROR] To see the full stack trace of the errors, re-run Maven with the -e switch.
[ERROR] Re-run Maven using the -X switch to enable full debug logging.
[ERROR] 
[ERROR] For more information about the errors and possible solutions, please read the following
articles:
[ERROR] [Help 1] http://cwiki.apache.org/confluence/display/MAVEN/MojoFailureException
[ERROR] 
[ERROR] After correcting the problems, you can resume the build with the command
[ERROR]   mvn <goals> -rf :tamaya-resources

[JENKINS] Archiving <https://builds.apache.org/job/Tamaya-Extensions-Master-with-Coverage/ws/modules/pom.xml>
to org.apache.tamaya.ext/tamaya-extensions/0.4-incubating-SNAPSHOT/tamaya-extensions-0.4-incubating-SNAPSHOT.pom
[JENKINS] Archiving <https://builds.apache.org/job/Tamaya-Extensions-Master-with-Coverage/ws/modules/target/feature/feature.xml>
to org.apache.tamaya.ext/tamaya-extensions/0.4-incubating-SNAPSHOT/tamaya-extensions-0.4-incubating-SNAPSHOT-features.xml
[JENKINS] Archiving <https://builds.apache.org/job/Tamaya-Extensions-Master-with-Coverage/ws/modules/events/pom.xml>
to org.apache.tamaya.ext/tamaya-events/0.4-incubating-SNAPSHOT/tamaya-events-0.4-incubating-SNAPSHOT.pom
[JENKINS] Archiving <https://builds.apache.org/job/Tamaya-Extensions-Master-with-Coverage/ws/modules/formats/base/pom.xml>
to org.apache.tamaya.ext/tamaya-formats/0.4-incubating-SNAPSHOT/tamaya-formats-0.4-incubating-SNAPSHOT.pom
[JENKINS] Archiving <https://builds.apache.org/job/Tamaya-Extensions-Master-with-Coverage/ws/modules/features/pom.xml>
to org.apache.tamaya.ext/tamaya-features/0.4-incubating-SNAPSHOT/tamaya-features-0.4-incubating-SNAPSHOT.pom
[JENKINS] Archiving <https://builds.apache.org/job/Tamaya-Extensions-Master-with-Coverage/ws/examples/05-spring-example/pom.xml>
to org.apache.tamaya.ext.examples/05-spring-example/0.4-incubating-SNAPSHOT/05-spring-example-0.4-incubating-SNAPSHOT.pom
[JENKINS] Archiving <https://builds.apache.org/job/Tamaya-Extensions-Master-with-Coverage/ws/modules/formats/pom.xml>
to org.apache.tamaya.ext/tamaya-formats-all/0.4-incubating-SNAPSHOT/tamaya-formats-all-0.4-incubating-SNAPSHOT.pom
[JENKINS] Archiving <https://builds.apache.org/job/Tamaya-Extensions-Master-with-Coverage/ws/pom.xml>
to org.apache.tamaya.ext/tamaya-extensions-all/0.4-incubating-SNAPSHOT/tamaya-extensions-all-0.4-incubating-SNAPSHOT.pom
[JENKINS] Archiving <https://builds.apache.org/job/Tamaya-Extensions-Master-with-Coverage/ws/target/feature/feature.xml>
to org.apache.tamaya.ext/tamaya-extensions-all/0.4-incubating-SNAPSHOT/tamaya-extensions-all-0.4-incubating-SNAPSHOT-features.xml
[Fast Archiver] Compressed 45.42 KB of artifacts by 70.5% relative to #1428
[JENKINS] Archiving <https://builds.apache.org/job/Tamaya-Extensions-Master-with-Coverage/ws/modules/osgi/karaf-shell/pom.xml>
to org.apache.tamaya.ext/tamaya-osgi-karaf-shell/0.4-incubating-SNAPSHOT/tamaya-osgi-karaf-shell-0.4-incubating-SNAPSHOT.pom
[JENKINS] Archiving <https://builds.apache.org/job/Tamaya-Extensions-Master-with-Coverage/ws/modules/formats/hjson/pom.xml>
to org.apache.tamaya.ext/tamaya-hjson/0.4-incubating-SNAPSHOT/tamaya-hjson-0.4-incubating-SNAPSHOT.pom
[Fast Archiver] No prior successful build to compare, so performing full copy of artifacts
[JENKINS] Archiving <https://builds.apache.org/job/Tamaya-Extensions-Master-with-Coverage/ws/modules/microprofile/pom.xml>
to org.apache.tamaya.ext/tamaya-microprofile/0.4-incubating-SNAPSHOT/tamaya-microprofile-0.4-incubating-SNAPSHOT.pom
[JENKINS] Archiving <https://builds.apache.org/job/Tamaya-Extensions-Master-with-Coverage/ws/modules/jndi/pom.xml>
to org.apache.tamaya.ext/tamaya-jndi/0.4-incubating-SNAPSHOT/tamaya-jndi-0.4-incubating-SNAPSHOT.pom
[JENKINS] Archiving <https://builds.apache.org/job/Tamaya-Extensions-Master-with-Coverage/ws/modules/osgi/common/pom.xml>
to org.apache.tamaya.ext/tamaya-osgi/0.4-incubating-SNAPSHOT/tamaya-osgi-0.4-incubating-SNAPSHOT.pom
[JENKINS] Archiving <https://builds.apache.org/job/Tamaya-Extensions-Master-with-Coverage/ws/modules/hazelcast/pom.xml>
to org.apache.tamaya.ext/tamaya-hazelcast/0.4-incubating-SNAPSHOT/tamaya-hazelcast-0.4-incubating-SNAPSHOT.pom
[JENKINS] Archiving <https://builds.apache.org/job/Tamaya-Extensions-Master-with-Coverage/ws/examples/03-injection-example/pom.xml>
to org.apache.tamaya.ext.examples/03-injection-example/0.4-incubating-SNAPSHOT/03-injection-example-0.4-incubating-SNAPSHOT.pom
[JENKINS] Archiving <https://builds.apache.org/job/Tamaya-Extensions-Master-with-Coverage/ws/modules/collections/pom.xml>
to org.apache.tamaya.ext/tamaya-collections/0.4-incubating-SNAPSHOT/tamaya-collections-0.4-incubating-SNAPSHOT.pom
[JENKINS] Archiving <https://builds.apache.org/job/Tamaya-Extensions-Master-with-Coverage/ws/modules/optional/pom.xml>
to org.apache.tamaya.ext/tamaya-optional/0.4-incubating-SNAPSHOT/tamaya-optional-0.4-incubating-SNAPSHOT.pom
[JENKINS] Archiving <https://builds.apache.org/job/Tamaya-Extensions-Master-with-Coverage/ws/modules/resolver/pom.xml>
to org.apache.tamaya.ext/tamaya-resolver/0.4-incubating-SNAPSHOT/tamaya-resolver-0.4-incubating-SNAPSHOT.pom
[JENKINS] Archiving <https://builds.apache.org/job/Tamaya-Extensions-Master-with-Coverage/ws/examples/pom.xml>
to org.apache.tamaya.ext.examples/examples/0.4-incubating-SNAPSHOT/examples-0.4-incubating-SNAPSHOT.pom
[JENKINS] Archiving <https://builds.apache.org/job/Tamaya-Extensions-Master-with-Coverage/ws/modules/osgi/karaf-features/pom.xml>
to org.apache.tamaya.ext/tamaya-karaf-features/0.4-incubating-SNAPSHOT/tamaya-karaf-features-0.4-incubating-SNAPSHOT.pom
[JENKINS] Archiving <https://builds.apache.org/job/Tamaya-Extensions-Master-with-Coverage/ws/modules/filter/pom.xml>
to org.apache.tamaya.ext/tamaya-filter/0.4-incubating-SNAPSHOT/tamaya-filter-0.4-incubating-SNAPSHOT.pom
[JENKINS] Archiving <https://builds.apache.org/job/Tamaya-Extensions-Master-with-Coverage/ws/modules/spring/pom.xml>
to org.apache.tamaya.ext/tamaya-spring/0.4-incubating-SNAPSHOT/tamaya-spring-0.4-incubating-SNAPSHOT.pom
[JENKINS] Archiving <https://builds.apache.org/job/Tamaya-Extensions-Master-with-Coverage/ws/examples/02-resolver-example/pom.xml>
to org.apache.tamaya.ext.examples/02-resolver-example/0.4-incubating-SNAPSHOT/02-resolver-example-0.4-incubating-SNAPSHOT.pom
[JENKINS] Archiving <https://builds.apache.org/job/Tamaya-Extensions-Master-with-Coverage/ws/modules/osgi/pom.xml>
to org.apache.tamaya.ext/tamaya-osgi-all/0.4-incubating-SNAPSHOT/tamaya-osgi-all-0.4-incubating-SNAPSHOT.pom
[JENKINS] Archiving <https://builds.apache.org/job/Tamaya-Extensions-Master-with-Coverage/ws/modules/osgi/updater/pom.xml>
to org.apache.tamaya.ext/tamaya-osgi-updater/0.4-incubating-SNAPSHOT/tamaya-osgi-updater-0.4-incubating-SNAPSHOT.pom
[JENKINS] Archiving <https://builds.apache.org/job/Tamaya-Extensions-Master-with-Coverage/ws/modules/injection/cdi/pom.xml>
to org.apache.tamaya.ext/tamaya-cdi/0.4-incubating-SNAPSHOT/tamaya-cdi-0.4-incubating-SNAPSHOT.pom
[JENKINS] Archiving <https://builds.apache.org/job/Tamaya-Extensions-Master-with-Coverage/ws/modules/formats/yaml/pom.xml>
to org.apache.tamaya.ext/tamaya-yaml/0.4-incubating-SNAPSHOT/tamaya-yaml-0.4-incubating-SNAPSHOT.pom
[JENKINS] Archiving <https://builds.apache.org/job/Tamaya-Extensions-Master-with-Coverage/ws/modules/mutable-config/pom.xml>
to org.apache.tamaya.ext/tamaya-mutable-config/0.4-incubating-SNAPSHOT/tamaya-mutable-config-0.4-incubating-SNAPSHOT.pom
[JENKINS] Archiving <https://builds.apache.org/job/Tamaya-Extensions-Master-with-Coverage/ws/modules/injection/injection-api/pom.xml>
to org.apache.tamaya.ext/tamaya-injection-api/0.4-incubating-SNAPSHOT/tamaya-injection-api-0.4-incubating-SNAPSHOT.pom
[JENKINS] Archiving <https://builds.apache.org/job/Tamaya-Extensions-Master-with-Coverage/ws/modules/etcd/pom.xml>
to org.apache.tamaya.ext/tamaya-etcd/0.4-incubating-SNAPSHOT/tamaya-etcd-0.4-incubating-SNAPSHOT.pom
[JENKINS] Archiving <https://builds.apache.org/job/Tamaya-Extensions-Master-with-Coverage/ws/modules/resources/pom.xml>
to org.apache.tamaya.ext/tamaya-resources/0.4-incubating-SNAPSHOT/tamaya-resources-0.4-incubating-SNAPSHOT.pom
[JENKINS] Archiving <https://builds.apache.org/job/Tamaya-Extensions-Master-with-Coverage/ws/modules/resources/target/feature/feature.xml>
to org.apache.tamaya.ext/tamaya-resources/0.4-incubating-SNAPSHOT/tamaya-resources-0.4-incubating-SNAPSHOT-features.xml
[JENKINS] Archiving <https://builds.apache.org/job/Tamaya-Extensions-Master-with-Coverage/ws/examples/04-events-example/pom.xml>
to org.apache.tamaya.ext.examples/04-events-example/0.4-incubating-SNAPSHOT/04-events-example-0.4-incubating-SNAPSHOT.pom
[JENKINS] Archiving <https://builds.apache.org/job/Tamaya-Extensions-Master-with-Coverage/ws/modules/formats/json/pom.xml>
to org.apache.tamaya.ext/tamaya-json/0.4-incubating-SNAPSHOT/tamaya-json-0.4-incubating-SNAPSHOT.pom
[JENKINS] Archiving <https://builds.apache.org/job/Tamaya-Extensions-Master-with-Coverage/ws/modules/osgi/gogo-shell/pom.xml>
to org.apache.tamaya.ext/tamaya-osgi-gogo-shell/0.4-incubating-SNAPSHOT/tamaya-osgi-gogo-shell-0.4-incubating-SNAPSHOT.pom
[JENKINS] Archiving <https://builds.apache.org/job/Tamaya-Extensions-Master-with-Coverage/ws/modules/osgi/injection/pom.xml>
to org.apache.tamaya.ext/tamaya-osgi-injection/0.4-incubating-SNAPSHOT/tamaya-osgi-injection-0.4-incubating-SNAPSHOT.pom
[JENKINS] Archiving <https://builds.apache.org/job/Tamaya-Extensions-Master-with-Coverage/ws/modules/injection/pom.xml>
to org.apache.tamaya.ext/tamaya-injection-all/0.4-incubating-SNAPSHOT/tamaya-injection-all-0.4-incubating-SNAPSHOT.pom
[JENKINS] Archiving <https://builds.apache.org/job/Tamaya-Extensions-Master-with-Coverage/ws/examples/01-resources-example/pom.xml>
to org.apache.tamaya.ext.examples/01-resources-example/0.4-incubating-SNAPSHOT/01-resources-example-0.4-incubating-SNAPSHOT.pom
[JENKINS] Archiving <https://builds.apache.org/job/Tamaya-Extensions-Master-with-Coverage/ws/modules/functions/pom.xml>
to org.apache.tamaya.ext/tamaya-functions/0.4-incubating-SNAPSHOT/tamaya-functions-0.4-incubating-SNAPSHOT.pom
[JENKINS] Archiving <https://builds.apache.org/job/Tamaya-Extensions-Master-with-Coverage/ws/modules/consul/pom.xml>
to org.apache.tamaya.ext/tamaya-consul/0.4-incubating-SNAPSHOT/tamaya-consul-0.4-incubating-SNAPSHOT.pom
[JENKINS] Archiving <https://builds.apache.org/job/Tamaya-Extensions-Master-with-Coverage/ws/modules/formats/hocon/pom.xml>
to org.apache.tamaya.ext/tamaya-hocon/0.4-incubating-SNAPSHOT/tamaya-hocon-0.4-incubating-SNAPSHOT.pom
[Fast Archiver] No prior successful build to compare, so performing full copy of artifacts
[JENKINS] Archiving <https://builds.apache.org/job/Tamaya-Extensions-Master-with-Coverage/ws/distribution/pom.xml>
to org.apache.tamaya.ext/tamaya-extension-distribution/0.4-incubating-SNAPSHOT/tamaya-extension-distribution-0.4-incubating-SNAPSHOT.pom
[JENKINS] Archiving <https://builds.apache.org/job/Tamaya-Extensions-Master-with-Coverage/ws/modules/injection/standalone/pom.xml>
to org.apache.tamaya.ext/tamaya-injection/0.4-incubating-SNAPSHOT/tamaya-injection-0.4-incubating-SNAPSHOT.pom
channel stopped
Not sending mail to unregistered user atsticks@gmail.com

Mime
View raw message