tamaya-commits mailing list archives

Site index · List index
Message view « Date » · « Thread »
Top « Date » · « Thread »
From Apache Jenkins Server <jenk...@builds.apache.org>
Subject Build failed in Jenkins: Tamaya-Extensions-Master #2336
Date Tue, 14 May 2019 15:06:44 GMT
See <https://builds.apache.org/job/Tamaya-Extensions-Master/2336/display/redirect?page=changes>

Changes:

[atsticks] TAMAYA-398 TAMAYA-399 TAMAYA-400 TAMAYA-401 TAMAYA-402 TAMAYA-403

[atsticks] Fixed quality issues.

------------------------------------------
[...truncated 6.61 MB...]
    at sun.reflect.NativeMethodAccessorImpl.invoke0 (Native Method)
    at sun.reflect.NativeMethodAccessorImpl.invoke (NativeMethodAccessorImpl.java:62)
    at sun.reflect.DelegatingMethodAccessorImpl.invoke (DelegatingMethodAccessorImpl.java:43)
    at java.lang.reflect.Method.invoke (Method.java:498)
    at org.codehaus.plexus.classworlds.launcher.Launcher.launchEnhanced (Launcher.java:289)
    at org.codehaus.plexus.classworlds.launcher.Launcher.launch (Launcher.java:229)
    at jenkins.maven3.agent.Maven35Main.launch (Maven35Main.java:176)
    at sun.reflect.NativeMethodAccessorImpl.invoke0 (Native Method)
    at sun.reflect.NativeMethodAccessorImpl.invoke (NativeMethodAccessorImpl.java:62)
    at sun.reflect.DelegatingMethodAccessorImpl.invoke (DelegatingMethodAccessorImpl.java:43)
    at java.lang.reflect.Method.invoke (Method.java:498)
    at hudson.maven.Maven3Builder.call (Maven3Builder.java:139)
    at hudson.maven.Maven3Builder.call (Maven3Builder.java:70)
    at hudson.remoting.UserRequest.perform (UserRequest.java:212)
    at hudson.remoting.UserRequest.perform (UserRequest.java:54)
    at hudson.remoting.Request$2.run (Request.java:369)
    at hudson.remoting.InterceptingExecutorService$1.call (InterceptingExecutorService.java:72)
    at java.util.concurrent.FutureTask.run (FutureTask.java:266)
    at java.util.concurrent.ThreadPoolExecutor.runWorker (ThreadPoolExecutor.java:1149)
    at java.util.concurrent.ThreadPoolExecutor$Worker.run (ThreadPoolExecutor.java:624)
    at java.lang.Thread.run (Thread.java:748)
Caused by: org.apache.maven.plugin.compiler.CompilationFailureException: Compilation failure
<https://builds.apache.org/job/Tamaya-Extensions-Master/ws/modules/jndi/src/main/java/org/apache/tamaya/jndi/JNDIPropertySource.java>:[100,37]
cannot find symbol
  symbol:   method mapProperties(java.util.Map<java.lang.String,java.lang.String>,java.lang.String)
  location: class org.apache.tamaya.spi.PropertyValue

    at org.apache.maven.plugin.compiler.AbstractCompilerMojo.execute (AbstractCompilerMojo.java:1161)
    at org.apache.maven.plugin.compiler.CompilerMojo.execute (CompilerMojo.java:168)
    at org.apache.maven.plugin.DefaultBuildPluginManager.executeMojo (DefaultBuildPluginManager.java:137)
    at org.apache.maven.lifecycle.internal.MojoExecutor.execute (MojoExecutor.java:210)
    at org.apache.maven.lifecycle.internal.MojoExecutor.execute (MojoExecutor.java:156)
    at org.apache.maven.lifecycle.internal.MojoExecutor.execute (MojoExecutor.java:148)
    at org.apache.maven.lifecycle.internal.LifecycleModuleBuilder.buildProject (LifecycleModuleBuilder.java:117)
    at org.apache.maven.lifecycle.internal.LifecycleModuleBuilder.buildProject (LifecycleModuleBuilder.java:81)
    at org.apache.maven.lifecycle.internal.builder.singlethreaded.SingleThreadedBuilder.build
(SingleThreadedBuilder.java:56)
    at org.apache.maven.lifecycle.internal.LifecycleStarter.execute (LifecycleStarter.java:128)
    at org.apache.maven.DefaultMaven.doExecute (DefaultMaven.java:305)
    at org.apache.maven.DefaultMaven.doExecute (DefaultMaven.java:192)
    at org.apache.maven.DefaultMaven.execute (DefaultMaven.java:105)
    at org.jvnet.hudson.maven3.launcher.Maven35Launcher.main (Maven35Launcher.java:130)
    at sun.reflect.NativeMethodAccessorImpl.invoke0 (Native Method)
    at sun.reflect.NativeMethodAccessorImpl.invoke (NativeMethodAccessorImpl.java:62)
    at sun.reflect.DelegatingMethodAccessorImpl.invoke (DelegatingMethodAccessorImpl.java:43)
    at java.lang.reflect.Method.invoke (Method.java:498)
    at org.codehaus.plexus.classworlds.launcher.Launcher.launchEnhanced (Launcher.java:289)
    at org.codehaus.plexus.classworlds.launcher.Launcher.launch (Launcher.java:229)
    at jenkins.maven3.agent.Maven35Main.launch (Maven35Main.java:176)
    at sun.reflect.NativeMethodAccessorImpl.invoke0 (Native Method)
    at sun.reflect.NativeMethodAccessorImpl.invoke (NativeMethodAccessorImpl.java:62)
    at sun.reflect.DelegatingMethodAccessorImpl.invoke (DelegatingMethodAccessorImpl.java:43)
    at java.lang.reflect.Method.invoke (Method.java:498)
    at hudson.maven.Maven3Builder.call (Maven3Builder.java:139)
    at hudson.maven.Maven3Builder.call (Maven3Builder.java:70)
    at hudson.remoting.UserRequest.perform (UserRequest.java:212)
    at hudson.remoting.UserRequest.perform (UserRequest.java:54)
    at hudson.remoting.Request$2.run (Request.java:369)
    at hudson.remoting.InterceptingExecutorService$1.call (InterceptingExecutorService.java:72)
    at java.util.concurrent.FutureTask.run (FutureTask.java:266)
    at java.util.concurrent.ThreadPoolExecutor.runWorker (ThreadPoolExecutor.java:1149)
    at java.util.concurrent.ThreadPoolExecutor$Worker.run (ThreadPoolExecutor.java:624)
    at java.lang.Thread.run (Thread.java:748)
[ERROR] Failed to execute goal org.apache.maven.plugins:maven-compiler-plugin:3.7.0:compile
(default-compile) on project tamaya-collections: Compilation failure
[ERROR] <https://builds.apache.org/job/Tamaya-Extensions-Master/ws/modules/collections/src/main/java/org/apache/tamaya/collections/ItemTokenizer.java>:[153,30]
cannot find symbol
[ERROR] symbol:   method toBuilder()
[ERROR] location: variable context of type org.apache.tamaya.spi.ConversionContext
[ERROR] -> [Help 1]
org.apache.maven.lifecycle.LifecycleExecutionException: Failed to execute goal org.apache.maven.plugins:maven-compiler-plugin:3.7.0:compile
(default-compile) on project tamaya-collections: Compilation failure
<https://builds.apache.org/job/Tamaya-Extensions-Master/ws/modules/collections/src/main/java/org/apache/tamaya/collections/ItemTokenizer.java>:[153,30]
cannot find symbol
  symbol:   method toBuilder()
  location: variable context of type org.apache.tamaya.spi.ConversionContext

    at org.apache.maven.lifecycle.internal.MojoExecutor.execute (MojoExecutor.java:215)
    at org.apache.maven.lifecycle.internal.MojoExecutor.execute (MojoExecutor.java:156)
    at org.apache.maven.lifecycle.internal.MojoExecutor.execute (MojoExecutor.java:148)
    at org.apache.maven.lifecycle.internal.LifecycleModuleBuilder.buildProject (LifecycleModuleBuilder.java:117)
    at org.apache.maven.lifecycle.internal.LifecycleModuleBuilder.buildProject (LifecycleModuleBuilder.java:81)
    at org.apache.maven.lifecycle.internal.builder.singlethreaded.SingleThreadedBuilder.build
(SingleThreadedBuilder.java:56)
    at org.apache.maven.lifecycle.internal.LifecycleStarter.execute (LifecycleStarter.java:128)
    at org.apache.maven.DefaultMaven.doExecute (DefaultMaven.java:305)
    at org.apache.maven.DefaultMaven.doExecute (DefaultMaven.java:192)
    at org.apache.maven.DefaultMaven.execute (DefaultMaven.java:105)
    at org.jvnet.hudson.maven3.launcher.Maven35Launcher.main (Maven35Launcher.java:130)
    at sun.reflect.NativeMethodAccessorImpl.invoke0 (Native Method)
    at sun.reflect.NativeMethodAccessorImpl.invoke (NativeMethodAccessorImpl.java:62)
    at sun.reflect.DelegatingMethodAccessorImpl.invoke (DelegatingMethodAccessorImpl.java:43)
    at java.lang.reflect.Method.invoke (Method.java:498)
    at org.codehaus.plexus.classworlds.launcher.Launcher.launchEnhanced (Launcher.java:289)
    at org.codehaus.plexus.classworlds.launcher.Launcher.launch (Launcher.java:229)
    at jenkins.maven3.agent.Maven35Main.launch (Maven35Main.java:176)
    at sun.reflect.NativeMethodAccessorImpl.invoke0 (Native Method)
    at sun.reflect.NativeMethodAccessorImpl.invoke (NativeMethodAccessorImpl.java:62)
    at sun.reflect.DelegatingMethodAccessorImpl.invoke (DelegatingMethodAccessorImpl.java:43)
    at java.lang.reflect.Method.invoke (Method.java:498)
    at hudson.maven.Maven3Builder.call (Maven3Builder.java:139)
    at hudson.maven.Maven3Builder.call (Maven3Builder.java:70)
    at hudson.remoting.UserRequest.perform (UserRequest.java:212)
    at hudson.remoting.UserRequest.perform (UserRequest.java:54)
    at hudson.remoting.Request$2.run (Request.java:369)
    at hudson.remoting.InterceptingExecutorService$1.call (InterceptingExecutorService.java:72)
    at java.util.concurrent.FutureTask.run (FutureTask.java:266)
    at java.util.concurrent.ThreadPoolExecutor.runWorker (ThreadPoolExecutor.java:1149)
    at java.util.concurrent.ThreadPoolExecutor$Worker.run (ThreadPoolExecutor.java:624)
    at java.lang.Thread.run (Thread.java:748)
Caused by: org.apache.maven.plugin.compiler.CompilationFailureException: Compilation failure
<https://builds.apache.org/job/Tamaya-Extensions-Master/ws/modules/collections/src/main/java/org/apache/tamaya/collections/ItemTokenizer.java>:[153,30]
cannot find symbol
  symbol:   method toBuilder()
  location: variable context of type org.apache.tamaya.spi.ConversionContext

    at org.apache.maven.plugin.compiler.AbstractCompilerMojo.execute (AbstractCompilerMojo.java:1161)
    at org.apache.maven.plugin.compiler.CompilerMojo.execute (CompilerMojo.java:168)
    at org.apache.maven.plugin.DefaultBuildPluginManager.executeMojo (DefaultBuildPluginManager.java:137)
    at org.apache.maven.lifecycle.internal.MojoExecutor.execute (MojoExecutor.java:210)
    at org.apache.maven.lifecycle.internal.MojoExecutor.execute (MojoExecutor.java:156)
    at org.apache.maven.lifecycle.internal.MojoExecutor.execute (MojoExecutor.java:148)
    at org.apache.maven.lifecycle.internal.LifecycleModuleBuilder.buildProject (LifecycleModuleBuilder.java:117)
    at org.apache.maven.lifecycle.internal.LifecycleModuleBuilder.buildProject (LifecycleModuleBuilder.java:81)
    at org.apache.maven.lifecycle.internal.builder.singlethreaded.SingleThreadedBuilder.build
(SingleThreadedBuilder.java:56)
    at org.apache.maven.lifecycle.internal.LifecycleStarter.execute (LifecycleStarter.java:128)
    at org.apache.maven.DefaultMaven.doExecute (DefaultMaven.java:305)
    at org.apache.maven.DefaultMaven.doExecute (DefaultMaven.java:192)
    at org.apache.maven.DefaultMaven.execute (DefaultMaven.java:105)
    at org.jvnet.hudson.maven3.launcher.Maven35Launcher.main (Maven35Launcher.java:130)
    at sun.reflect.NativeMethodAccessorImpl.invoke0 (Native Method)
    at sun.reflect.NativeMethodAccessorImpl.invoke (NativeMethodAccessorImpl.java:62)
    at sun.reflect.DelegatingMethodAccessorImpl.invoke (DelegatingMethodAccessorImpl.java:43)
    at java.lang.reflect.Method.invoke (Method.java:498)
    at org.codehaus.plexus.classworlds.launcher.Launcher.launchEnhanced (Launcher.java:289)
    at org.codehaus.plexus.classworlds.launcher.Launcher.launch (Launcher.java:229)
    at jenkins.maven3.agent.Maven35Main.launch (Maven35Main.java:176)
    at sun.reflect.NativeMethodAccessorImpl.invoke0 (Native Method)
    at sun.reflect.NativeMethodAccessorImpl.invoke (NativeMethodAccessorImpl.java:62)
    at sun.reflect.DelegatingMethodAccessorImpl.invoke (DelegatingMethodAccessorImpl.java:43)
    at java.lang.reflect.Method.invoke (Method.java:498)
    at hudson.maven.Maven3Builder.call (Maven3Builder.java:139)
    at hudson.maven.Maven3Builder.call (Maven3Builder.java:70)
    at hudson.remoting.UserRequest.perform (UserRequest.java:212)
    at hudson.remoting.UserRequest.perform (UserRequest.java:54)
    at hudson.remoting.Request$2.run (Request.java:369)
    at hudson.remoting.InterceptingExecutorService$1.call (InterceptingExecutorService.java:72)
    at java.util.concurrent.FutureTask.run (FutureTask.java:266)
    at java.util.concurrent.ThreadPoolExecutor.runWorker (ThreadPoolExecutor.java:1149)
    at java.util.concurrent.ThreadPoolExecutor$Worker.run (ThreadPoolExecutor.java:624)
    at java.lang.Thread.run (Thread.java:748)
[ERROR] 
[ERROR] Re-run Maven using the -X switch to enable full debug logging.
[ERROR] 
[ERROR] For more information about the errors and possible solutions, please read the following
articles:
[ERROR] [Help 1] http://cwiki.apache.org/confluence/display/MAVEN/MojoFailureException
[ERROR] 
[ERROR] After correcting the problems, you can resume the build with the command
[ERROR]   mvn <goals> -rf :tamaya-resources
[JENKINS] Archiving <https://builds.apache.org/job/Tamaya-Extensions-Master/ws/modules/pom.xml>
to org.apache.tamaya.ext/tamaya-extensions/0.4-incubating-SNAPSHOT/tamaya-extensions-0.4-incubating-SNAPSHOT.pom
[JENKINS] Archiving <https://builds.apache.org/job/Tamaya-Extensions-Master/ws/modules/target/feature/feature.xml>
to org.apache.tamaya.ext/tamaya-extensions/0.4-incubating-20190514.145418-1416/tamaya-extensions-0.4-incubating-20190514.145418-1416-features.xml
[JENKINS] Archiving <https://builds.apache.org/job/Tamaya-Extensions-Master/ws/modules/events/pom.xml>
to org.apache.tamaya.ext/tamaya-events/0.4-incubating-SNAPSHOT/tamaya-events-0.4-incubating-SNAPSHOT.pom
[JENKINS] Archiving <https://builds.apache.org/job/Tamaya-Extensions-Master/ws/modules/events/target/tamaya-events-0.4-incubating-SNAPSHOT.jar>
to org.apache.tamaya.ext/tamaya-events/0.4-incubating-20190514.145800-1404/tamaya-events-0.4-incubating-20190514.145800-1404.jar
[JENKINS] Archiving <https://builds.apache.org/job/Tamaya-Extensions-Master/ws/modules/events/target/feature/feature.xml>
to org.apache.tamaya.ext/tamaya-events/0.4-incubating-20190514.145800-1404/tamaya-events-0.4-incubating-20190514.145800-1404-features.xml
[JENKINS] Archiving <https://builds.apache.org/job/Tamaya-Extensions-Master/ws/modules/events/target/tamaya-events-0.4-incubating-SNAPSHOT-javadoc.jar>
to org.apache.tamaya.ext/tamaya-events/0.4-incubating-20190514.145800-1404/tamaya-events-0.4-incubating-20190514.145800-1404-javadoc.jar
[JENKINS] Archiving <https://builds.apache.org/job/Tamaya-Extensions-Master/ws/modules/events/target/tamaya-events-0.4-incubating-SNAPSHOT-sources.jar>
to org.apache.tamaya.ext/tamaya-events/0.4-incubating-20190514.145800-1404/tamaya-events-0.4-incubating-20190514.145800-1404-sources.jar
[JENKINS] Archiving <https://builds.apache.org/job/Tamaya-Extensions-Master/ws/modules/formats/base/pom.xml>
to org.apache.tamaya.ext/tamaya-formats/0.4-incubating-SNAPSHOT/tamaya-formats-0.4-incubating-SNAPSHOT.pom
[JENKINS] Archiving <https://builds.apache.org/job/Tamaya-Extensions-Master/ws/modules/features/pom.xml>
to org.apache.tamaya.ext/tamaya-features/0.4-incubating-SNAPSHOT/tamaya-features-0.4-incubating-SNAPSHOT.pom
[JENKINS] Archiving <https://builds.apache.org/job/Tamaya-Extensions-Master/ws/examples/05-spring-example/pom.xml>
to org.apache.tamaya.ext.examples/05-spring-example/0.4-incubating-SNAPSHOT/05-spring-example-0.4-incubating-SNAPSHOT.pom
[JENKINS] Archiving <https://builds.apache.org/job/Tamaya-Extensions-Master/ws/modules/formats/pom.xml>
to org.apache.tamaya.ext/tamaya-formats-all/0.4-incubating-SNAPSHOT/tamaya-formats-all-0.4-incubating-SNAPSHOT.pom
[JENKINS] Archiving <https://builds.apache.org/job/Tamaya-Extensions-Master/ws/modules/formats/target/feature/feature.xml>
to org.apache.tamaya.ext/tamaya-formats-all/0.4-incubating-20190514.145831-1407/tamaya-formats-all-0.4-incubating-20190514.145831-1407-features.xml
[JENKINS] Archiving <https://builds.apache.org/job/Tamaya-Extensions-Master/ws/pom.xml>
to org.apache.tamaya.ext/tamaya-extensions-all/0.4-incubating-SNAPSHOT/tamaya-extensions-all-0.4-incubating-SNAPSHOT.pom
[JENKINS] Archiving <https://builds.apache.org/job/Tamaya-Extensions-Master/ws/target/feature/feature.xml>
to org.apache.tamaya.ext/tamaya-extensions-all/0.4-incubating-20190514.145355-1416/tamaya-extensions-all-0.4-incubating-20190514.145355-1416-features.xml
[JENKINS] Archiving <https://builds.apache.org/job/Tamaya-Extensions-Master/ws/modules/osgi/karaf-shell/pom.xml>
to org.apache.tamaya.ext/tamaya-osgi-karaf-shell/0.4-incubating-SNAPSHOT/tamaya-osgi-karaf-shell-0.4-incubating-SNAPSHOT.pom
[JENKINS] Archiving <https://builds.apache.org/job/Tamaya-Extensions-Master/ws/modules/osgi/karaf-shell/target/tamaya-osgi-karaf-shell-0.4-incubating-SNAPSHOT.jar>
to org.apache.tamaya.ext/tamaya-osgi-karaf-shell/0.4-incubating-20190514.150211-1247/tamaya-osgi-karaf-shell-0.4-incubating-20190514.150211-1247.jar
[JENKINS] Archiving <https://builds.apache.org/job/Tamaya-Extensions-Master/ws/modules/osgi/karaf-shell/target/feature/feature.xml>
to org.apache.tamaya.ext/tamaya-osgi-karaf-shell/0.4-incubating-20190514.150211-1247/tamaya-osgi-karaf-shell-0.4-incubating-20190514.150211-1247-features.xml
[JENKINS] Archiving <https://builds.apache.org/job/Tamaya-Extensions-Master/ws/modules/osgi/karaf-shell/target/tamaya-osgi-karaf-shell-0.4-incubating-SNAPSHOT-javadoc.jar>
to org.apache.tamaya.ext/tamaya-osgi-karaf-shell/0.4-incubating-20190514.150211-1247/tamaya-osgi-karaf-shell-0.4-incubating-20190514.150211-1247-javadoc.jar
[JENKINS] Archiving <https://builds.apache.org/job/Tamaya-Extensions-Master/ws/modules/osgi/karaf-shell/target/tamaya-osgi-karaf-shell-0.4-incubating-SNAPSHOT-sources.jar>
to org.apache.tamaya.ext/tamaya-osgi-karaf-shell/0.4-incubating-20190514.150211-1247/tamaya-osgi-karaf-shell-0.4-incubating-20190514.150211-1247-sources.jar
[JENKINS] Archiving <https://builds.apache.org/job/Tamaya-Extensions-Master/ws/modules/formats/hjson/pom.xml>
to org.apache.tamaya.ext/tamaya-hjson/0.4-incubating-SNAPSHOT/tamaya-hjson-0.4-incubating-SNAPSHOT.pom
[Fast Archiver] No prior successful build to compare, so performing full copy of artifacts
[JENKINS] Archiving <https://builds.apache.org/job/Tamaya-Extensions-Master/ws/modules/microprofile/pom.xml>
to org.apache.tamaya.ext/tamaya-microprofile/0.4-incubating-SNAPSHOT/tamaya-microprofile-0.4-incubating-SNAPSHOT.pom
[JENKINS] Archiving <https://builds.apache.org/job/Tamaya-Extensions-Master/ws/modules/jndi/pom.xml>
to org.apache.tamaya.ext/tamaya-jndi/0.4-incubating-SNAPSHOT/tamaya-jndi-0.4-incubating-SNAPSHOT.pom
[JENKINS] Archiving <https://builds.apache.org/job/Tamaya-Extensions-Master/ws/modules/jndi/target/feature/feature.xml>
to org.apache.tamaya.ext/tamaya-jndi/0.4-incubating-SNAPSHOT/tamaya-jndi-0.4-incubating-SNAPSHOT-features.xml
[JENKINS] Archiving <https://builds.apache.org/job/Tamaya-Extensions-Master/ws/modules/osgi/common/pom.xml>
to org.apache.tamaya.ext/tamaya-osgi/0.4-incubating-SNAPSHOT/tamaya-osgi-0.4-incubating-SNAPSHOT.pom
[JENKINS] Archiving <https://builds.apache.org/job/Tamaya-Extensions-Master/ws/modules/osgi/common/target/tamaya-osgi-0.4-incubating-SNAPSHOT.jar>
to org.apache.tamaya.ext/tamaya-osgi/0.4-incubating-20190514.150054-1249/tamaya-osgi-0.4-incubating-20190514.150054-1249.jar
[JENKINS] Archiving <https://builds.apache.org/job/Tamaya-Extensions-Master/ws/modules/osgi/common/target/feature/feature.xml>
to org.apache.tamaya.ext/tamaya-osgi/0.4-incubating-20190514.150054-1249/tamaya-osgi-0.4-incubating-20190514.150054-1249-features.xml
[JENKINS] Archiving <https://builds.apache.org/job/Tamaya-Extensions-Master/ws/modules/osgi/common/target/tamaya-osgi-0.4-incubating-SNAPSHOT-javadoc.jar>
to org.apache.tamaya.ext/tamaya-osgi/0.4-incubating-20190514.150054-1249/tamaya-osgi-0.4-incubating-20190514.150054-1249-javadoc.jar
[JENKINS] Archiving <https://builds.apache.org/job/Tamaya-Extensions-Master/ws/modules/osgi/common/target/tamaya-osgi-0.4-incubating-SNAPSHOT-sources.jar>
to org.apache.tamaya.ext/tamaya-osgi/0.4-incubating-20190514.150054-1249/tamaya-osgi-0.4-incubating-20190514.150054-1249-sources.jar
[JENKINS] Archiving <https://builds.apache.org/job/Tamaya-Extensions-Master/ws/modules/hazelcast/pom.xml>
to org.apache.tamaya.ext/tamaya-hazelcast/0.4-incubating-SNAPSHOT/tamaya-hazelcast-0.4-incubating-SNAPSHOT.pom
[JENKINS] Archiving <https://builds.apache.org/job/Tamaya-Extensions-Master/ws/examples/03-injection-example/pom.xml>
to org.apache.tamaya.ext.examples/03-injection-example/0.4-incubating-SNAPSHOT/03-injection-example-0.4-incubating-SNAPSHOT.pom
[JENKINS] Archiving <https://builds.apache.org/job/Tamaya-Extensions-Master/ws/modules/collections/pom.xml>
to org.apache.tamaya.ext/tamaya-collections/0.4-incubating-SNAPSHOT/tamaya-collections-0.4-incubating-SNAPSHOT.pom
[JENKINS] Archiving <https://builds.apache.org/job/Tamaya-Extensions-Master/ws/modules/collections/target/feature/feature.xml>
to org.apache.tamaya.ext/tamaya-collections/0.4-incubating-SNAPSHOT/tamaya-collections-0.4-incubating-SNAPSHOT-features.xml
[JENKINS] Archiving <https://builds.apache.org/job/Tamaya-Extensions-Master/ws/modules/optional/pom.xml>
to org.apache.tamaya.ext/tamaya-optional/0.4-incubating-SNAPSHOT/tamaya-optional-0.4-incubating-SNAPSHOT.pom
[JENKINS] Archiving <https://builds.apache.org/job/Tamaya-Extensions-Master/ws/modules/optional/target/tamaya-optional-0.4-incubating-SNAPSHOT.jar>
to org.apache.tamaya.ext/tamaya-optional/0.4-incubating-20190514.145900-1407/tamaya-optional-0.4-incubating-20190514.145900-1407.jar
[JENKINS] Archiving <https://builds.apache.org/job/Tamaya-Extensions-Master/ws/modules/optional/target/feature/feature.xml>
to org.apache.tamaya.ext/tamaya-optional/0.4-incubating-20190514.145900-1407/tamaya-optional-0.4-incubating-20190514.145900-1407-features.xml
[JENKINS] Archiving <https://builds.apache.org/job/Tamaya-Extensions-Master/ws/modules/optional/target/tamaya-optional-0.4-incubating-SNAPSHOT-javadoc.jar>
to org.apache.tamaya.ext/tamaya-optional/0.4-incubating-20190514.145900-1407/tamaya-optional-0.4-incubating-20190514.145900-1407-javadoc.jar
[JENKINS] Archiving <https://builds.apache.org/job/Tamaya-Extensions-Master/ws/modules/optional/target/tamaya-optional-0.4-incubating-SNAPSHOT-sources.jar>
to org.apache.tamaya.ext/tamaya-optional/0.4-incubating-20190514.145900-1407/tamaya-optional-0.4-incubating-20190514.145900-1407-sources.jar
[JENKINS] Archiving <https://builds.apache.org/job/Tamaya-Extensions-Master/ws/modules/resolver/pom.xml>
to org.apache.tamaya.ext/tamaya-resolver/0.4-incubating-SNAPSHOT/tamaya-resolver-0.4-incubating-SNAPSHOT.pom
[JENKINS] Archiving <https://builds.apache.org/job/Tamaya-Extensions-Master/ws/examples/pom.xml>
to org.apache.tamaya.ext.examples/examples/0.4-incubating-SNAPSHOT/examples-0.4-incubating-SNAPSHOT.pom
[JENKINS] Archiving <https://builds.apache.org/job/Tamaya-Extensions-Master/ws/examples/target/feature/feature.xml>
to org.apache.tamaya.ext.examples/examples/0.4-incubating-20190514.145451-1411/examples-0.4-incubating-20190514.145451-1411-features.xml
[JENKINS] Archiving <https://builds.apache.org/job/Tamaya-Extensions-Master/ws/modules/osgi/karaf-features/pom.xml>
to org.apache.tamaya.ext/tamaya-karaf-features/0.4-incubating-SNAPSHOT/tamaya-karaf-features-0.4-incubating-SNAPSHOT.pom
[JENKINS] Archiving <https://builds.apache.org/job/Tamaya-Extensions-Master/ws/modules/osgi/karaf-features/target/feature/feature.xml>
to org.apache.tamaya.ext/tamaya-karaf-features/0.4-incubating-20190514.150242-1254/tamaya-karaf-features-0.4-incubating-20190514.150242-1254-features.xml
[JENKINS] Archiving <https://builds.apache.org/job/Tamaya-Extensions-Master/ws/modules/osgi/karaf-features/target/tamaya-karaf-features-0.4-incubating-SNAPSHOT-sources.jar>
to org.apache.tamaya.ext/tamaya-karaf-features/0.4-incubating-20190514.150242-1254/tamaya-karaf-features-0.4-incubating-20190514.150242-1254-sources.jar
[JENKINS] Archiving <https://builds.apache.org/job/Tamaya-Extensions-Master/ws/modules/filter/pom.xml>
to org.apache.tamaya.ext/tamaya-filter/0.4-incubating-SNAPSHOT/tamaya-filter-0.4-incubating-SNAPSHOT.pom
[JENKINS] Archiving <https://builds.apache.org/job/Tamaya-Extensions-Master/ws/modules/filter/target/tamaya-filter-0.4-incubating-SNAPSHOT.jar>
to org.apache.tamaya.ext/tamaya-filter/0.4-incubating-20190514.145946-1400/tamaya-filter-0.4-incubating-20190514.145946-1400.jar
[JENKINS] Archiving <https://builds.apache.org/job/Tamaya-Extensions-Master/ws/modules/filter/target/feature/feature.xml>
to org.apache.tamaya.ext/tamaya-filter/0.4-incubating-20190514.145946-1400/tamaya-filter-0.4-incubating-20190514.145946-1400-features.xml
[JENKINS] Archiving <https://builds.apache.org/job/Tamaya-Extensions-Master/ws/modules/filter/target/tamaya-filter-0.4-incubating-SNAPSHOT-javadoc.jar>
to org.apache.tamaya.ext/tamaya-filter/0.4-incubating-20190514.145946-1400/tamaya-filter-0.4-incubating-20190514.145946-1400-javadoc.jar
[JENKINS] Archiving <https://builds.apache.org/job/Tamaya-Extensions-Master/ws/modules/filter/target/tamaya-filter-0.4-incubating-SNAPSHOT-sources.jar>
to org.apache.tamaya.ext/tamaya-filter/0.4-incubating-20190514.145946-1400/tamaya-filter-0.4-incubating-20190514.145946-1400-sources.jar
[JENKINS] Archiving <https://builds.apache.org/job/Tamaya-Extensions-Master/ws/modules/spring/pom.xml>
to org.apache.tamaya.ext/tamaya-spring/0.4-incubating-SNAPSHOT/tamaya-spring-0.4-incubating-SNAPSHOT.pom
[JENKINS] Archiving <https://builds.apache.org/job/Tamaya-Extensions-Master/ws/examples/02-resolver-example/pom.xml>
to org.apache.tamaya.ext.examples/02-resolver-example/0.4-incubating-SNAPSHOT/02-resolver-example-0.4-incubating-SNAPSHOT.pom
[JENKINS] Archiving <https://builds.apache.org/job/Tamaya-Extensions-Master/ws/modules/osgi/pom.xml>
to org.apache.tamaya.ext/tamaya-osgi-all/0.4-incubating-SNAPSHOT/tamaya-osgi-all-0.4-incubating-SNAPSHOT.pom
[JENKINS] Archiving <https://builds.apache.org/job/Tamaya-Extensions-Master/ws/modules/osgi/target/feature/feature.xml>
to org.apache.tamaya.ext/tamaya-osgi-all/0.4-incubating-20190514.150022-1296/tamaya-osgi-all-0.4-incubating-20190514.150022-1296-features.xml
[JENKINS] Archiving <https://builds.apache.org/job/Tamaya-Extensions-Master/ws/modules/osgi/updater/pom.xml>
to org.apache.tamaya.ext/tamaya-osgi-updater/0.4-incubating-SNAPSHOT/tamaya-osgi-updater-0.4-incubating-SNAPSHOT.pom
[JENKINS] Archiving <https://builds.apache.org/job/Tamaya-Extensions-Master/ws/modules/osgi/updater/target/tamaya-osgi-updater-0.4-incubating-SNAPSHOT.jar>
to org.apache.tamaya.ext/tamaya-osgi-updater/0.4-incubating-20190514.150132-1248/tamaya-osgi-updater-0.4-incubating-20190514.150132-1248.jar
[JENKINS] Archiving <https://builds.apache.org/job/Tamaya-Extensions-Master/ws/modules/osgi/updater/target/feature/feature.xml>
to org.apache.tamaya.ext/tamaya-osgi-updater/0.4-incubating-20190514.150132-1248/tamaya-osgi-updater-0.4-incubating-20190514.150132-1248-features.xml
[JENKINS] Archiving <https://builds.apache.org/job/Tamaya-Extensions-Master/ws/modules/osgi/updater/target/tamaya-osgi-updater-0.4-incubating-SNAPSHOT-javadoc.jar>
to org.apache.tamaya.ext/tamaya-osgi-updater/0.4-incubating-20190514.150132-1248/tamaya-osgi-updater-0.4-incubating-20190514.150132-1248-javadoc.jar
[JENKINS] Archiving <https://builds.apache.org/job/Tamaya-Extensions-Master/ws/modules/osgi/updater/target/tamaya-osgi-updater-0.4-incubating-SNAPSHOT-sources.jar>
to org.apache.tamaya.ext/tamaya-osgi-updater/0.4-incubating-20190514.150132-1248/tamaya-osgi-updater-0.4-incubating-20190514.150132-1248-sources.jar
[JENKINS] Archiving <https://builds.apache.org/job/Tamaya-Extensions-Master/ws/modules/injection/cdi/pom.xml>
to org.apache.tamaya.ext/tamaya-cdi/0.4-incubating-SNAPSHOT/tamaya-cdi-0.4-incubating-SNAPSHOT.pom
[JENKINS] Archiving <https://builds.apache.org/job/Tamaya-Extensions-Master/ws/modules/formats/yaml/pom.xml>
to org.apache.tamaya.ext/tamaya-yaml/0.4-incubating-SNAPSHOT/tamaya-yaml-0.4-incubating-SNAPSHOT.pom
[JENKINS] Archiving <https://builds.apache.org/job/Tamaya-Extensions-Master/ws/modules/mutable-config/pom.xml>
to org.apache.tamaya.ext/tamaya-mutable-config/0.4-incubating-SNAPSHOT/tamaya-mutable-config-0.4-incubating-SNAPSHOT.pom
[JENKINS] Archiving <https://builds.apache.org/job/Tamaya-Extensions-Master/ws/modules/mutable-config/target/feature/feature.xml>
to org.apache.tamaya.ext/tamaya-mutable-config/0.4-incubating-SNAPSHOT/tamaya-mutable-config-0.4-incubating-SNAPSHOT-features.xml
[JENKINS] Archiving <https://builds.apache.org/job/Tamaya-Extensions-Master/ws/modules/injection/injection-api/pom.xml>
to org.apache.tamaya.ext/tamaya-injection-api/0.4-incubating-SNAPSHOT/tamaya-injection-api-0.4-incubating-SNAPSHOT.pom
[JENKINS] Archiving <https://builds.apache.org/job/Tamaya-Extensions-Master/ws/modules/injection/injection-api/target/tamaya-injection-api-0.4-incubating-SNAPSHOT.jar>
to org.apache.tamaya.ext/tamaya-injection-api/0.4-incubating-20190514.145630-1402/tamaya-injection-api-0.4-incubating-20190514.145630-1402.jar
[JENKINS] Archiving <https://builds.apache.org/job/Tamaya-Extensions-Master/ws/modules/injection/injection-api/target/feature/feature.xml>
to org.apache.tamaya.ext/tamaya-injection-api/0.4-incubating-20190514.145630-1402/tamaya-injection-api-0.4-incubating-20190514.145630-1402-features.xml
[JENKINS] Archiving <https://builds.apache.org/job/Tamaya-Extensions-Master/ws/modules/injection/injection-api/target/tamaya-injection-api-0.4-incubating-SNAPSHOT-javadoc.jar>
to org.apache.tamaya.ext/tamaya-injection-api/0.4-incubating-20190514.145630-1402/tamaya-injection-api-0.4-incubating-20190514.145630-1402-javadoc.jar
[JENKINS] Archiving <https://builds.apache.org/job/Tamaya-Extensions-Master/ws/modules/injection/injection-api/target/tamaya-injection-api-0.4-incubating-SNAPSHOT-sources.jar>
to org.apache.tamaya.ext/tamaya-injection-api/0.4-incubating-20190514.145630-1402/tamaya-injection-api-0.4-incubating-20190514.145630-1402-sources.jar
[JENKINS] Archiving <https://builds.apache.org/job/Tamaya-Extensions-Master/ws/modules/etcd/pom.xml>
to org.apache.tamaya.ext/tamaya-etcd/0.4-incubating-SNAPSHOT/tamaya-etcd-0.4-incubating-SNAPSHOT.pom
[JENKINS] Archiving <https://builds.apache.org/job/Tamaya-Extensions-Master/ws/modules/resources/pom.xml>
to org.apache.tamaya.ext/tamaya-resources/0.4-incubating-SNAPSHOT/tamaya-resources-0.4-incubating-SNAPSHOT.pom
[JENKINS] Archiving <https://builds.apache.org/job/Tamaya-Extensions-Master/ws/modules/resources/target/feature/feature.xml>
to org.apache.tamaya.ext/tamaya-resources/0.4-incubating-SNAPSHOT/tamaya-resources-0.4-incubating-SNAPSHOT-features.xml
[JENKINS] Archiving <https://builds.apache.org/job/Tamaya-Extensions-Master/ws/examples/04-events-example/pom.xml>
to org.apache.tamaya.ext.examples/04-events-example/0.4-incubating-SNAPSHOT/04-events-example-0.4-incubating-SNAPSHOT.pom
[JENKINS] Archiving <https://builds.apache.org/job/Tamaya-Extensions-Master/ws/modules/formats/json/pom.xml>
to org.apache.tamaya.ext/tamaya-json/0.4-incubating-SNAPSHOT/tamaya-json-0.4-incubating-SNAPSHOT.pom
[JENKINS] Archiving <https://builds.apache.org/job/Tamaya-Extensions-Master/ws/modules/osgi/gogo-shell/pom.xml>
to org.apache.tamaya.ext/tamaya-osgi-gogo-shell/0.4-incubating-SNAPSHOT/tamaya-osgi-gogo-shell-0.4-incubating-SNAPSHOT.pom
[JENKINS] Archiving <https://builds.apache.org/job/Tamaya-Extensions-Master/ws/modules/osgi/gogo-shell/target/tamaya-osgi-gogo-shell-0.4-incubating-SNAPSHOT.jar>
to org.apache.tamaya.ext/tamaya-osgi-gogo-shell/0.4-incubating-20190514.150320-1248/tamaya-osgi-gogo-shell-0.4-incubating-20190514.150320-1248.jar
[JENKINS] Archiving <https://builds.apache.org/job/Tamaya-Extensions-Master/ws/modules/osgi/gogo-shell/target/feature/feature.xml>
to org.apache.tamaya.ext/tamaya-osgi-gogo-shell/0.4-incubating-20190514.150320-1248/tamaya-osgi-gogo-shell-0.4-incubating-20190514.150320-1248-features.xml
[JENKINS] Archiving <https://builds.apache.org/job/Tamaya-Extensions-Master/ws/modules/osgi/gogo-shell/target/tamaya-osgi-gogo-shell-0.4-incubating-SNAPSHOT-javadoc.jar>
to org.apache.tamaya.ext/tamaya-osgi-gogo-shell/0.4-incubating-20190514.150320-1248/tamaya-osgi-gogo-shell-0.4-incubating-20190514.150320-1248-javadoc.jar
[JENKINS] Archiving <https://builds.apache.org/job/Tamaya-Extensions-Master/ws/modules/osgi/gogo-shell/target/tamaya-osgi-gogo-shell-0.4-incubating-SNAPSHOT-sources.jar>
to org.apache.tamaya.ext/tamaya-osgi-gogo-shell/0.4-incubating-20190514.150320-1248/tamaya-osgi-gogo-shell-0.4-incubating-20190514.150320-1248-sources.jar
[JENKINS] Archiving <https://builds.apache.org/job/Tamaya-Extensions-Master/ws/modules/osgi/injection/pom.xml>
to org.apache.tamaya.ext/tamaya-osgi-injection/0.4-incubating-SNAPSHOT/tamaya-osgi-injection-0.4-incubating-SNAPSHOT.pom
[JENKINS] Archiving <https://builds.apache.org/job/Tamaya-Extensions-Master/ws/modules/injection/pom.xml>
to org.apache.tamaya.ext/tamaya-injection-all/0.4-incubating-SNAPSHOT/tamaya-injection-all-0.4-incubating-SNAPSHOT.pom
[JENKINS] Archiving <https://builds.apache.org/job/Tamaya-Extensions-Master/ws/modules/injection/target/feature/feature.xml>
to org.apache.tamaya.ext/tamaya-injection-all/0.4-incubating-20190514.145512-1410/tamaya-injection-all-0.4-incubating-20190514.145512-1410-features.xml
[JENKINS] Archiving <https://builds.apache.org/job/Tamaya-Extensions-Master/ws/examples/01-resources-example/pom.xml>
to org.apache.tamaya.ext.examples/01-resources-example/0.4-incubating-SNAPSHOT/01-resources-example-0.4-incubating-SNAPSHOT.pom
[JENKINS] Archiving <https://builds.apache.org/job/Tamaya-Extensions-Master/ws/modules/functions/pom.xml>
to org.apache.tamaya.ext/tamaya-functions/0.4-incubating-SNAPSHOT/tamaya-functions-0.4-incubating-SNAPSHOT.pom
[JENKINS] Archiving <https://builds.apache.org/job/Tamaya-Extensions-Master/ws/modules/functions/target/tamaya-functions-0.4-incubating-SNAPSHOT.jar>
to org.apache.tamaya.ext/tamaya-functions/0.4-incubating-20190514.145715-1404/tamaya-functions-0.4-incubating-20190514.145715-1404.jar
[JENKINS] Archiving <https://builds.apache.org/job/Tamaya-Extensions-Master/ws/modules/functions/target/feature/feature.xml>
to org.apache.tamaya.ext/tamaya-functions/0.4-incubating-20190514.145715-1404/tamaya-functions-0.4-incubating-20190514.145715-1404-features.xml
[JENKINS] Archiving <https://builds.apache.org/job/Tamaya-Extensions-Master/ws/modules/functions/target/tamaya-functions-0.4-incubating-SNAPSHOT-javadoc.jar>
to org.apache.tamaya.ext/tamaya-functions/0.4-incubating-20190514.145715-1404/tamaya-functions-0.4-incubating-20190514.145715-1404-javadoc.jar
[JENKINS] Archiving <https://builds.apache.org/job/Tamaya-Extensions-Master/ws/modules/functions/target/tamaya-functions-0.4-incubating-SNAPSHOT-sources.jar>
to org.apache.tamaya.ext/tamaya-functions/0.4-incubating-20190514.145715-1404/tamaya-functions-0.4-incubating-20190514.145715-1404-sources.jar
[JENKINS] Archiving <https://builds.apache.org/job/Tamaya-Extensions-Master/ws/modules/consul/pom.xml>
to org.apache.tamaya.ext/tamaya-consul/0.4-incubating-SNAPSHOT/tamaya-consul-0.4-incubating-SNAPSHOT.pom
[JENKINS] Archiving <https://builds.apache.org/job/Tamaya-Extensions-Master/ws/modules/formats/hocon/pom.xml>
to org.apache.tamaya.ext/tamaya-hocon/0.4-incubating-SNAPSHOT/tamaya-hocon-0.4-incubating-SNAPSHOT.pom
[Fast Archiver] No prior successful build to compare, so performing full copy of artifacts
[JENKINS] Archiving <https://builds.apache.org/job/Tamaya-Extensions-Master/ws/distribution/pom.xml>
to org.apache.tamaya.ext/tamaya-extension-distribution/0.4-incubating-SNAPSHOT/tamaya-extension-distribution-0.4-incubating-SNAPSHOT.pom
[JENKINS] Archiving <https://builds.apache.org/job/Tamaya-Extensions-Master/ws/distribution/target/tamaya-extension-distribution-0.4-incubating-SNAPSHOT.jar>
to org.apache.tamaya.ext/tamaya-extension-distribution/0.4-incubating-20190514.150404-1402/tamaya-extension-distribution-0.4-incubating-20190514.150404-1402.jar
[JENKINS] Archiving <https://builds.apache.org/job/Tamaya-Extensions-Master/ws/distribution/target/feature/feature.xml>
to org.apache.tamaya.ext/tamaya-extension-distribution/0.4-incubating-20190514.150404-1402/tamaya-extension-distribution-0.4-incubating-20190514.150404-1402-features.xml
[JENKINS] Archiving <https://builds.apache.org/job/Tamaya-Extensions-Master/ws/distribution/target/tamaya-extension-distribution-0.4-incubating-SNAPSHOT-sources.jar>
to org.apache.tamaya.ext/tamaya-extension-distribution/0.4-incubating-20190514.150404-1402/tamaya-extension-distribution-0.4-incubating-20190514.150404-1402-sources.jar
[JENKINS] Archiving <https://builds.apache.org/job/Tamaya-Extensions-Master/ws/distribution/target/apache-tamaya-extension-distribution-0.4-incubating-SNAPSHOT-src.zip>
to org.apache.tamaya.ext/tamaya-extension-distribution/0.4-incubating-20190514.150404-1402/tamaya-extension-distribution-0.4-incubating-20190514.150404-1402.zip
[JENKINS] Archiving <https://builds.apache.org/job/Tamaya-Extensions-Master/ws/distribution/target/apache-tamaya-extension-distribution-0.4-incubating-SNAPSHOT-src.tar.gz>
to org.apache.tamaya.ext/tamaya-extension-distribution/0.4-incubating-20190514.150404-1402/tamaya-extension-distribution-0.4-incubating-20190514.150404-1402.tar.gz
[JENKINS] Archiving <https://builds.apache.org/job/Tamaya-Extensions-Master/ws/modules/injection/standalone/pom.xml>
to org.apache.tamaya.ext/tamaya-injection/0.4-incubating-SNAPSHOT/tamaya-injection-0.4-incubating-SNAPSHOT.pom
channel stopped
Not sending mail to unregistered user atsticks@gmail.com

Mime
View raw message