tamaya-commits mailing list archives

Site index · List index
Message view « Date » · « Thread »
Top « Date » · « Thread »
From Apache Jenkins Server <jenk...@builds.apache.org>
Subject Build failed in Jenkins: Tamaya-Master-branch #1866
Date Sun, 21 Apr 2019 20:44:53 GMT
See <https://builds.apache.org/job/Tamaya-Master-branch/1866/display/redirect?page=changes>

Changes:

[github] TAMAYA-277: Fix warning

[github] TAMAYA-277: Fix warning

------------------------------------------
[...truncated 234.80 KB...]
[INFO] Finished adding exclusions from SCM ignore files.
[INFO] 62 implicit excludes (use -debug for more details).
[INFO] 11 explicit excludes (use -debug for more details).
[INFO] 112 resources included (use -debug for more details)
[INFO] Rat check: Summary over all files. Unapproved: 0, unknown: 0, generated: 0, approved:
112 licenses.
[INFO] 
[INFO] --- buildnumber-maven-plugin:1.4:create (default) @ tamaya-core ---
[INFO] 
[INFO] --- maven-checkstyle-plugin:3.0.0:check (checkstyle) @ tamaya-core ---
[INFO] 
[INFO] --- maven-remote-resources-plugin:1.5:process (process-resource-bundles) @ tamaya-core
---
[INFO] 
[INFO] --- karaf-maven-plugin:4.0.5:features-generate-descriptor (generate) @ tamaya-core
---
[INFO] Downloading: http://repository.apache.org/snapshots/org/apache/tamaya/tamaya-core/0.4-incubating-SNAPSHOT/maven-metadata.xml
[INFO] Downloaded: http://repository.apache.org/snapshots/org/apache/tamaya/tamaya-core/0.4-incubating-SNAPSHOT/maven-metadata.xml
(2 KB at 5.0 KB/sec)
[INFO] Generating feature descriptor file <https://builds.apache.org/job/Tamaya-Master-branch/ws/code/core/target/feature/feature.xml>
[INFO] ...done!
[INFO] 
[INFO] --- maven-resources-plugin:3.1.0:resources (default-resources) @ tamaya-core ---
[INFO] Using 'UTF-8' encoding to copy filtered resources.
[INFO] Copying 7 resources
[INFO] Copying 3 resources
[INFO] 
[INFO] --- maven-compiler-plugin:3.7.0:compile (default-compile) @ tamaya-core ---
[INFO] Changes detected - recompiling the module!
[INFO] Compiling 39 source files to <https://builds.apache.org/job/Tamaya-Master-branch/ws/code/core/target/classes>
[INFO] <https://builds.apache.org/job/Tamaya-Master-branch/ws/code/core/src/main/java/org/apache/tamaya/core/internal/converters/ConvertQuery.java>:
Some input files use unchecked or unsafe operations.
[INFO] <https://builds.apache.org/job/Tamaya-Master-branch/ws/code/core/src/main/java/org/apache/tamaya/core/internal/converters/ConvertQuery.java>:
Recompile with -Xlint:unchecked for details.
[INFO] -------------------------------------------------------------
[ERROR] COMPILATION ERROR : 
[INFO] -------------------------------------------------------------
[ERROR] <https://builds.apache.org/job/Tamaya-Master-branch/ws/code/core/src/main/java/org/apache/tamaya/core/internal/OSGIServiceContext.java>:[133,30]
cannot find symbol
  symbol:   variable SERVERE
  location: class java.util.logging.Level
[INFO] 1 error
[INFO] -------------------------------------------------------------
[INFO]                                                                         
[INFO] ------------------------------------------------------------------------
[INFO] Building Apache Tamaya Core Examples 0.4-incubating-SNAPSHOT
[INFO] ------------------------------------------------------------------------
[INFO] 
[INFO] --- maven-clean-plugin:3.1.0:clean (default-clean) @ examples ---
[INFO] 
[INFO] --- maven-enforcer-plugin:3.0.0-M1:enforce (enforce-maven-version) @ examples ---
[INFO] 
[INFO] --- maven-enforcer-plugin:3.0.0-M1:enforce (enforce-versions) @ examples ---
[INFO] 
[INFO] --- apache-rat-plugin:0.13:check (default) @ examples ---
[INFO] Enabled default license matchers.
[INFO] Will parse SCM ignores for exclusions...
[INFO] Finished adding exclusions from SCM ignore files.
[INFO] 64 implicit excludes (use -debug for more details).
[INFO] 11 explicit excludes (use -debug for more details).
[INFO] 1 resources included (use -debug for more details)
[INFO] Rat check: Summary over all files. Unapproved: 0, unknown: 0, generated: 0, approved:
1 licenses.
[INFO] 
[INFO] --- buildnumber-maven-plugin:1.4:create (default) @ examples ---
[INFO] 
[INFO] --- maven-remote-resources-plugin:1.5:process (process-resource-bundles) @ examples
---
[INFO] 
[INFO] --- karaf-maven-plugin:4.0.5:features-generate-descriptor (generate) @ examples ---
[INFO] Generating feature descriptor file <https://builds.apache.org/job/Tamaya-Master-branch/ws/examples/target/feature/feature.xml>
[INFO] ...done!
[INFO] 
[INFO] --- bnd-maven-plugin:3.3.0:bnd-process (default) @ examples ---
[INFO] skip project with packaging=pom
[INFO] 
[INFO] --- maven-site-plugin:3.7:attach-descriptor (attach-descriptor) @ examples ---
[INFO] No site descriptor found: nothing to attach.
[INFO] 
[INFO] --- maven-javadoc-plugin:3.0.1:jar (attach-javadocs) @ examples ---
[INFO] Not executing Javadoc as the project is not a Java classpath-capable package
[INFO] 
[INFO] >>> maven-source-plugin:3.0.1:jar (source-jar) > generate-sources @ examples
>>>
[INFO] 
[INFO] --- maven-enforcer-plugin:3.0.0-M1:enforce (enforce-maven-version) @ examples ---
[INFO] 
[INFO] --- maven-enforcer-plugin:3.0.0-M1:enforce (enforce-versions) @ examples ---
[INFO] 
[INFO] --- apache-rat-plugin:0.13:check (default) @ examples ---
[INFO] Enabled default license matchers.
[INFO] Will parse SCM ignores for exclusions...
[INFO] Finished adding exclusions from SCM ignore files.
[INFO] 64 implicit excludes (use -debug for more details).
[INFO] 11 explicit excludes (use -debug for more details).
[INFO] 1 resources included (use -debug for more details)
[INFO] Rat check: Summary over all files. Unapproved: 0, unknown: 0, generated: 0, approved:
1 licenses.
[INFO] 
[INFO] --- buildnumber-maven-plugin:1.4:create (default) @ examples ---
[WARNING] Failed to getClass for org.apache.maven.plugins.source.SourceJarMojo
[INFO] 
[INFO] <<< maven-source-plugin:3.0.1:jar (source-jar) < generate-sources @ examples
<<<
[INFO] 
[INFO] --- maven-source-plugin:3.0.1:jar (source-jar) @ examples ---
[INFO] 
[INFO] --- maven-failsafe-plugin:2.22.0:integration-test (default) @ examples ---
[INFO] No tests to run.
[JENKINS] Recording test results
[INFO] 
[INFO] --- maven-failsafe-plugin:2.22.0:verify (default) @ examples ---
[JENKINS] Recording test results
[INFO] 
[INFO] --- maven-install-plugin:2.5.2:install (default-install) @ examples ---
[INFO] Installing <https://builds.apache.org/job/Tamaya-Master-branch/ws/examples/pom.xml>
to /home/jenkins/jenkins-slave/maven-repositories/1/org/apache/tamaya/examples/examples/0.4-incubating-SNAPSHOT/examples-0.4-incubating-SNAPSHOT.pom
[INFO] Installing <https://builds.apache.org/job/Tamaya-Master-branch/ws/examples/target/feature/feature.xml>
to /home/jenkins/jenkins-slave/maven-repositories/1/org/apache/tamaya/examples/examples/0.4-incubating-SNAPSHOT/examples-0.4-incubating-SNAPSHOT-features.xml
[INFO] 
[INFO] --- maven-enforcer-plugin:3.0.0-M1:enforce (enforce-maven-version) @ examples ---
[INFO] 
[INFO] --- maven-enforcer-plugin:3.0.0-M1:enforce (enforce-versions) @ examples ---
[INFO] 
[INFO] --- apache-rat-plugin:0.13:check (default) @ examples ---
[INFO] Enabled default license matchers.
[INFO] Will parse SCM ignores for exclusions...
[INFO] Finished adding exclusions from SCM ignore files.
[INFO] 64 implicit excludes (use -debug for more details).
[INFO] 11 explicit excludes (use -debug for more details).
[INFO] 1 resources included (use -debug for more details)
[INFO] Rat check: Summary over all files. Unapproved: 0, unknown: 0, generated: 0, approved:
1 licenses.
[INFO] 
[INFO] --- buildnumber-maven-plugin:1.4:create (default) @ examples ---
[INFO] 
[INFO] --- maven-remote-resources-plugin:1.5:process (process-resource-bundles) @ examples
---
[INFO] 
[INFO] --- karaf-maven-plugin:4.0.5:features-generate-descriptor (generate) @ examples ---
[INFO] Generating feature descriptor file <https://builds.apache.org/job/Tamaya-Master-branch/ws/examples/target/feature/feature.xml>
[INFO] ...done!
[INFO] 
[INFO] --- bnd-maven-plugin:3.3.0:bnd-process (default) @ examples ---
[INFO] skip project with packaging=pom
[INFO] 
[INFO] --- maven-site-plugin:3.7:attach-descriptor (attach-descriptor) @ examples ---
[INFO] No site descriptor found: nothing to attach.
[INFO] 
[INFO] --- maven-javadoc-plugin:3.0.1:jar (attach-javadocs) @ examples ---
[INFO] Not executing Javadoc as the project is not a Java classpath-capable package
[INFO] 
[INFO] >>> maven-source-plugin:3.0.1:jar (source-jar) > generate-sources @ examples
>>>
[INFO] 
[INFO] --- maven-enforcer-plugin:3.0.0-M1:enforce (enforce-maven-version) @ examples ---
[INFO] 
[INFO] --- maven-enforcer-plugin:3.0.0-M1:enforce (enforce-versions) @ examples ---
[INFO] 
[INFO] --- apache-rat-plugin:0.13:check (default) @ examples ---
[INFO] Enabled default license matchers.
[INFO] Will parse SCM ignores for exclusions...
[INFO] Finished adding exclusions from SCM ignore files.
[INFO] 64 implicit excludes (use -debug for more details).
[INFO] 11 explicit excludes (use -debug for more details).
[INFO] 1 resources included (use -debug for more details)
[INFO] Rat check: Summary over all files. Unapproved: 0, unknown: 0, generated: 0, approved:
1 licenses.
[INFO] 
[INFO] --- buildnumber-maven-plugin:1.4:create (default) @ examples ---
[WARNING] Failed to getClass for org.apache.maven.plugins.source.SourceJarMojo
[INFO] 
[INFO] <<< maven-source-plugin:3.0.1:jar (source-jar) < generate-sources @ examples
<<<
[INFO] 
[INFO] --- maven-source-plugin:3.0.1:jar (source-jar) @ examples ---
[INFO] 
[INFO] --- maven-failsafe-plugin:2.22.0:integration-test (default) @ examples ---
[INFO] No tests to run.
[INFO] Skipping execution of surefire because it has already been run for this configuration
[JENKINS] Recording test results
[INFO] 
[INFO] --- maven-failsafe-plugin:2.22.0:verify (default) @ examples ---
[JENKINS] Recording test results
[INFO] 
[INFO] --- maven-install-plugin:2.5.2:install (default-install) @ examples ---
[INFO] Installing <https://builds.apache.org/job/Tamaya-Master-branch/ws/examples/pom.xml>
to /home/jenkins/jenkins-slave/maven-repositories/1/org/apache/tamaya/examples/examples/0.4-incubating-SNAPSHOT/examples-0.4-incubating-SNAPSHOT.pom
[INFO] Installing <https://builds.apache.org/job/Tamaya-Master-branch/ws/examples/target/feature/feature.xml>
to /home/jenkins/jenkins-slave/maven-repositories/1/org/apache/tamaya/examples/examples/0.4-incubating-SNAPSHOT/examples-0.4-incubating-SNAPSHOT-features.xml
[INFO] Installing <https://builds.apache.org/job/Tamaya-Master-branch/ws/examples/target/feature/feature.xml>
to /home/jenkins/jenkins-slave/maven-repositories/1/org/apache/tamaya/examples/examples/0.4-incubating-SNAPSHOT/examples-0.4-incubating-SNAPSHOT-features.xml
[INFO] 
[INFO] --- maven-deploy-plugin:2.8.2:deploy (default-deploy) @ examples ---
[INFO] Skipping artifact deployment
[INFO]                                                                         
[INFO] ------------------------------------------------------------------------
[INFO] Skipping Apache Tamaya Minimal Example
[INFO] This project has been banned from the build due to previous failures.
[INFO] ------------------------------------------------------------------------
[INFO]                                                                         
[INFO] ------------------------------------------------------------------------
[INFO] Skipping Apache Tamaya Custom Propertysource Example
[INFO] This project has been banned from the build due to previous failures.
[INFO] ------------------------------------------------------------------------
[INFO]                                                                         
[INFO] ------------------------------------------------------------------------
[INFO] Skipping Apache Tamaya Distribution
[INFO] This project has been banned from the build due to previous failures.
[INFO] ------------------------------------------------------------------------
[INFO] ------------------------------------------------------------------------
[INFO] Reactor Summary:
[INFO] 
[INFO] Apache Tamaya Base ................................. SUCCESS [ 36.574 s]
[INFO] Apache Tamaya Build Configuration .................. SUCCESS [ 10.814 s]
[INFO] Apache Tamaya Code - all ........................... SUCCESS [ 15.578 s]
[INFO] Apache Tamaya Core API ............................. SUCCESS [01:35 min]
[INFO] Apache Tamaya Core SPI Support ..................... SUCCESS [ 46.754 s]
[INFO] Apache Tamaya Core Implementation .................. FAILURE [  4.121 s]
[INFO] Apache Tamaya Core Examples ........................ SUCCESS [  7.446 s]
[INFO] Apache Tamaya Minimal Example ...................... SKIPPED
[INFO] Apache Tamaya Custom Propertysource Example ........ SKIPPED
[INFO] Apache Tamaya Distribution ......................... SKIPPED
[INFO] ------------------------------------------------------------------------
[INFO] BUILD FAILURE
[INFO] ------------------------------------------------------------------------
[INFO] Total time: 04:22 min
[INFO] Finished at: 2019-04-21T20:44:34+00:00
[INFO] Final Memory: 95M/4051M
[INFO] ------------------------------------------------------------------------
[ERROR] Failed to execute goal org.apache.maven.plugins:maven-compiler-plugin:3.7.0:compile
(default-compile) on project tamaya-core: Compilation failure
[ERROR] <https://builds.apache.org/job/Tamaya-Master-branch/ws/code/core/src/main/java/org/apache/tamaya/core/internal/OSGIServiceContext.java>:[133,30]
cannot find symbol
[ERROR] symbol:   variable SERVERE
[ERROR] location: class java.util.logging.Level
[ERROR] -> [Help 1]
[ERROR] 
[ERROR] To see the full stack trace of the errors, re-run Maven with the -e switch.
[ERROR] Re-run Maven using the -X switch to enable full debug logging.
[ERROR] 
[ERROR] For more information about the errors and possible solutions, please read the following
articles:
[ERROR] [Help 1] http://cwiki.apache.org/confluence/display/MAVEN/MojoFailureException
[ERROR] 
[ERROR] After correcting the problems, you can resume the build with the command
[ERROR]   mvn <goals> -rf :tamaya-core
[JENKINS] Archiving <https://builds.apache.org/job/Tamaya-Master-branch/ws/pom.xml>
to org.apache.tamaya/tamaya-all/0.4-incubating-SNAPSHOT/tamaya-all-0.4-incubating-SNAPSHOT.pom
[JENKINS] Archiving <https://builds.apache.org/job/Tamaya-Master-branch/ws/target/feature/feature.xml>
to org.apache.tamaya/tamaya-all/0.4-incubating-20190421.204043-1660/tamaya-all-0.4-incubating-20190421.204043-1660-features.xml
[JENKINS] Archiving <https://builds.apache.org/job/Tamaya-Master-branch/ws/buildconfigurations/pom.xml>
to org.apache.tamaya/buildconfigurations/0.4-incubating-SNAPSHOT/buildconfigurations-0.4-incubating-SNAPSHOT.pom
[JENKINS] Archiving <https://builds.apache.org/job/Tamaya-Master-branch/ws/buildconfigurations/target/buildconfigurations-0.4-incubating-SNAPSHOT.jar>
to org.apache.tamaya/buildconfigurations/0.4-incubating-SNAPSHOT/buildconfigurations-0.4-incubating-SNAPSHOT.jar
[JENKINS] Archiving <https://builds.apache.org/job/Tamaya-Master-branch/ws/buildconfigurations/target/feature/feature.xml>
to org.apache.tamaya/buildconfigurations/0.4-incubating-SNAPSHOT/buildconfigurations-0.4-incubating-SNAPSHOT-features.xml
[JENKINS] Archiving <https://builds.apache.org/job/Tamaya-Master-branch/ws/buildconfigurations/target/buildconfigurations-0.4-incubating-SNAPSHOT-sources.jar>
to org.apache.tamaya/buildconfigurations/0.4-incubating-SNAPSHOT/buildconfigurations-0.4-incubating-SNAPSHOT-sources.jar
[JENKINS] Archiving <https://builds.apache.org/job/Tamaya-Master-branch/ws/code/core/pom.xml>
to org.apache.tamaya/tamaya-core/0.4-incubating-SNAPSHOT/tamaya-core-0.4-incubating-SNAPSHOT.pom
[JENKINS] Archiving <https://builds.apache.org/job/Tamaya-Master-branch/ws/code/core/target/feature/feature.xml>
to org.apache.tamaya/tamaya-core/0.4-incubating-SNAPSHOT/tamaya-core-0.4-incubating-SNAPSHOT-features.xml
[JENKINS] Archiving <https://builds.apache.org/job/Tamaya-Master-branch/ws/code/api/pom.xml>
to org.apache.tamaya/tamaya-api/0.4-incubating-SNAPSHOT/tamaya-api-0.4-incubating-SNAPSHOT.pom
[JENKINS] Archiving <https://builds.apache.org/job/Tamaya-Master-branch/ws/code/api/target/tamaya-api-0.4-incubating-SNAPSHOT.jar>
to org.apache.tamaya/tamaya-api/0.4-incubating-20190421.204249-1653/tamaya-api-0.4-incubating-20190421.204249-1653.jar
[JENKINS] Archiving <https://builds.apache.org/job/Tamaya-Master-branch/ws/code/api/target/feature/feature.xml>
to org.apache.tamaya/tamaya-api/0.4-incubating-20190421.204249-1653/tamaya-api-0.4-incubating-20190421.204249-1653-features.xml
[JENKINS] Archiving <https://builds.apache.org/job/Tamaya-Master-branch/ws/code/api/target/tamaya-api-0.4-incubating-SNAPSHOT-javadoc.jar>
to org.apache.tamaya/tamaya-api/0.4-incubating-20190421.204249-1653/tamaya-api-0.4-incubating-20190421.204249-1653-javadoc.jar
[JENKINS] Archiving <https://builds.apache.org/job/Tamaya-Master-branch/ws/code/api/target/tamaya-api-0.4-incubating-SNAPSHOT-sources.jar>
to org.apache.tamaya/tamaya-api/0.4-incubating-20190421.204249-1653/tamaya-api-0.4-incubating-20190421.204249-1653-sources.jar
[JENKINS] Archiving <https://builds.apache.org/job/Tamaya-Master-branch/ws/code/spi-support/pom.xml>
to org.apache.tamaya/tamaya-spisupport/0.4-incubating-SNAPSHOT/tamaya-spisupport-0.4-incubating-SNAPSHOT.pom
[JENKINS] Archiving <https://builds.apache.org/job/Tamaya-Master-branch/ws/code/spi-support/target/tamaya-spisupport-0.4-incubating-SNAPSHOT.jar>
to org.apache.tamaya/tamaya-spisupport/0.4-incubating-20190421.204340-1322/tamaya-spisupport-0.4-incubating-20190421.204340-1322.jar
[JENKINS] Archiving <https://builds.apache.org/job/Tamaya-Master-branch/ws/code/spi-support/target/feature/feature.xml>
to org.apache.tamaya/tamaya-spisupport/0.4-incubating-20190421.204340-1322/tamaya-spisupport-0.4-incubating-20190421.204340-1322-features.xml
[JENKINS] Archiving <https://builds.apache.org/job/Tamaya-Master-branch/ws/code/spi-support/target/tamaya-spisupport-0.4-incubating-SNAPSHOT-javadoc.jar>
to org.apache.tamaya/tamaya-spisupport/0.4-incubating-20190421.204340-1322/tamaya-spisupport-0.4-incubating-20190421.204340-1322-javadoc.jar
[JENKINS] Archiving <https://builds.apache.org/job/Tamaya-Master-branch/ws/code/spi-support/target/tamaya-spisupport-0.4-incubating-SNAPSHOT-sources.jar>
to org.apache.tamaya/tamaya-spisupport/0.4-incubating-20190421.204340-1322/tamaya-spisupport-0.4-incubating-20190421.204340-1322-sources.jar
[JENKINS] Archiving <https://builds.apache.org/job/Tamaya-Master-branch/ws/examples/01-minimal/pom.xml>
to org.apache.tamaya.examples/01-minimal/0.4-incubating-SNAPSHOT/01-minimal-0.4-incubating-SNAPSHOT.pom
[JENKINS] Archiving <https://builds.apache.org/job/Tamaya-Master-branch/ws/distribution/pom.xml>
to org.apache.tamaya/tamaya-distribution/0.4-incubating-SNAPSHOT/tamaya-distribution-0.4-incubating-SNAPSHOT.pom
[JENKINS] Archiving <https://builds.apache.org/job/Tamaya-Master-branch/ws/examples/pom.xml>
to org.apache.tamaya.examples/examples/0.4-incubating-SNAPSHOT/examples-0.4-incubating-SNAPSHOT.pom
[JENKINS] Archiving <https://builds.apache.org/job/Tamaya-Master-branch/ws/examples/target/feature/feature.xml>
to org.apache.tamaya.examples/examples/0.4-incubating-SNAPSHOT/examples-0.4-incubating-SNAPSHOT-features.xml
[JENKINS] Archiving <https://builds.apache.org/job/Tamaya-Master-branch/ws/code/pom.xml>
to org.apache.tamaya/tamaya-code/0.4-incubating-SNAPSHOT/tamaya-code-0.4-incubating-SNAPSHOT.pom
[JENKINS] Archiving <https://builds.apache.org/job/Tamaya-Master-branch/ws/code/target/feature/feature.xml>
to org.apache.tamaya/tamaya-code/0.4-incubating-20190421.204119-1662/tamaya-code-0.4-incubating-20190421.204119-1662-features.xml
[JENKINS] Archiving <https://builds.apache.org/job/Tamaya-Master-branch/ws/examples/02-custom-property-source/pom.xml>
to org.apache.tamaya.examples/02-custom-property-source/0.4-incubating-SNAPSHOT/02-custom-property-source-0.4-incubating-SNAPSHOT.pom
channel stopped
Not sending mail to unregistered user noreply@github.com

Mime
View raw message