tamaya-commits mailing list archives

Site index · List index
Message view « Date » · « Thread »
Top « Date » · « Thread »
From Apache Jenkins Server <jenk...@builds.apache.org>
Subject Build failed in Jenkins: Tamaya-Sandbox-Master » Apache Tamaya Modules - Vertx Support #3001
Date Sat, 23 Feb 2019 10:46:14 GMT
See <https://builds.apache.org/job/Tamaya-Sandbox-Master/org.apache.tamaya.ext$tamaya-vertx-alpha/3001/display/redirect>

------------------------------------------
[INFO]                                                                         
[INFO] ------------------------------------------------------------------------
[INFO] Building Apache Tamaya Modules - Vertx Support 0.4-incubating-SNAPSHOT
[INFO] ------------------------------------------------------------------------
[INFO] Downloading: http://repository.apache.org/snapshots/org/apache/tamaya/ext/tamaya-injection/0.4-incubating-SNAPSHOT/maven-metadata.xml
[INFO] Downloaded: http://repository.apache.org/snapshots/org/apache/tamaya/ext/tamaya-injection/0.4-incubating-SNAPSHOT/maven-metadata.xml
(2 KB at 4.3 KB/sec)
[INFO] 
[INFO] --- maven-clean-plugin:3.1.0:clean (default-clean) @ tamaya-vertx-alpha ---
[INFO] Deleting <https://builds.apache.org/job/Tamaya-Sandbox-Master/org.apache.tamaya.ext$tamaya-vertx-alpha/ws/target>
[INFO] 
[INFO] --- maven-enforcer-plugin:3.0.0-M1:enforce (enforce-maven-version) @ tamaya-vertx-alpha
---
[INFO] 
[INFO] --- maven-enforcer-plugin:3.0.0-M1:enforce (enforce-versions) @ tamaya-vertx-alpha
---
[INFO] 
[INFO] --- apache-rat-plugin:0.12:check (default) @ tamaya-vertx-alpha ---
[INFO] Enabled default license matchers.
[INFO] Will parse SCM ignores for exclusions...
[INFO] Finished adding exclusions from SCM ignore files.
[INFO] 61 implicit excludes (use -debug for more details).
[INFO] Exclude: **/*banner.txt
[INFO] Exclude: banner.txt
[INFO] Exclude: .git
[INFO] Exclude: derby.log
[INFO] Exclude: **/bootstrap-*
[INFO] Exclude: **/js/jquery-*
[INFO] Exclude: **/*.json
[INFO] Exclude: **/*.md
[INFO] Exclude: **/*.md.vm
[INFO] Exclude: src/site/asciidoc/temp-properties-files-for-site/attributes.adoc
[INFO] Exclude: readme/**
[INFO] 10 resources included (use -debug for more details)
[INFO] Rat check: Summary over all files. Unapproved: 0, unknown: 0, generated: 0, approved:
10 licenses.
[INFO] 
[INFO] --- buildnumber-maven-plugin:1.4:create (default) @ tamaya-vertx-alpha ---
[INFO] 
[INFO] --- maven-checkstyle-plugin:3.0.0:check (checkstyle) @ tamaya-vertx-alpha ---
[INFO] 
[INFO] --- maven-remote-resources-plugin:1.5:process (process-resource-bundles) @ tamaya-vertx-alpha
---
[INFO] 
[INFO] --- karaf-maven-plugin:4.2.2:features-generate-descriptor (generate) @ tamaya-vertx-alpha
---
[INFO] Downloading: http://repository.apache.org/snapshots/org/apache/tamaya/ext/tamaya-vertx-alpha/0.4-incubating-SNAPSHOT/maven-metadata.xml
[INFO] Downloaded: http://repository.apache.org/snapshots/org/apache/tamaya/ext/tamaya-vertx-alpha/0.4-incubating-SNAPSHOT/maven-metadata.xml
(2 KB at 4.4 KB/sec)
[INFO] Generating feature descriptor file <https://builds.apache.org/job/Tamaya-Sandbox-Master/org.apache.tamaya.ext$tamaya-vertx-alpha/ws/target/feature/feature.xml>
[INFO] ...done!
[INFO] Attaching features XML
[INFO] 
[INFO] --- maven-resources-plugin:3.1.0:resources (default-resources) @ tamaya-vertx-alpha
---
[INFO] Using 'UTF-8' encoding to copy filtered resources.
[INFO] Copying 1 resource
[INFO] Copying 3 resources
[INFO] 
[INFO] --- maven-compiler-plugin:3.5.1:compile (default-compile) @ tamaya-vertx-alpha ---
[INFO] Changes detected - recompiling the module!
[INFO] Compiling 3 source files to <https://builds.apache.org/job/Tamaya-Sandbox-Master/org.apache.tamaya.ext$tamaya-vertx-alpha/ws/target/classes>
[INFO] -------------------------------------------------------------
[WARNING] COMPILATION WARNING : 
[INFO] -------------------------------------------------------------
[WARNING] <https://builds.apache.org/job/Tamaya-Sandbox-Master/org.apache.tamaya.ext$tamaya-vertx-alpha/ws/src/main/java/org/apache/tamaya/vertx/AbstractConfiguredVerticle.java>:[23,32]
org.apache.tamaya.inject.ConfigurationInjection in org.apache.tamaya.inject has been deprecated
[WARNING] <https://builds.apache.org/job/Tamaya-Sandbox-Master/org.apache.tamaya.ext$tamaya-vertx-alpha/ws/src/main/java/org/apache/tamaya/vertx/ConfiguredJavaVerticleFactory.java>:[24,32]
org.apache.tamaya.inject.ConfigurationInjection in org.apache.tamaya.inject has been deprecated
[WARNING] <https://builds.apache.org/job/Tamaya-Sandbox-Master/org.apache.tamaya.ext$tamaya-vertx-alpha/ws/src/main/java/org/apache/tamaya/vertx/TamayaConfigurationProducer.java>:[30,32]
org.apache.tamaya.inject.ConfigurationInjection in org.apache.tamaya.inject has been deprecated
[WARNING] <https://builds.apache.org/job/Tamaya-Sandbox-Master/org.apache.tamaya.ext$tamaya-vertx-alpha/ws/src/main/java/org/apache/tamaya/vertx/AbstractConfiguredVerticle.java>:[51,9]
org.apache.tamaya.inject.ConfigurationInjection in org.apache.tamaya.inject has been deprecated
[WARNING] <https://builds.apache.org/job/Tamaya-Sandbox-Master/org.apache.tamaya.ext$tamaya-vertx-alpha/ws/src/main/java/org/apache/tamaya/vertx/ConfiguredJavaVerticleFactory.java>:[54,9]
org.apache.tamaya.inject.ConfigurationInjection in org.apache.tamaya.inject has been deprecated
[WARNING] <https://builds.apache.org/job/Tamaya-Sandbox-Master/org.apache.tamaya.ext$tamaya-vertx-alpha/ws/src/main/java/org/apache/tamaya/vertx/TamayaConfigurationProducer.java>:[126,17]
org.apache.tamaya.inject.ConfigurationInjection in org.apache.tamaya.inject has been deprecated
[INFO] 6 warnings 
[INFO] -------------------------------------------------------------
[INFO] -------------------------------------------------------------
[ERROR] COMPILATION ERROR : 
[INFO] -------------------------------------------------------------
[ERROR] <https://builds.apache.org/job/Tamaya-Sandbox-Master/org.apache.tamaya.ext$tamaya-vertx-alpha/ws/src/main/java/org/apache/tamaya/vertx/TamayaConfigurationProducer.java>:[50,19]
cannot find symbol
  symbol:   method key()
  location: @interface org.apache.tamaya.inject.api.Config
[ERROR] <https://builds.apache.org/job/Tamaya-Sandbox-Master/org.apache.tamaya.ext$tamaya-vertx-alpha/ws/src/main/java/org/apache/tamaya/vertx/TamayaConfigurationProducer.java>:[53,19]
cannot find symbol
  symbol:   method key()
  location: @interface org.apache.tamaya.inject.api.Config
[ERROR] <https://builds.apache.org/job/Tamaya-Sandbox-Master/org.apache.tamaya.ext$tamaya-vertx-alpha/ws/src/main/java/org/apache/tamaya/vertx/TamayaConfigurationProducer.java>:[56,19]
cannot find symbol
  symbol:   method key()
  location: @interface org.apache.tamaya.inject.api.Config
[INFO] 3 errors 
[INFO] -------------------------------------------------------------

Mime
View raw message