tamaya-commits mailing list archives

Site index · List index
Message view « Date » · « Thread »
Top « Date » · « Thread »
From Apache Jenkins Server <jenk...@builds.apache.org>
Subject Build failed in Jenkins: Tamaya-Sandbox-Master » Apache Tamaya Modules - Documentation #3001
Date Sat, 23 Feb 2019 10:46:10 GMT
See <https://builds.apache.org/job/Tamaya-Sandbox-Master/org.apache.tamaya.ext$tamaya-doc_alpha/3001/display/redirect>

------------------------------------------
[INFO]                                                                         
[INFO] ------------------------------------------------------------------------
[INFO] Building Apache Tamaya Modules - Documentation 0.4-incubating-SNAPSHOT
[INFO] ------------------------------------------------------------------------
[INFO] 
[INFO] --- maven-clean-plugin:3.1.0:clean (default-clean) @ tamaya-doc_alpha ---
[INFO] Deleting <https://builds.apache.org/job/Tamaya-Sandbox-Master/org.apache.tamaya.ext$tamaya-doc_alpha/ws/target>
[INFO] 
[INFO] --- maven-enforcer-plugin:3.0.0-M1:enforce (enforce-maven-version) @ tamaya-doc_alpha
---
[INFO] 
[INFO] --- maven-enforcer-plugin:3.0.0-M1:enforce (enforce-versions) @ tamaya-doc_alpha ---
[INFO] 
[INFO] --- apache-rat-plugin:0.12:check (default) @ tamaya-doc_alpha ---
[INFO] Enabled default license matchers.
[INFO] Will parse SCM ignores for exclusions...
[INFO] Finished adding exclusions from SCM ignore files.
[INFO] 61 implicit excludes (use -debug for more details).
[INFO] Exclude: **/*banner.txt
[INFO] Exclude: banner.txt
[INFO] Exclude: .git
[INFO] Exclude: derby.log
[INFO] Exclude: **/bootstrap-*
[INFO] Exclude: **/js/jquery-*
[INFO] Exclude: **/*.json
[INFO] Exclude: **/*.md
[INFO] Exclude: **/*.md.vm
[INFO] Exclude: src/site/asciidoc/temp-properties-files-for-site/attributes.adoc
[INFO] Exclude: readme/**
[INFO] 27 resources included (use -debug for more details)
[INFO] Rat check: Summary over all files. Unapproved: 0, unknown: 0, generated: 0, approved:
26 licenses.
[INFO] 
[INFO] --- buildnumber-maven-plugin:1.4:create (default) @ tamaya-doc_alpha ---
[INFO] 
[INFO] --- maven-checkstyle-plugin:3.0.0:check (checkstyle) @ tamaya-doc_alpha ---
[INFO] There are 3 errors reported by Checkstyle 7.8 with buildtools/src/main/resources/checkstyle/style.xml
ruleset.
[ERROR] src/test/java/org/apache/tamaya/doc/AnnotatedDocConfigBean.java:[24] (imports) AvoidStarImport:
Using the '.*' form of import should be avoided - org.apache.tamaya.inject.api.*.
[ERROR] src/test/java/org/apache/tamaya/doc/ConfigDocumenterTest.java:[25] (imports) AvoidStarImport:
Using the '.*' form of import should be avoided - org.junit.Assert.*.
[ERROR] src/test/java/org/apache/tamaya/doc/ConfigDocumenterTest.java:[25,1] (imports) IllegalImport:
Illegal import - org.junit.Assert.*.
[INFO] ------------------------------------------------------------------------
[INFO] Reactor Summary:
[INFO] 
[INFO] Apache Tamaya Sandbox .............................. SUCCESS [ 40.192 s]
[INFO] Apache Tamaya Modules - Apache Commons ............. SUCCESS [ 43.949 s]
[INFO] Apache Tamaya Modules - Joda-Time Support .......... SUCCESS [01:22 min]
[INFO] Apache Tamaya Modules - Usage tracker .............. SUCCESS [ 40.286 s]
[INFO] Apache Tamaya Modules - Documentation .............. FAILURE [  1.984 s]
[INFO] Apache Tamaya Modules - Validation ................. SKIPPED
[INFO] Apache Tamaya Modules - Remote PropertySource ...... SUCCESS [ 35.300 s]
[INFO] Apache Tamaya Modules - Configured System Properties SUCCESS [ 33.741 s]
[INFO] Apache Tamaya Modules - Apache Camel Support ....... SUCCESS [ 39.466 s]
[INFO] Apache Tamaya Modules - PropertySources ............ SUCCESS [ 34.591 s]
[INFO] Apache Tamaya Modules - JMX Support ................ SUCCESS [ 35.783 s]
[INFO] Apache Tamaya Modules - Metamodel .................. SUCCESS [ 41.261 s]
[INFO] Apache Tamaya Modules - Units of Measurement Support SUCCESS [ 34.124 s]
[INFO] Apache Tamaya Modules - Vertx Support .............. FAILURE [  4.353 s]
[INFO] Apache Tamaya Modules - JSR 382 Implementation ..... SUCCESS [ 41.879 s]
[INFO] Apache Tamaya Modules - HJSON Support .............. SUCCESS [ 36.036 s]
[INFO] ------------------------------------------------------------------------
[INFO] BUILD FAILURE
[INFO] ------------------------------------------------------------------------
[INFO] Total time: 10:55 min
[INFO] Finished at: 2019-02-23T10:45:51+00:00
[INFO] Final Memory: 108M/4037M
[INFO] ------------------------------------------------------------------------
[ERROR] Failed to execute goal org.apache.maven.plugins:maven-checkstyle-plugin:3.0.0:check
(checkstyle) on project tamaya-doc_alpha: You have 3 Checkstyle violations. -> [Help 1]
[ERROR] Failed to execute goal org.apache.maven.plugins:maven-compiler-plugin:3.5.1:compile
(default-compile) on project tamaya-vertx-alpha: Compilation failure: Compilation failure:
[ERROR] /home/jenkins/jenkins-slave/workspace/Tamaya-Sandbox-Master/vertx/src/main/java/org/apache/tamaya/vertx/TamayaConfigurationProducer.java:[50,19]
cannot find symbol
[ERROR] symbol:   method key()
[ERROR] location: @interface org.apache.tamaya.inject.api.Config
[ERROR] /home/jenkins/jenkins-slave/workspace/Tamaya-Sandbox-Master/vertx/src/main/java/org/apache/tamaya/vertx/TamayaConfigurationProducer.java:[53,19]
cannot find symbol
[ERROR] symbol:   method key()
[ERROR] location: @interface org.apache.tamaya.inject.api.Config
[ERROR] /home/jenkins/jenkins-slave/workspace/Tamaya-Sandbox-Master/vertx/src/main/java/org/apache/tamaya/vertx/TamayaConfigurationProducer.java:[56,19]
cannot find symbol
[ERROR] symbol:   method key()
[ERROR] location: @interface org.apache.tamaya.inject.api.Config
[ERROR] -> [Help 1]
[ERROR] 
[ERROR] To see the full stack trace of the errors, re-run Maven with the -e switch.
[ERROR] Re-run Maven using the -X switch to enable full debug logging.
[ERROR] 
[ERROR] For more information about the errors and possible solutions, please read the following
articles:
[ERROR] [Help 1] http://cwiki.apache.org/confluence/display/MAVEN/MojoFailureException
[ERROR] 
[ERROR] After correcting the problems, you can resume the build with the command
[ERROR]   mvn <goals> -rf :tamaya-doc_alpha

Mime
View raw message