tamaya-commits mailing list archives

Site index · List index
Message view « Date » · « Thread »
Top « Date » · « Thread »
From Apache Jenkins Server <jenk...@builds.apache.org>
Subject Build failed in Jenkins: Tamaya-Sandbox-Master » Apache Tamaya Modules - Usage tracker #2694
Date Sun, 16 Dec 2018 00:44:30 GMT
See <https://builds.apache.org/job/Tamaya-Sandbox-Master/org.apache.tamaya.ext$tamaya-usagetracker_beta/2694/display/redirect>

------------------------------------------
[INFO]                                                                         
[INFO] ------------------------------------------------------------------------
[INFO] Building Apache Tamaya Modules - Usage tracker 0.4-incubating-SNAPSHOT
[INFO] ------------------------------------------------------------------------
[INFO] Downloading: http://repository.apache.org/snapshots/org/apache/tamaya/ext/tamaya-injection-api/0.4-incubating-SNAPSHOT/maven-metadata.xml
[INFO] Downloaded: http://repository.apache.org/snapshots/org/apache/tamaya/ext/tamaya-injection-api/0.4-incubating-SNAPSHOT/maven-metadata.xml
(2 KB at 4.9 KB/sec)
[INFO] Downloading: http://repository.apache.org/snapshots/org/apache/tamaya/ext/tamaya-injection-api/0.4-incubating-SNAPSHOT/tamaya-injection-api-0.4-incubating-20181215.233331-1060.pom
[INFO] Downloaded: http://repository.apache.org/snapshots/org/apache/tamaya/ext/tamaya-injection-api/0.4-incubating-SNAPSHOT/tamaya-injection-api-0.4-incubating-20181215.233331-1060.pom
(4 KB at 10.1 KB/sec)
[INFO] Downloading: http://repository.apache.org/snapshots/org/apache/tamaya/ext/tamaya-injection-all/0.4-incubating-SNAPSHOT/maven-metadata.xml
[INFO] Downloaded: http://repository.apache.org/snapshots/org/apache/tamaya/ext/tamaya-injection-all/0.4-incubating-SNAPSHOT/maven-metadata.xml
(869 B at 2.7 KB/sec)
[INFO] Downloading: http://repository.apache.org/snapshots/org/apache/tamaya/ext/tamaya-injection-all/0.4-incubating-SNAPSHOT/tamaya-injection-all-0.4-incubating-20181215.233246-1060.pom
[INFO] Downloaded: http://repository.apache.org/snapshots/org/apache/tamaya/ext/tamaya-injection-all/0.4-incubating-SNAPSHOT/tamaya-injection-all-0.4-incubating-20181215.233246-1060.pom
(3 KB at 7.2 KB/sec)
[INFO] Downloading: http://repository.apache.org/snapshots/org/apache/tamaya/ext/tamaya-events/0.4-incubating-SNAPSHOT/maven-metadata.xml
[INFO] Downloaded: http://repository.apache.org/snapshots/org/apache/tamaya/ext/tamaya-events/0.4-incubating-SNAPSHOT/maven-metadata.xml
(2 KB at 4.9 KB/sec)
[INFO] Downloading: http://repository.apache.org/snapshots/org/apache/tamaya/ext/tamaya-events/0.4-incubating-SNAPSHOT/tamaya-events-0.4-incubating-20181215.132456-1053.pom
[INFO] Downloaded: http://repository.apache.org/snapshots/org/apache/tamaya/ext/tamaya-events/0.4-incubating-SNAPSHOT/tamaya-events-0.4-incubating-20181215.132456-1053.pom
(4 KB at 12.8 KB/sec)
[INFO] Downloading: http://repository.apache.org/snapshots/org/apache/tamaya/ext/tamaya-json/0.4-incubating-SNAPSHOT/maven-metadata.xml
[INFO] Downloaded: http://repository.apache.org/snapshots/org/apache/tamaya/ext/tamaya-json/0.4-incubating-SNAPSHOT/maven-metadata.xml
(2 KB at 4.9 KB/sec)
[INFO] Downloading: http://repository.apache.org/snapshots/org/apache/tamaya/ext/tamaya-json/0.4-incubating-SNAPSHOT/tamaya-json-0.4-incubating-20181215.133841-1050.pom
[INFO] Downloaded: http://repository.apache.org/snapshots/org/apache/tamaya/ext/tamaya-json/0.4-incubating-SNAPSHOT/tamaya-json-0.4-incubating-20181215.133841-1050.pom
(6 KB at 17.5 KB/sec)
[INFO] Downloading: http://repository.apache.org/snapshots/org/apache/tamaya/ext/tamaya-events/0.4-incubating-SNAPSHOT/tamaya-events-0.4-incubating-20181215.132456-1053.jar
[INFO] Downloading: http://repository.apache.org/snapshots/org/apache/tamaya/ext/tamaya-injection-api/0.4-incubating-SNAPSHOT/tamaya-injection-api-0.4-incubating-20181215.233331-1060.jar
[INFO] Downloading: http://repository.apache.org/snapshots/org/apache/tamaya/ext/tamaya-json/0.4-incubating-SNAPSHOT/tamaya-json-0.4-incubating-20181215.133841-1050.jar
[INFO] Downloaded: http://repository.apache.org/snapshots/org/apache/tamaya/ext/tamaya-json/0.4-incubating-SNAPSHOT/tamaya-json-0.4-incubating-20181215.133841-1050.jar
(17 KB at 43.9 KB/sec)
[INFO] Downloaded: http://repository.apache.org/snapshots/org/apache/tamaya/ext/tamaya-injection-api/0.4-incubating-SNAPSHOT/tamaya-injection-api-0.4-incubating-20181215.233331-1060.jar
(23 KB at 61.2 KB/sec)
[INFO] Downloaded: http://repository.apache.org/snapshots/org/apache/tamaya/ext/tamaya-events/0.4-incubating-SNAPSHOT/tamaya-events-0.4-incubating-20181215.132456-1053.jar
(35 KB at 93.2 KB/sec)
[INFO] 
[INFO] --- maven-clean-plugin:3.1.0:clean (default-clean) @ tamaya-usagetracker_beta ---
[INFO] Deleting <https://builds.apache.org/job/Tamaya-Sandbox-Master/org.apache.tamaya.ext$tamaya-usagetracker_beta/ws/target>
[INFO] 
[INFO] --- maven-enforcer-plugin:3.0.0-M1:enforce (enforce-maven-version) @ tamaya-usagetracker_beta
---
[INFO] 
[INFO] --- maven-enforcer-plugin:3.0.0-M1:enforce (enforce-versions) @ tamaya-usagetracker_beta
---
[INFO] 
[INFO] --- apache-rat-plugin:0.12:check (default) @ tamaya-usagetracker_beta ---
[INFO] Enabled default license matchers.
[INFO] Will parse SCM ignores for exclusions...
[INFO] Finished adding exclusions from SCM ignore files.
[INFO] 61 implicit excludes (use -debug for more details).
[INFO] Exclude: **/*banner.txt
[INFO] Exclude: banner.txt
[INFO] Exclude: .git
[INFO] Exclude: derby.log
[INFO] Exclude: **/bootstrap-*
[INFO] Exclude: **/js/jquery-*
[INFO] Exclude: **/*.json
[INFO] Exclude: **/*.md
[INFO] Exclude: **/*.md.vm
[INFO] Exclude: src/site/asciidoc/temp-properties-files-for-site/attributes.adoc
[INFO] Exclude: readme/**
[INFO] 18 resources included (use -debug for more details)
[INFO] Rat check: Summary over all files. Unapproved: 0, unknown: 0, generated: 0, approved:
18 licenses.
[INFO] 
[INFO] --- maven-remote-resources-plugin:1.5:process (process-resource-bundles) @ tamaya-usagetracker_beta
---
[INFO] 
[INFO] --- karaf-maven-plugin:4.2.0:features-generate-descriptor (generate) @ tamaya-usagetracker_beta
---
[INFO] Downloading: http://repository.apache.org/snapshots/org/apache/tamaya/ext/tamaya-usagetracker_beta/0.4-incubating-SNAPSHOT/maven-metadata.xml
[INFO] Downloaded: http://repository.apache.org/snapshots/org/apache/tamaya/ext/tamaya-usagetracker_beta/0.4-incubating-SNAPSHOT/maven-metadata.xml
(2 KB at 5.0 KB/sec)
[INFO] Generating feature descriptor file <https://builds.apache.org/job/Tamaya-Sandbox-Master/org.apache.tamaya.ext$tamaya-usagetracker_beta/ws/target/feature/feature.xml>
[INFO] ...done!
[INFO] 
[INFO] --- maven-resources-plugin:3.1.0:resources (default-resources) @ tamaya-usagetracker_beta
---
[INFO] Using 'UTF-8' encoding to copy filtered resources.
[INFO] Copying 3 resources
[INFO] Copying 3 resources
[INFO] 
[INFO] --- maven-compiler-plugin:3.7.0:compile (default-compile) @ tamaya-usagetracker_beta
---
[INFO] Changes detected - recompiling the module!
[INFO] Compiling 5 source files to <https://builds.apache.org/job/Tamaya-Sandbox-Master/org.apache.tamaya.ext$tamaya-usagetracker_beta/ws/target/classes>
[INFO] -------------------------------------------------------------
[ERROR] COMPILATION ERROR : 
[INFO] -------------------------------------------------------------
[ERROR] <https://builds.apache.org/job/Tamaya-Sandbox-Master/org.apache.tamaya.ext$tamaya-usagetracker_beta/ws/src/main/java/org/apache/tamaya/usagetracker/internal/UsageTrackerFilter.java>:[42,57]
cannot find symbol
  symbol:   method current()
  location: variable context of type org.apache.tamaya.spi.FilterContext
[ERROR] <https://builds.apache.org/job/Tamaya-Sandbox-Master/org.apache.tamaya.ext$tamaya-usagetracker_beta/ws/src/main/java/org/apache/tamaya/usagetracker/internal/UsageTrackerFilter.java>:[44,54]
cannot find symbol
  symbol:   method current()
  location: variable context of type org.apache.tamaya.spi.FilterContext
[INFO] 2 errors 
[INFO] -------------------------------------------------------------

Mime
View raw message