tamaya-commits mailing list archives

Site index · List index
Message view « Date » · « Thread »
Top « Date » · « Thread »
From Apache Jenkins Server <jenk...@builds.apache.org>
Subject Build failed in Jenkins: Tamaya-Sandbox-Master #727
Date Fri, 07 Jul 2017 10:39:44 GMT
See <https://builds.apache.org/job/Tamaya-Sandbox-Master/727/display/redirect>

------------------------------------------
[...truncated 13.82 KB...]
[INFO] Exclude: **/bootstrap-*
[INFO] Exclude: **/js/jquery-*
[INFO] Exclude: **/*.json
[INFO] Exclude: **/*.md
[INFO] Exclude: **/*.md.vm
[INFO] Exclude: src/site/asciidoc/temp-properties-files-for-site/attributes.adoc
[INFO] Exclude: readme/**
[INFO] 1 resources included (use -debug for more details)
[INFO] Rat check: Summary over all files. Unapproved: 0, unknown: 0, generated: 0, approved:
1 licenses.
[INFO] 
[INFO] --- maven-remote-resources-plugin:1.5:process (process-resource-bundles) @ tamaya-sandbox
---
[INFO] 
[INFO] --- karaf-maven-plugin:4.0.5:features-generate-descriptor (generate) @ tamaya-sandbox
---
[INFO] Generating feature descriptor file <https://builds.apache.org/job/Tamaya-Sandbox-Master/ws/target/feature/feature.xml>
[INFO] ...done!
[INFO] 
[INFO] --- bnd-maven-plugin:3.3.0:bnd-process (default) @ tamaya-sandbox ---
[INFO] skip project with packaging=pom
[INFO] 
[INFO] --- maven-site-plugin:3.4:attach-descriptor (attach-descriptor) @ tamaya-sandbox ---
[INFO] 
[INFO] --- maven-javadoc-plugin:2.10.4:jar (attach-javadocs) @ tamaya-sandbox ---
[INFO] Not executing Javadoc as the project is not a Java classpath-capable package
[INFO] 
[INFO] >>> maven-source-plugin:3.0.1:jar (source-jar) > generate-sources @ tamaya-sandbox
>>>
[INFO] 
[INFO] --- maven-enforcer-plugin:1.4.1:enforce (enforce-versions) @ tamaya-sandbox ---
[INFO] 
[INFO] --- apache-rat-plugin:0.12:check (default) @ tamaya-sandbox ---
[INFO] Enabled default license matchers.
[INFO] Will parse SCM ignores for exclusions...
[INFO] Parsing exclusions from <https://builds.apache.org/job/Tamaya-Sandbox-Master/ws/.gitignore>
[INFO] Finished adding exclusions from SCM ignore files.
[INFO] 89 implicit excludes (use -debug for more details).
[INFO] Exclude: **/*banner.txt
[INFO] Exclude: banner.txt
[INFO] Exclude: .git
[INFO] Exclude: derby.log
[INFO] Exclude: **/bootstrap-*
[INFO] Exclude: **/js/jquery-*
[INFO] Exclude: **/*.json
[INFO] Exclude: **/*.md
[INFO] Exclude: **/*.md.vm
[INFO] Exclude: src/site/asciidoc/temp-properties-files-for-site/attributes.adoc
[INFO] Exclude: readme/**
[INFO] 1 resources included (use -debug for more details)
[INFO] Rat check: Summary over all files. Unapproved: 0, unknown: 0, generated: 0, approved:
1 licenses.
[WARNING] Failed to getClass for org.apache.maven.plugins.source.SourceJarMojo
[INFO] 
[INFO] <<< maven-source-plugin:3.0.1:jar (source-jar) < generate-sources @ tamaya-sandbox
<<<
[INFO] 
[INFO] --- maven-source-plugin:3.0.1:jar (source-jar) @ tamaya-sandbox ---
[INFO] 
[INFO] --- maven-failsafe-plugin:2.19.1:integration-test (default) @ tamaya-sandbox ---
[INFO] No tests to run.
[INFO] Skipping execution of surefire because it has already been run for this configuration
[INFO] 
[INFO] --- maven-failsafe-plugin:2.19.1:verify (default) @ tamaya-sandbox ---
[JENKINS] Recording test results
[JENKINS] Recording test results[INFO] 
[INFO] --- maven-install-plugin:2.5.2:install (default-install) @ tamaya-sandbox ---
[INFO] Installing <https://builds.apache.org/job/Tamaya-Sandbox-Master/ws/pom.xml> to
/home/jenkins/jenkins-slave/maven-repositories/1/org/apache/tamaya/ext/tamaya-sandbox/0.3-incubating-SNAPSHOT/tamaya-sandbox-0.3-incubating-SNAPSHOT.pom
[INFO] Installing <https://builds.apache.org/job/Tamaya-Sandbox-Master/ws/target/feature/feature.xml>
to /home/jenkins/jenkins-slave/maven-repositories/1/org/apache/tamaya/ext/tamaya-sandbox/0.3-incubating-SNAPSHOT/tamaya-sandbox-0.3-incubating-SNAPSHOT-features.xml
[INFO] Installing <https://builds.apache.org/job/Tamaya-Sandbox-Master/ws/target/feature/feature.xml>
to /home/jenkins/jenkins-slave/maven-repositories/1/org/apache/tamaya/ext/tamaya-sandbox/0.3-incubating-SNAPSHOT/tamaya-sandbox-0.3-incubating-SNAPSHOT-features.xml

[INFO] 
[INFO] --- maven-deploy-plugin:2.8.2:deploy (default-deploy) @ tamaya-sandbox ---
[INFO] Downloading: https://repository.apache.org/content/repositories/snapshots/org/apache/tamaya/ext/tamaya-sandbox/0.3-incubating-SNAPSHOT/maven-metadata.xml
[INFO] Downloaded: https://repository.apache.org/content/repositories/snapshots/org/apache/tamaya/ext/tamaya-sandbox/0.3-incubating-SNAPSHOT/maven-metadata.xml
(860 B at 0.8 KB/sec)
[INFO] Uploading: https://repository.apache.org/content/repositories/snapshots/org/apache/tamaya/ext/tamaya-sandbox/0.3-incubating-SNAPSHOT/tamaya-sandbox-0.3-incubating-20170707.103539-616.pom
[INFO] Uploaded: https://repository.apache.org/content/repositories/snapshots/org/apache/tamaya/ext/tamaya-sandbox/0.3-incubating-SNAPSHOT/tamaya-sandbox-0.3-incubating-20170707.103539-616.pom
(38 KB at 35.2 KB/sec)
[INFO] Downloading: https://repository.apache.org/content/repositories/snapshots/org/apache/tamaya/ext/tamaya-sandbox/maven-metadata.xml
[INFO] Downloaded: https://repository.apache.org/content/repositories/snapshots/org/apache/tamaya/ext/tamaya-sandbox/maven-metadata.xml
(304 B at 0.5 KB/sec)
[INFO] Uploading: https://repository.apache.org/content/repositories/snapshots/org/apache/tamaya/ext/tamaya-sandbox/0.3-incubating-SNAPSHOT/maven-metadata.xml
[INFO] Uploaded: https://repository.apache.org/content/repositories/snapshots/org/apache/tamaya/ext/tamaya-sandbox/0.3-incubating-SNAPSHOT/maven-metadata.xml
(860 B at 0.9 KB/sec)
[INFO] Uploading: https://repository.apache.org/content/repositories/snapshots/org/apache/tamaya/ext/tamaya-sandbox/maven-metadata.xml
[INFO] Uploaded: https://repository.apache.org/content/repositories/snapshots/org/apache/tamaya/ext/tamaya-sandbox/maven-metadata.xml
(304 B at 0.3 KB/sec)
[INFO] Uploading: https://repository.apache.org/content/repositories/snapshots/org/apache/tamaya/ext/tamaya-sandbox/0.3-incubating-SNAPSHOT/tamaya-sandbox-0.3-incubating-20170707.103539-616-features.xml
[INFO] Uploaded: https://repository.apache.org/content/repositories/snapshots/org/apache/tamaya/ext/tamaya-sandbox/0.3-incubating-SNAPSHOT/tamaya-sandbox-0.3-incubating-20170707.103539-616-features.xml
(144 B at 0.2 KB/sec)
[INFO] Uploading: https://repository.apache.org/content/repositories/snapshots/org/apache/tamaya/ext/tamaya-sandbox/0.3-incubating-SNAPSHOT/maven-metadata.xml
[INFO] Uploaded: https://repository.apache.org/content/repositories/snapshots/org/apache/tamaya/ext/tamaya-sandbox/0.3-incubating-SNAPSHOT/maven-metadata.xml
(860 B at 0.9 KB/sec)
[INFO] Uploading: https://repository.apache.org/content/repositories/snapshots/org/apache/tamaya/ext/tamaya-sandbox/0.3-incubating-SNAPSHOT/tamaya-sandbox-0.3-incubating-20170707.103539-616-features.xml
[INFO] Uploaded: https://repository.apache.org/content/repositories/snapshots/org/apache/tamaya/ext/tamaya-sandbox/0.3-incubating-SNAPSHOT/tamaya-sandbox-0.3-incubating-20170707.103539-616-features.xml
(144 B at 0.2 KB/sec)
[INFO] Uploading: https://repository.apache.org/content/repositories/snapshots/org/apache/tamaya/ext/tamaya-sandbox/0.3-incubating-SNAPSHOT/maven-metadata.xml
[INFO] Uploaded: https://repository.apache.org/content/repositories/snapshots/org/apache/tamaya/ext/tamaya-sandbox/0.3-incubating-SNAPSHOT/maven-metadata.xml
(860 B at 0.7 KB/sec)
[INFO]                                                                         
[INFO] ------------------------------------------------------------------------
[INFO] Building Apache Tamaya Modules - Hazelcast PropertySource 0.3-incubating-SNAPSHOT
[INFO] ------------------------------------------------------------------------
[INFO] Downloading: http://repository.apache.org/snapshots/org/apache/tamaya/tamaya-core/0.3-incubating-SNAPSHOT/maven-metadata.xml
[INFO] Downloading: http://repository.apache.org/snapshots/org/apache/tamaya/tamaya-code/0.3-incubating-SNAPSHOT/maven-metadata.xml
[INFO] Downloading: http://repository.apache.org/snapshots/org/apache/tamaya/tamaya-all/0.3-incubating-SNAPSHOT/maven-metadata.xml
[INFO] Downloading: http://repository.apache.org/snapshots/org/apache/tamaya/tamaya-api/0.3-incubating-SNAPSHOT/maven-metadata.xml
[INFO] Downloading: http://repository.apache.org/snapshots/org/apache/tamaya/ext/tamaya-functions/0.3-incubating-SNAPSHOT/maven-metadata.xml
[INFO] Downloaded: http://repository.apache.org/snapshots/org/apache/tamaya/ext/tamaya-functions/0.3-incubating-SNAPSHOT/maven-metadata.xml
(2 KB at 3.6 KB/sec)
[INFO] Downloading: http://repository.apache.org/snapshots/org/apache/tamaya/ext/tamaya-functions/0.3-incubating-SNAPSHOT/tamaya-functions-0.3-incubating-20170707.003639-673.pom
[INFO] Downloaded: http://repository.apache.org/snapshots/org/apache/tamaya/ext/tamaya-functions/0.3-incubating-SNAPSHOT/tamaya-functions-0.3-incubating-20170707.003639-673.pom
(3 KB at 6.6 KB/sec)
[INFO] Downloading: http://repository.apache.org/snapshots/org/apache/tamaya/ext/tamaya-extensions/0.3-incubating-SNAPSHOT/maven-metadata.xml
[INFO] Downloaded: http://repository.apache.org/snapshots/org/apache/tamaya/ext/tamaya-extensions/0.3-incubating-SNAPSHOT/maven-metadata.xml
(863 B at 2.1 KB/sec)
[INFO] Downloading: http://repository.apache.org/snapshots/org/apache/tamaya/ext/tamaya-extensions/0.3-incubating-SNAPSHOT/tamaya-extensions-0.3-incubating-20170707.003225-683.pom
[INFO] Downloaded: http://repository.apache.org/snapshots/org/apache/tamaya/ext/tamaya-extensions/0.3-incubating-SNAPSHOT/tamaya-extensions-0.3-incubating-20170707.003225-683.pom
(2 KB at 5.1 KB/sec)
[INFO] Downloading: http://repository.apache.org/snapshots/org/apache/tamaya/ext/tamaya-extensions-all/0.3-incubating-SNAPSHOT/maven-metadata.xml
[INFO] Downloaded: http://repository.apache.org/snapshots/org/apache/tamaya/ext/tamaya-extensions-all/0.3-incubating-SNAPSHOT/maven-metadata.xml
(867 B at 2.3 KB/sec)
[INFO] Downloading: http://repository.apache.org/snapshots/org/apache/tamaya/ext/tamaya-extensions-all/0.3-incubating-SNAPSHOT/tamaya-extensions-all-0.3-incubating-20170707.003214-514.pom
[INFO] Downloaded: http://repository.apache.org/snapshots/org/apache/tamaya/ext/tamaya-extensions-all/0.3-incubating-SNAPSHOT/tamaya-extensions-all-0.3-incubating-20170707.003214-514.pom
(41 KB at 82.0 KB/sec)
[INFO] Downloading: http://repository.apache.org/snapshots/org/apache/tamaya/ext/tamaya-spisupport/0.3-incubating-SNAPSHOT/maven-metadata.xml
[INFO] Downloaded: http://repository.apache.org/snapshots/org/apache/tamaya/ext/tamaya-spisupport/0.3-incubating-SNAPSHOT/maven-metadata.xml
(2 KB at 3.7 KB/sec)
[INFO] Downloading: http://repository.apache.org/snapshots/org/apache/tamaya/ext/tamaya-spisupport/0.3-incubating-SNAPSHOT/tamaya-spisupport-0.3-incubating-20170707.003603-673.pom
[INFO] Downloaded: http://repository.apache.org/snapshots/org/apache/tamaya/ext/tamaya-spisupport/0.3-incubating-SNAPSHOT/tamaya-spisupport-0.3-incubating-20170707.003603-673.pom
(3 KB at 6.5 KB/sec)
[INFO] Downloading: http://repository.apache.org/snapshots/org/apache/tamaya/ext/tamaya-mutable-config/0.3-incubating-SNAPSHOT/maven-metadata.xml
[INFO] Downloaded: http://repository.apache.org/snapshots/org/apache/tamaya/ext/tamaya-mutable-config/0.3-incubating-SNAPSHOT/maven-metadata.xml
(2 KB at 3.7 KB/sec)
[INFO] Downloading: http://repository.apache.org/snapshots/org/apache/tamaya/ext/tamaya-mutable-config/0.3-incubating-SNAPSHOT/tamaya-mutable-config-0.3-incubating-20170707.004123-665.pom
[INFO] Downloaded: http://repository.apache.org/snapshots/org/apache/tamaya/ext/tamaya-mutable-config/0.3-incubating-SNAPSHOT/tamaya-mutable-config-0.3-incubating-20170707.004123-665.pom
(3 KB at 7.6 KB/sec)
[INFO] Downloading: http://repository.apache.org/snapshots/org/apache/tamaya/ext/tamaya-functions/0.3-incubating-SNAPSHOT/tamaya-functions-0.3-incubating-20170707.003639-673.jar
[INFO] Downloading: http://repository.apache.org/snapshots/org/apache/tamaya/ext/tamaya-spisupport/0.3-incubating-SNAPSHOT/tamaya-spisupport-0.3-incubating-20170707.003603-673.jar
[INFO] Downloading: http://repository.apache.org/snapshots/org/apache/tamaya/ext/tamaya-mutable-config/0.3-incubating-SNAPSHOT/tamaya-mutable-config-0.3-incubating-20170707.004123-665.jar
[INFO] Downloaded: http://repository.apache.org/snapshots/org/apache/tamaya/ext/tamaya-mutable-config/0.3-incubating-SNAPSHOT/tamaya-mutable-config-0.3-incubating-20170707.004123-665.jar
(28 KB at 47.2 KB/sec)
[INFO] Downloaded: http://repository.apache.org/snapshots/org/apache/tamaya/ext/tamaya-spisupport/0.3-incubating-SNAPSHOT/tamaya-spisupport-0.3-incubating-20170707.003603-673.jar
(58 KB at 88.6 KB/sec)
[INFO] Downloaded: http://repository.apache.org/snapshots/org/apache/tamaya/ext/tamaya-functions/0.3-incubating-SNAPSHOT/tamaya-functions-0.3-incubating-20170707.003639-673.jar
(52 KB at 77.8 KB/sec)
[INFO] 
[INFO] --- maven-clean-plugin:3.0.0:clean (default-clean) @ tamaya-hazelcast_beta ---
[INFO] Deleting <https://builds.apache.org/job/Tamaya-Sandbox-Master/ws/hazelcast/target>
[INFO] 
[INFO] --- maven-enforcer-plugin:1.4.1:enforce (enforce-versions) @ tamaya-hazelcast_beta
---
[INFO] 
[INFO] --- apache-rat-plugin:0.12:check (default) @ tamaya-hazelcast_beta ---
[INFO] Enabled default license matchers.
[INFO] Will parse SCM ignores for exclusions...
[INFO] Finished adding exclusions from SCM ignore files.
[INFO] 61 implicit excludes (use -debug for more details).
[INFO] Exclude: **/*banner.txt
[INFO] Exclude: banner.txt
[INFO] Exclude: .git
[INFO] Exclude: derby.log
[INFO] Exclude: **/bootstrap-*
[INFO] Exclude: **/js/jquery-*
[INFO] Exclude: **/*.json
[INFO] Exclude: **/*.md
[INFO] Exclude: **/*.md.vm
[INFO] Exclude: src/site/asciidoc/temp-properties-files-for-site/attributes.adoc
[INFO] Exclude: readme/**
[INFO] 3 resources included (use -debug for more details)
[INFO] Rat check: Summary over all files. Unapproved: 0, unknown: 0, generated: 0, approved:
3 licenses.
[INFO] 
[INFO] --- maven-remote-resources-plugin:1.5:process (process-resource-bundles) @ tamaya-hazelcast_beta
---
[INFO] 
[INFO] --- karaf-maven-plugin:4.0.5:features-generate-descriptor (generate) @ tamaya-hazelcast_beta
---
[INFO] Downloading: http://repository.apache.org/snapshots/org/apache/tamaya/ext/tamaya-hazelcast_beta/0.3-incubating-SNAPSHOT/maven-metadata.xml
[INFO] Downloaded: http://repository.apache.org/snapshots/org/apache/tamaya/ext/tamaya-hazelcast_beta/0.3-incubating-SNAPSHOT/maven-metadata.xml
(2 KB at 3.5 KB/sec)
[INFO] Generating feature descriptor file <https://builds.apache.org/job/Tamaya-Sandbox-Master/ws/hazelcast/target/feature/feature.xml>
[INFO] ...done!
[INFO] 
[INFO] --- maven-resources-plugin:2.7:resources (default-resources) @ tamaya-hazelcast_beta
---
[INFO] Using 'UTF-8' encoding to copy filtered resources.
[INFO] skip non existing resourceDirectory <https://builds.apache.org/job/Tamaya-Sandbox-Master/ws/hazelcast/src/main/resources>
[INFO] Copying 3 resources
[INFO] 
[INFO] --- maven-compiler-plugin:3.5.1:compile (default-compile) @ tamaya-hazelcast_beta ---
[INFO] Changes detected - recompiling the module!
[INFO] Compiling 1 source file to <https://builds.apache.org/job/Tamaya-Sandbox-Master/ws/hazelcast/target/classes>
[INFO] 
[INFO] --- bnd-maven-plugin:3.3.0:bnd-process (default) @ tamaya-hazelcast_beta ---
[INFO] 
[INFO] --- maven-resources-plugin:2.7:testResources (default-testResources) @ tamaya-hazelcast_beta
---
[INFO] Using 'UTF-8' encoding to copy filtered resources.
[INFO] skip non existing resourceDirectory <https://builds.apache.org/job/Tamaya-Sandbox-Master/ws/hazelcast/src/test/resources>
[INFO] Copying 3 resources
[INFO] 
[INFO] --- maven-compiler-plugin:3.5.1:testCompile (default-testCompile) @ tamaya-hazelcast_beta
---
[INFO] Changes detected - recompiling the module!
[INFO] Compiling 1 source file to <https://builds.apache.org/job/Tamaya-Sandbox-Master/ws/hazelcast/target/test-classes>
[INFO] 
[INFO] --- maven-surefire-plugin:2.19.1:test (default-test) @ tamaya-hazelcast_beta ---

-------------------------------------------------------
 T E S T S
-------------------------------------------------------
#
# There is insufficient memory for the Java Runtime Environment to continue.
# Cannot create GC thread. Out of system resources.
# An error report file with more information is saved as:
# <https://builds.apache.org/job/Tamaya-Sandbox-Master/ws/hazelcast/hs_err_pid29279.log>

Results :

Tests run: 0, Failures: 0, Errors: 0, Skipped: 0

[JENKINS] Recording test results
[INFO] ------------------------------------------------------------------------
[INFO] Reactor Summary:
[INFO] 
[INFO] Apache Tamaya Sandbox .............................. SUCCESS [ 28.253 s]
[INFO] Apache Tamaya Modules - Hazelcast PropertySource ... FAILURE [ 11.604 s]
[INFO] Apache Tamaya Modules - Apache Commons ............. SKIPPED
[INFO] Apache Tamaya Modules - Joda-Time Support .......... SKIPPED
[INFO] Apache Tamaya Modules - Usage tracker .............. SKIPPED
[INFO] Apache Tamaya Modules - Validation ................. SKIPPED
[INFO] Apache Tamaya Modules - Remote PropertySource ...... SKIPPED
[INFO] Apache Tamaya Modules - Configured System Properties SKIPPED
[INFO] Apache Tamaya Modules - etcd PropertySource ........ SKIPPED
[INFO] Apache Tamaya Modules - Consul ..................... SKIPPED
[INFO] Apache Tamaya Modules - Apache Camel Support ....... SKIPPED
[INFO] Apache Tamaya Modules - PropertySources ............ SKIPPED
[INFO] Apache Tamaya :: OSGi Integration :: ALL ........... SKIPPED
[INFO] Apache Tamaya :: OSGi Integration :: ConfigAdmin ... SKIPPED
[INFO] Apache Tamaya Modules - JMX Support ................ SKIPPED
[INFO] Apache Tamaya Modules - Metamodel .................. SKIPPED
[INFO] Apache Tamaya Modules - Units of Measurement Support SKIPPED
[INFO] ------------------------------------------------------------------------
[INFO] BUILD FAILURE
[INFO] ------------------------------------------------------------------------
[INFO] Total time: 48.370 s
[INFO] Finished at: 2017-07-07T10:36:03+00:00
[INFO] Final Memory: 55M/718M
[INFO] ------------------------------------------------------------------------
Waiting for Jenkins to finish collecting data
[ERROR] Failed to execute goal org.apache.maven.plugins:maven-surefire-plugin:2.19.1:test
(default-test) on project tamaya-hazelcast_beta: Execution default-test of goal org.apache.maven.plugins:maven-surefire-plugin:2.19.1:test
failed: The forked VM terminated without properly saying goodbye. VM crash or System.exit
called?
[ERROR] Command was /bin/sh -c cd <https://builds.apache.org/job/Tamaya-Sandbox-Master/ws/hazelcast>
&& /usr/local/asfpackages/java/jdk1.7.0_80/jre/bin/java -jar <https://builds.apache.org/job/Tamaya-Sandbox-Master/ws/hazelcast/target/surefire/surefirebooter3924155149604238481.jar>
<https://builds.apache.org/job/Tamaya-Sandbox-Master/ws/hazelcast/target/surefire/surefire1814433026239835863tmp>
<https://builds.apache.org/job/Tamaya-Sandbox-Master/ws/hazelcast/target/surefire/surefire_04051608838559167291tmp>
[ERROR] -> [Help 1]
[ERROR] 
[ERROR] To see the full stack trace of the errors, re-run Maven with the -e switch.
[ERROR] Re-run Maven using the -X switch to enable full debug logging.
[ERROR] 
[ERROR] For more information about the errors and possible solutions, please read the following
articles:
[ERROR] [Help 1] http://cwiki.apache.org/confluence/display/MAVEN/PluginExecutionException
[ERROR] 
[ERROR] After correcting the problems, you can resume the build with the command
[ERROR]   mvn <goals> -rf :tamaya-hazelcast_beta
[JENKINS] Archiving <https://builds.apache.org/job/Tamaya-Sandbox-Master/ws/validation/pom.xml>
to org.apache.tamaya.ext/tamaya-validation_alpha/0.3-incubating-SNAPSHOT/tamaya-validation_alpha-0.3-incubating-SNAPSHOT.pom
[JENKINS] Archiving <https://builds.apache.org/job/Tamaya-Sandbox-Master/ws/apache-commons/pom.xml>
to org.apache.tamaya.ext/tamaya-commons-config_beta/0.3-incubating-SNAPSHOT/tamaya-commons-config_beta-0.3-incubating-SNAPSHOT.pom
[JENKINS] Archiving <https://builds.apache.org/job/Tamaya-Sandbox-Master/ws/osgi/pom.xml>
to org.apache.tamaya.ext/tamaya-osgi-all/0.3-incubating-SNAPSHOT/tamaya-osgi-all-0.3-incubating-SNAPSHOT.pom
[JENKINS] Archiving <https://builds.apache.org/job/Tamaya-Sandbox-Master/ws/pom.xml>
to org.apache.tamaya.ext/tamaya-sandbox/0.3-incubating-SNAPSHOT/tamaya-sandbox-0.3-incubating-SNAPSHOT.pom
[JENKINS] Archiving <https://builds.apache.org/job/Tamaya-Sandbox-Master/ws/target/feature/feature.xml>
to org.apache.tamaya.ext/tamaya-sandbox/0.3-incubating-20170707.103539-616/tamaya-sandbox-0.3-incubating-20170707.103539-616-features.xml
[JENKINS] Archiving <https://builds.apache.org/job/Tamaya-Sandbox-Master/ws/hazelcast/pom.xml>
to org.apache.tamaya.ext/tamaya-hazelcast_beta/0.3-incubating-SNAPSHOT/tamaya-hazelcast_beta-0.3-incubating-SNAPSHOT.pom
[JENKINS] Archiving <https://builds.apache.org/job/Tamaya-Sandbox-Master/ws/hazelcast/target/feature/feature.xml>
to org.apache.tamaya.ext/tamaya-hazelcast_beta/0.3-incubating-SNAPSHOT/tamaya-hazelcast_beta-0.3-incubating-SNAPSHOT-features.xml
[JENKINS] Archiving <https://builds.apache.org/job/Tamaya-Sandbox-Master/ws/uom/pom.xml>
to org.apache.tamaya.ext/tamaya-uom_beta/0.3-incubating-SNAPSHOT/tamaya-uom_beta-0.3-incubating-SNAPSHOT.pom
[JENKINS] Archiving <https://builds.apache.org/job/Tamaya-Sandbox-Master/ws/jodatime/pom.xml>
to org.apache.tamaya.ext/tamaya-jodatime_beta/0.3-incubating-SNAPSHOT/tamaya-jodatime_beta-0.3-incubating-SNAPSHOT.pom
[JENKINS] Archiving <https://builds.apache.org/job/Tamaya-Sandbox-Master/ws/configured-sysprops/pom.xml>
to org.apache.tamaya.ext/tamaya-sysprops_beta/0.3-incubating-SNAPSHOT/tamaya-sysprops_beta-0.3-incubating-SNAPSHOT.pom
[JENKINS] Archiving <https://builds.apache.org/job/Tamaya-Sandbox-Master/ws/metamodel/pom.xml>
to org.apache.tamaya.ext/tamaya-metamodel_alpha/0.3-incubating-SNAPSHOT/tamaya-metamodel_alpha-0.3-incubating-SNAPSHOT.pom
[JENKINS] Archiving <https://builds.apache.org/job/Tamaya-Sandbox-Master/ws/usagetracker/pom.xml>
to org.apache.tamaya.ext/tamaya-usagetracker_beta/0.3-incubating-SNAPSHOT/tamaya-usagetracker_beta-0.3-incubating-SNAPSHOT.pom
[JENKINS] Archiving <https://builds.apache.org/job/Tamaya-Sandbox-Master/ws/osgi/common/pom.xml>
to org.apache.tamaya.ext/tamaya-osgi_alpha/0.3-incubating-SNAPSHOT/tamaya-osgi_alpha-0.3-incubating-SNAPSHOT.pom
[JENKINS] Archiving <https://builds.apache.org/job/Tamaya-Sandbox-Master/ws/camel/pom.xml>
to org.apache.tamaya.ext/tamaya-camel_beta/0.3-incubating-SNAPSHOT/tamaya-camel_beta-0.3-incubating-SNAPSHOT.pom
[JENKINS] Archiving <https://builds.apache.org/job/Tamaya-Sandbox-Master/ws/remote/pom.xml>
to org.apache.tamaya.ext/tamaya-remote_alpha/0.3-incubating-SNAPSHOT/tamaya-remote_alpha-0.3-incubating-SNAPSHOT.pom
[JENKINS] Archiving <https://builds.apache.org/job/Tamaya-Sandbox-Master/ws/management/pom.xml>
to org.apache.tamaya.ext/tamaya-management_alpha/0.3-incubating-SNAPSHOT/tamaya-management_alpha-0.3-incubating-SNAPSHOT.pom
[JENKINS] Archiving <https://builds.apache.org/job/Tamaya-Sandbox-Master/ws/consul/pom.xml>
to org.apache.tamaya.ext/tamaya-consul_beta/0.3-incubating-SNAPSHOT/tamaya-consul_beta-0.3-incubating-SNAPSHOT.pom
[JENKINS] Archiving <https://builds.apache.org/job/Tamaya-Sandbox-Master/ws/etcd/pom.xml>
to org.apache.tamaya.ext/tamaya-etcd_beta/0.3-incubating-SNAPSHOT/tamaya-etcd_beta-0.3-incubating-SNAPSHOT.pom
[JENKINS] Archiving <https://builds.apache.org/job/Tamaya-Sandbox-Master/ws/propertysources/pom.xml>
to org.apache.tamaya.ext/tamaya-propertysources_alpha/0.3-incubating-SNAPSHOT/tamaya-propertysources_alpha-0.3-incubating-SNAPSHOT.pom
Sending e-mails to: commits@tamaya.incubator.apache.org
channel stopped

Mime
View raw message