tamaya-commits mailing list archives

Site index · List index
Message view « Date » · « Thread »
Top « Date » · « Thread »
From Apache Jenkins Server <jenk...@builds.apache.org>
Subject Build failed in Jenkins: Tamaya-Extensions-Master #774
Date Thu, 29 Jun 2017 00:34:19 GMT
See <https://builds.apache.org/job/Tamaya-Extensions-Master/774/display/redirect>

------------------------------------------
[...truncated 102.59 KB...]
[DEBUG] Implicit exclude: **/.MySCMServerInfo
[DEBUG] Implicit exclude: **/.gitignore
[DEBUG] Implicit exclude: **/CVS/**
[DEBUG] Implicit exclude: **/RCS/**
[DEBUG] Implicit exclude: **/.hgignore
[DEBUG] Implicit exclude: **/.gitattributes
[DEBUG] Implicit exclude: **/_darcs
[DEBUG] Implicit exclude: **/BitKeeper
[DEBUG] Implicit exclude: **/.DS_Store
[DEBUG] Implicit exclude: build.log
[DEBUG] Implicit exclude: .repository
[DEBUG] Implicit exclude: **/._*
[DEBUG] Implicit exclude: spi-support/**/*
[DEBUG] Implicit exclude: */.svn/*
[DEBUG] Implicit exclude: jndi/**/*
[DEBUG] Implicit exclude: events/**/*
[DEBUG] Implicit exclude: *.ipr
[DEBUG] Implicit exclude: **/.bzr
[DEBUG] Implicit exclude: */CVS/*
[DEBUG] Implicit exclude: injection/**/*
[DEBUG] Implicit exclude: optional/**/*
[DEBUG] Implicit exclude: **/%*%
[INFO] Exclude: **/*banner.txt
[INFO] Exclude: banner.txt
[INFO] Exclude: .git
[INFO] Exclude: derby.log
[INFO] Exclude: **/build.data
[INFO] Exclude: **/bootstrap-*
[INFO] Exclude: **/js/jquery-*
[INFO] Exclude: **/*.json
[INFO] Exclude: **/*.md
[INFO] Exclude: **/*.md.vm
[INFO] Exclude: src/site/asciidoc/temp-properties-files-for-site/attributes.adoc
[INFO] Exclude: readme/**
[DEBUG] No excluded resources.
[INFO] 1 resources included (use -debug for more details)
[DEBUG]  - included pom.xml
[INFO] Rat check: Summary over all files. Unapproved: 0, unknown: 0, generated: 0, approved:
1 licenses.
[WARNING] Failed to getClass for org.apache.maven.plugins.source.SourceJarMojo
[INFO] 
[INFO] <<< maven-source-plugin:3.0.1:jar (source-jar) < generate-sources @ tamaya-extensions
<<<
[INFO] 
[INFO] --- maven-source-plugin:3.0.1:jar (source-jar) @ tamaya-extensions ---
[INFO] 
[INFO] --- maven-failsafe-plugin:2.19.1:integration-test (default) @ tamaya-extensions ---
[INFO] No tests to run.
[INFO] Skipping execution of surefire because it has already been run for this configuration
[JENKINS] Recording test results[INFO] 
[INFO] --- maven-failsafe-plugin:2.19.1:verify (default) @ tamaya-extensions ---
[DEBUG] Failsafe report directory: <https://builds.apache.org/job/Tamaya-Extensions-Master/ws/modules/target/failsafe-reports>

[JENKINS] Recording test results[INFO] 
[INFO] --- maven-install-plugin:2.5.2:install (default-install) @ tamaya-extensions ---
[INFO] Installing <https://builds.apache.org/job/Tamaya-Extensions-Master/ws/modules/pom.xml>
to /home/jenkins/jenkins-slave/maven-repositories/0/org/apache/tamaya/ext/tamaya-extensions/0.3-incubating-SNAPSHOT/tamaya-extensions-0.3-incubating-SNAPSHOT.pom
[DEBUG] Writing tracking file /home/jenkins/jenkins-slave/maven-repositories/0/org/apache/tamaya/ext/tamaya-extensions/0.3-incubating-SNAPSHOT/_remote.repositories
[INFO] Installing <https://builds.apache.org/job/Tamaya-Extensions-Master/ws/modules/target/feature/feature.xml>
to /home/jenkins/jenkins-slave/maven-repositories/0/org/apache/tamaya/ext/tamaya-extensions/0.3-incubating-SNAPSHOT/tamaya-extensions-0.3-incubating-SNAPSHOT-features.xml
[DEBUG] Writing tracking file /home/jenkins/jenkins-slave/maven-repositories/0/org/apache/tamaya/ext/tamaya-extensions/0.3-incubating-SNAPSHOT/_remote.repositories

[INFO] Installing <https://builds.apache.org/job/Tamaya-Extensions-Master/ws/modules/target/feature/feature.xml>
to /home/jenkins/jenkins-slave/maven-repositories/0/org/apache/tamaya/ext/tamaya-extensions/0.3-incubating-SNAPSHOT/tamaya-extensions-0.3-incubating-SNAPSHOT-features.xml
[DEBUG] Skipped re-installing <https://builds.apache.org/job/Tamaya-Extensions-Master/ws/modules/target/feature/feature.xml>
to /home/jenkins/jenkins-slave/maven-repositories/0/org/apache/tamaya/ext/tamaya-extensions/0.3-incubating-SNAPSHOT/tamaya-extensions-0.3-incubating-SNAPSHOT-features.xml,
seems unchanged
[DEBUG] Writing tracking file /home/jenkins/jenkins-slave/maven-repositories/0/org/apache/tamaya/ext/tamaya-extensions/0.3-incubating-SNAPSHOT/_remote.repositories
[INFO] 
[INFO] --- maven-deploy-plugin:2.8.2:deploy (default-deploy) @ tamaya-extensions ---
[DEBUG] Using transporter WagonTransporter with priority -1.0 for https://repository.apache.org/content/repositories/snapshots
[DEBUG] Using connector BasicRepositoryConnector with priority 0.0 for https://repository.apache.org/content/repositories/snapshots
with username=ci-hudson, password=***
[INFO] Downloading: https://repository.apache.org/content/repositories/snapshots/org/apache/tamaya/ext/tamaya-extensions/0.3-incubating-SNAPSHOT/maven-metadata.xml
[INFO] Downloaded: https://repository.apache.org/content/repositories/snapshots/org/apache/tamaya/ext/tamaya-extensions/0.3-incubating-SNAPSHOT/maven-metadata.xml
(863 B at 1.3 KB/sec)
[DEBUG] Writing tracking file /home/jenkins/jenkins-slave/maven-repositories/0/org/apache/tamaya/ext/tamaya-extensions/0.3-incubating-SNAPSHOT/resolver-status.properties
[INFO] Uploading: https://repository.apache.org/content/repositories/snapshots/org/apache/tamaya/ext/tamaya-extensions/0.3-incubating-SNAPSHOT/tamaya-extensions-0.3-incubating-20170629.003357-665.pom
[INFO] Uploaded: https://repository.apache.org/content/repositories/snapshots/org/apache/tamaya/ext/tamaya-extensions/0.3-incubating-SNAPSHOT/tamaya-extensions-0.3-incubating-20170629.003357-665.pom
(2 KB at 2.1 KB/sec)
[INFO] Downloading: https://repository.apache.org/content/repositories/snapshots/org/apache/tamaya/ext/tamaya-extensions/maven-metadata.xml
[INFO] Downloaded: https://repository.apache.org/content/repositories/snapshots/org/apache/tamaya/ext/tamaya-extensions/maven-metadata.xml
(414 B at 0.7 KB/sec)
[DEBUG] Writing tracking file /home/jenkins/jenkins-slave/maven-repositories/0/org/apache/tamaya/ext/tamaya-extensions/resolver-status.properties
[INFO] Uploading: https://repository.apache.org/content/repositories/snapshots/org/apache/tamaya/ext/tamaya-extensions/0.3-incubating-SNAPSHOT/maven-metadata.xml
[INFO] Uploaded: https://repository.apache.org/content/repositories/snapshots/org/apache/tamaya/ext/tamaya-extensions/0.3-incubating-SNAPSHOT/maven-metadata.xml
(863 B at 0.9 KB/sec)
[INFO] Uploading: https://repository.apache.org/content/repositories/snapshots/org/apache/tamaya/ext/tamaya-extensions/maven-metadata.xml
[INFO] Uploaded: https://repository.apache.org/content/repositories/snapshots/org/apache/tamaya/ext/tamaya-extensions/maven-metadata.xml
(414 B at 0.2 KB/sec)
[DEBUG] Using transporter WagonTransporter with priority -1.0 for https://repository.apache.org/content/repositories/snapshots
[DEBUG] Using connector BasicRepositoryConnector with priority 0.0 for https://repository.apache.org/content/repositories/snapshots
with username=ci-hudson, password=***
[DEBUG] Writing tracking file /home/jenkins/jenkins-slave/maven-repositories/0/org/apache/tamaya/ext/tamaya-extensions/0.3-incubating-SNAPSHOT/resolver-status.properties
[INFO] Uploading: https://repository.apache.org/content/repositories/snapshots/org/apache/tamaya/ext/tamaya-extensions/0.3-incubating-SNAPSHOT/tamaya-extensions-0.3-incubating-20170629.003357-665-features.xml
[INFO] Uploaded: https://repository.apache.org/content/repositories/snapshots/org/apache/tamaya/ext/tamaya-extensions/0.3-incubating-SNAPSHOT/tamaya-extensions-0.3-incubating-20170629.003357-665-features.xml
(509 B at 0.6 KB/sec)
[INFO] Uploading: https://repository.apache.org/content/repositories/snapshots/org/apache/tamaya/ext/tamaya-extensions/0.3-incubating-SNAPSHOT/maven-metadata.xml
[INFO] Uploaded: https://repository.apache.org/content/repositories/snapshots/org/apache/tamaya/ext/tamaya-extensions/0.3-incubating-SNAPSHOT/maven-metadata.xml
(863 B at 1.0 KB/sec)
[DEBUG] Using transporter WagonTransporter with priority -1.0 for https://repository.apache.org/content/repositories/snapshots
[DEBUG] Using connector BasicRepositoryConnector with priority 0.0 for https://repository.apache.org/content/repositories/snapshots
with username=ci-hudson, password=***
[DEBUG] Writing tracking file /home/jenkins/jenkins-slave/maven-repositories/0/org/apache/tamaya/ext/tamaya-extensions/0.3-incubating-SNAPSHOT/resolver-status.properties
[INFO] Uploading: https://repository.apache.org/content/repositories/snapshots/org/apache/tamaya/ext/tamaya-extensions/0.3-incubating-SNAPSHOT/tamaya-extensions-0.3-incubating-20170629.003357-665-features.xml
[INFO] Uploaded: https://repository.apache.org/content/repositories/snapshots/org/apache/tamaya/ext/tamaya-extensions/0.3-incubating-SNAPSHOT/tamaya-extensions-0.3-incubating-20170629.003357-665-features.xml
(509 B at 0.5 KB/sec)
[INFO] Uploading: https://repository.apache.org/content/repositories/snapshots/org/apache/tamaya/ext/tamaya-extensions/0.3-incubating-SNAPSHOT/maven-metadata.xml
[INFO] Uploaded: https://repository.apache.org/content/repositories/snapshots/org/apache/tamaya/ext/tamaya-extensions/0.3-incubating-SNAPSHOT/maven-metadata.xml
(863 B at 0.9 KB/sec)
[INFO]                                                                         
[INFO] ------------------------------------------------------------------------
[INFO] Building Apache Tamaya Resource Services 0.3-incubating-SNAPSHOT
[INFO] ------------------------------------------------------------------------
[DEBUG] Using transporter WagonTransporter with priority -1.0 for https://repository.apache.org/content/repositories/snapshots/
[INFO] Downloading: https://repository.apache.org/content/repositories/snapshots/org/apache/tamaya/tamaya-api/0.3-incubating-SNAPSHOT/maven-metadata.xml
[DEBUG] Using transporter WagonTransporter with priority -1.0 for http://repository.apache.org/snapshots
[INFO] Downloading: http://repository.apache.org/snapshots/org/apache/tamaya/tamaya-api/0.3-incubating-SNAPSHOT/maven-metadata.xml
[DEBUG] Using transporter WagonTransporter with priority -1.0 for https://repository.apache.org/content/repositories/snapshots/
[INFO] Downloading: https://repository.apache.org/content/repositories/snapshots/org/apache/tamaya/tamaya-api/0.3-incubating-SNAPSHOT/tamaya-api-0.3-incubating-SNAPSHOT.pom
[DEBUG] Using transporter WagonTransporter with priority -1.0 for http://repository.apache.org/snapshots
[INFO] Downloading: http://repository.apache.org/snapshots/org/apache/tamaya/tamaya-api/0.3-incubating-SNAPSHOT/tamaya-api-0.3-incubating-SNAPSHOT.pom
[WARNING] The POM for org.apache.tamaya:tamaya-api:jar:0.3-incubating-SNAPSHOT is missing,
no dependency information available
[DEBUG] Using transporter WagonTransporter with priority -1.0 for https://repository.apache.org/content/repositories/snapshots/
[INFO] Downloading: https://repository.apache.org/content/repositories/snapshots/org/apache/tamaya/tamaya-core/0.3-incubating-SNAPSHOT/maven-metadata.xml
[DEBUG] Using transporter WagonTransporter with priority -1.0 for http://repository.apache.org/snapshots
[INFO] Downloading: http://repository.apache.org/snapshots/org/apache/tamaya/tamaya-core/0.3-incubating-SNAPSHOT/maven-metadata.xml
[DEBUG] Using transporter WagonTransporter with priority -1.0 for https://repository.apache.org/content/repositories/snapshots/
[INFO] Downloading: https://repository.apache.org/content/repositories/snapshots/org/apache/tamaya/tamaya-core/0.3-incubating-SNAPSHOT/tamaya-core-0.3-incubating-SNAPSHOT.pom
[DEBUG] Using transporter WagonTransporter with priority -1.0 for http://repository.apache.org/snapshots
[INFO] Downloading: http://repository.apache.org/snapshots/org/apache/tamaya/tamaya-core/0.3-incubating-SNAPSHOT/tamaya-core-0.3-incubating-SNAPSHOT.pom
[WARNING] The POM for org.apache.tamaya:tamaya-core:jar:0.3-incubating-SNAPSHOT is missing,
no dependency information available
[DEBUG] Using transporter WagonTransporter with priority -1.0 for https://repository.apache.org/content/repositories/snapshots/
[INFO] Downloading: https://repository.apache.org/content/repositories/snapshots/org/apache/tamaya/tamaya-api/0.3-incubating-SNAPSHOT/tamaya-api-0.3-incubating-SNAPSHOT.jar
[INFO] Downloading: https://repository.apache.org/content/repositories/snapshots/org/apache/tamaya/tamaya-core/0.3-incubating-SNAPSHOT/tamaya-core-0.3-incubating-SNAPSHOT.jar
[DEBUG] Using transporter WagonTransporter with priority -1.0 for http://repository.apache.org/snapshots
[INFO] Downloading: http://repository.apache.org/snapshots/org/apache/tamaya/tamaya-api/0.3-incubating-SNAPSHOT/tamaya-api-0.3-incubating-SNAPSHOT.jar
[INFO] Downloading: http://repository.apache.org/snapshots/org/apache/tamaya/tamaya-core/0.3-incubating-SNAPSHOT/tamaya-core-0.3-incubating-SNAPSHOT.jar
[INFO] ------------------------------------------------------------------------
[INFO] Reactor Summary:
[INFO] 
[INFO] Apache Tamaya Extensions ........................... SUCCESS [ 22.548 s]
[INFO] Apache Tamaya Extension Modules .................... SUCCESS [ 11.240 s]
[INFO] Apache Tamaya Resource Services .................... FAILURE [  2.220 s]
[INFO] Apache Tamaya Extensions Examples .................. SKIPPED
[INFO] Apache Tamaya Resource Location Example ............ SKIPPED
[INFO] Apache Tamaya Resolver Services .................... SKIPPED
[INFO] Apache Tamaya Value Resolution Example ............. SKIPPED
[INFO] Apache Tamaya Modules - Injection Parent ........... SKIPPED
[INFO] Apache Tamaya Modules - Injection API .............. SKIPPED
[INFO] Apache Tamaya Common Support Classes ............... SKIPPED
[INFO] Apache Tamaya Modules - Common Functional Extensions SKIPPED
[INFO] Apache Tamaya Event and dynamic Update Extensions .. SKIPPED
[INFO] Apache Tamaya Modules - Injection Standalone ....... SKIPPED
[INFO] Apache Tamaya Configuration Injection Example ...... SKIPPED
[INFO] Apache Tamaya Modules - Formats Parent ............. SKIPPED
[INFO] Apache Tamaya Modules Formats Common ............... SKIPPED
[INFO] Apache Tamaya Events Example ....................... SKIPPED
[INFO] Apache Tamaya Optional Configuration Backend ....... SKIPPED
[INFO] Apache Tamaya Modules - Injection CDI .............. SKIPPED
[INFO] Apache Tamaya Modules - Mutable Configuration ...... SKIPPED
[INFO] Apache Tamaya Spring Integration ................... SKIPPED
[INFO] Apache Tamaya Adaptive Configuration Filtering ..... SKIPPED
[INFO] Apache Tamaya JNDI Support ......................... SKIPPED
[INFO] Apache Tamaya Feature Check ........................ SKIPPED
[INFO] Apache Tamaya JSON Support ......................... SKIPPED
[INFO] Apache Tamaya YAML Support ......................... SKIPPED
[INFO] Apache Tamaya Extension Distribution ............... SKIPPED
[INFO] ------------------------------------------------------------------------
[INFO] BUILD FAILURE
[INFO] ------------------------------------------------------------------------
[INFO] Total time: 44.835 s
[INFO] Finished at: 2017-06-29T00:34:13+00:00
[INFO] Final Memory: 59M/715M
[INFO] ------------------------------------------------------------------------
[ERROR] Failed to execute goal on project tamaya-resources: Could not resolve dependencies
for project org.apache.tamaya.ext:tamaya-resources:jar:0.3-incubating-SNAPSHOT: The following
artifacts could not be resolved: org.apache.tamaya:tamaya-api:jar:0.3-incubating-SNAPSHOT,
org.apache.tamaya:tamaya-core:jar:0.3-incubating-SNAPSHOT: Could not find artifact org.apache.tamaya:tamaya-api:jar:0.3-incubating-SNAPSHOT
in activate-asf-snapshots (https://repository.apache.org/content/repositories/snapshots/)
-> [Help 1]
org.apache.maven.lifecycle.LifecycleExecutionException: Failed to execute goal on project
tamaya-resources: Could not resolve dependencies for project org.apache.tamaya.ext:tamaya-resources:jar:0.3-incubating-SNAPSHOT:
The following artifacts could not be resolved: org.apache.tamaya:tamaya-api:jar:0.3-incubating-SNAPSHOT,
org.apache.tamaya:tamaya-core:jar:0.3-incubating-SNAPSHOT: Could not find artifact org.apache.tamaya:tamaya-api:jar:0.3-incubating-SNAPSHOT
in activate-asf-snapshots (https://repository.apache.org/content/repositories/snapshots/)
	at org.apache.maven.lifecycle.internal.LifecycleDependencyResolver.getDependencies(LifecycleDependencyResolver.java:221)
	at org.apache.maven.lifecycle.internal.LifecycleDependencyResolver.resolveProjectDependencies(LifecycleDependencyResolver.java:127)
	at org.apache.maven.lifecycle.internal.MojoExecutor.ensureDependenciesAreResolved(MojoExecutor.java:245)
	at org.apache.maven.lifecycle.internal.MojoExecutor.execute(MojoExecutor.java:199)
	at org.apache.maven.lifecycle.internal.MojoExecutor.execute(MojoExecutor.java:153)
	at org.apache.maven.lifecycle.internal.MojoExecutor.execute(MojoExecutor.java:145)
	at org.apache.maven.lifecycle.internal.LifecycleModuleBuilder.buildProject(LifecycleModuleBuilder.java:116)
	at org.apache.maven.lifecycle.internal.LifecycleModuleBuilder.buildProject(LifecycleModuleBuilder.java:80)
	at org.apache.maven.lifecycle.internal.builder.singlethreaded.SingleThreadedBuilder.build(SingleThreadedBuilder.java:51)
	at org.apache.maven.lifecycle.internal.LifecycleStarter.execute(LifecycleStarter.java:128)
	at org.apache.maven.DefaultMaven.doExecute(DefaultMaven.java:307)
	at org.apache.maven.DefaultMaven.doExecute(DefaultMaven.java:193)
	at org.apache.maven.DefaultMaven.execute(DefaultMaven.java:106)
	at org.jvnet.hudson.maven3.launcher.Maven33Launcher.main(Maven33Launcher.java:129)
	at sun.reflect.NativeMethodAccessorImpl.invoke0(Native Method)
	at sun.reflect.NativeMethodAccessorImpl.invoke(NativeMethodAccessorImpl.java:57)
	at sun.reflect.DelegatingMethodAccessorImpl.invoke(DelegatingMethodAccessorImpl.java:43)
	at java.lang.reflect.Method.invoke(Method.java:606)
	at org.codehaus.plexus.classworlds.launcher.Launcher.launchStandard(Launcher.java:330)
	at org.codehaus.plexus.classworlds.launcher.Launcher.launch(Launcher.java:238)
	at jenkins.maven3.agent.Maven33Main.launch(Maven33Main.java:176)
	at sun.reflect.NativeMethodAccessorImpl.invoke0(Native Method)
	at sun.reflect.NativeMethodAccessorImpl.invoke(NativeMethodAccessorImpl.java:57)
	at sun.reflect.DelegatingMethodAccessorImpl.invoke(DelegatingMethodAccessorImpl.java:43)
	at java.lang.reflect.Method.invoke(Method.java:606)
	at hudson.maven.Maven3Builder.call(Maven3Builder.java:139)
	at hudson.maven.Maven3Builder.call(Maven3Builder.java:70)
	at hudson.remoting.UserRequest.perform(UserRequest.java:153)
	at hudson.remoting.UserRequest.perform(UserRequest.java:50)
	at hudson.remoting.Request$2.run(Request.java:336)
	at hudson.remoting.InterceptingExecutorService$1.call(InterceptingExecutorService.java:68)
	at java.util.concurrent.FutureTask.run(FutureTask.java:262)
	at java.util.concurrent.ThreadPoolExecutor.runWorker(ThreadPoolExecutor.java:1145)
	at java.util.concurrent.ThreadPoolExecutor$Worker.run(ThreadPoolExecutor.java:615)
	at java.lang.Thread.run(Thread.java:745)
Caused by: org.apache.maven.project.DependencyResolutionException: Could not resolve dependencies
for project org.apache.tamaya.ext:tamaya-resources:jar:0.3-incubating-SNAPSHOT: The following
artifacts could not be resolved: org.apache.tamaya:tamaya-api:jar:0.3-incubating-SNAPSHOT,
org.apache.tamaya:tamaya-core:jar:0.3-incubating-SNAPSHOT: Could not find artifact org.apache.tamaya:tamaya-api:jar:0.3-incubating-SNAPSHOT
in activate-asf-snapshots (https://repository.apache.org/content/repositories/snapshots/)
	at org.apache.maven.project.DefaultProjectDependenciesResolver.resolve(DefaultProjectDependenciesResolver.java:211)
	at org.apache.maven.lifecycle.internal.LifecycleDependencyResolver.getDependencies(LifecycleDependencyResolver.java:195)
	... 34 more
Caused by: org.eclipse.aether.resolution.DependencyResolutionException: The following artifacts
could not be resolved: org.apache.tamaya:tamaya-api:jar:0.3-incubating-SNAPSHOT, org.apache.tamaya:tamaya-core:jar:0.3-incubating-SNAPSHOT:
Could not find artifact org.apache.tamaya:tamaya-api:jar:0.3-incubating-SNAPSHOT in activate-asf-snapshots
(https://repository.apache.org/content/repositories/snapshots/)
	at org.eclipse.aether.internal.impl.DefaultRepositorySystem.resolveDependencies(DefaultRepositorySystem.java:384)
	at org.apache.maven.project.DefaultProjectDependenciesResolver.resolve(DefaultProjectDependenciesResolver.java:205)
	... 35 more
Caused by: org.eclipse.aether.resolution.ArtifactResolutionException: The following artifacts
could not be resolved: org.apache.tamaya:tamaya-api:jar:0.3-incubating-SNAPSHOT, org.apache.tamaya:tamaya-core:jar:0.3-incubating-SNAPSHOT:
Could not find artifact org.apache.tamaya:tamaya-api:jar:0.3-incubating-SNAPSHOT in activate-asf-snapshots
(https://repository.apache.org/content/repositories/snapshots/)
	at org.eclipse.aether.internal.impl.DefaultArtifactResolver.resolve(DefaultArtifactResolver.java:444)
	at org.eclipse.aether.internal.impl.DefaultArtifactResolver.resolveArtifacts(DefaultArtifactResolver.java:246)
	at org.eclipse.aether.internal.impl.DefaultRepositorySystem.resolveDependencies(DefaultRepositorySystem.java:367)
	... 36 more
Caused by: org.eclipse.aether.transfer.ArtifactNotFoundException: Could not find artifact
org.apache.tamaya:tamaya-api:jar:0.3-incubating-SNAPSHOT in activate-asf-snapshots (https://repository.apache.org/content/repositories/snapshots/)
	at org.eclipse.aether.connector.basic.ArtifactTransportListener.transferFailed(ArtifactTransportListener.java:39)
	at org.eclipse.aether.connector.basic.BasicRepositoryConnector$TaskRunner.run(BasicRepositoryConnector.java:355)
	at org.eclipse.aether.util.concurrency.RunnableErrorForwarder$1.run(RunnableErrorForwarder.java:67)
	... 3 more
[ERROR] 
[ERROR] Re-run Maven using the -X switch to enable full debug logging.
[ERROR] 
[ERROR] For more information about the errors and possible solutions, please read the following
articles:
[ERROR] [Help 1] http://cwiki.apache.org/confluence/display/MAVEN/DependencyResolutionException
[ERROR] 
[ERROR] After correcting the problems, you can resume the build with the command
[ERROR]   mvn <goals> -rf :tamaya-resources
[JENKINS] Archiving <https://builds.apache.org/job/Tamaya-Extensions-Master/ws/modules/pom.xml>
to org.apache.tamaya.ext/tamaya-extensions/0.3-incubating-SNAPSHOT/tamaya-extensions-0.3-incubating-SNAPSHOT.pom
[JENKINS] Archiving <https://builds.apache.org/job/Tamaya-Extensions-Master/ws/modules/target/feature/feature.xml>
to org.apache.tamaya.ext/tamaya-extensions/0.3-incubating-20170629.003357-665/tamaya-extensions-0.3-incubating-20170629.003357-665-features.xml
[JENKINS] Archiving <https://builds.apache.org/job/Tamaya-Extensions-Master/ws/modules/events/pom.xml>
to org.apache.tamaya.ext/tamaya-events/0.3-incubating-SNAPSHOT/tamaya-events-0.3-incubating-SNAPSHOT.pom
[JENKINS] Archiving <https://builds.apache.org/job/Tamaya-Extensions-Master/ws/modules/formats/base/pom.xml>
to org.apache.tamaya.ext/tamaya-formats/0.3-incubating-SNAPSHOT/tamaya-formats-0.3-incubating-SNAPSHOT.pom
[JENKINS] Archiving <https://builds.apache.org/job/Tamaya-Extensions-Master/ws/modules/features/pom.xml>
to org.apache.tamaya.ext/tamaya-features/0.3-incubating-SNAPSHOT/tamaya-features-0.3-incubating-SNAPSHOT.pom
[JENKINS] Archiving <https://builds.apache.org/job/Tamaya-Extensions-Master/ws/modules/spi-support/pom.xml>
to org.apache.tamaya.ext/tamaya-spisupport/0.3-incubating-SNAPSHOT/tamaya-spisupport-0.3-incubating-SNAPSHOT.pom
[JENKINS] Archiving <https://builds.apache.org/job/Tamaya-Extensions-Master/ws/modules/formats/pom.xml>
to org.apache.tamaya.ext/tamaya-formats-all/0.3-incubating-SNAPSHOT/tamaya-formats-all-0.3-incubating-SNAPSHOT.pom
[JENKINS] Archiving <https://builds.apache.org/job/Tamaya-Extensions-Master/ws/pom.xml>
to org.apache.tamaya.ext/tamaya-extensions-all/0.3-incubating-SNAPSHOT/tamaya-extensions-all-0.3-incubating-SNAPSHOT.pom
[JENKINS] Archiving <https://builds.apache.org/job/Tamaya-Extensions-Master/ws/target/feature/feature.xml>
to org.apache.tamaya.ext/tamaya-extensions-all/0.3-incubating-20170629.003346-496/tamaya-extensions-all-0.3-incubating-20170629.003346-496-features.xml
[JENKINS] Archiving <https://builds.apache.org/job/Tamaya-Extensions-Master/ws/modules/jndi/pom.xml>
to org.apache.tamaya.ext/tamaya-jndi/0.3-incubating-SNAPSHOT/tamaya-jndi-0.3-incubating-SNAPSHOT.pom
[JENKINS] Archiving <https://builds.apache.org/job/Tamaya-Extensions-Master/ws/examples/03-injection-example/pom.xml>
to org.apache.tamaya.ext.examples/03-injection-example/0.3-incubating-SNAPSHOT/03-injection-example-0.3-incubating-SNAPSHOT.pom
[JENKINS] Archiving <https://builds.apache.org/job/Tamaya-Extensions-Master/ws/modules/optional/pom.xml>
to org.apache.tamaya.ext/tamaya-optional/0.3-incubating-SNAPSHOT/tamaya-optional-0.3-incubating-SNAPSHOT.pom
[JENKINS] Archiving <https://builds.apache.org/job/Tamaya-Extensions-Master/ws/modules/resolver/pom.xml>
to org.apache.tamaya.ext/tamaya-resolver/0.3-incubating-SNAPSHOT/tamaya-resolver-0.3-incubating-SNAPSHOT.pom
[JENKINS] Archiving <https://builds.apache.org/job/Tamaya-Extensions-Master/ws/examples/pom.xml>
to org.apache.tamaya.ext.examples/examples/0.3-incubating-SNAPSHOT/examples-0.3-incubating-SNAPSHOT.pom
[JENKINS] Archiving <https://builds.apache.org/job/Tamaya-Extensions-Master/ws/modules/filter/pom.xml>
to org.apache.tamaya.ext/tamaya-filter/0.3-incubating-SNAPSHOT/tamaya-filter-0.3-incubating-SNAPSHOT.pom
[JENKINS] Archiving <https://builds.apache.org/job/Tamaya-Extensions-Master/ws/modules/spring/pom.xml>
to org.apache.tamaya.ext/tamaya-spring/0.3-incubating-SNAPSHOT/tamaya-spring-0.3-incubating-SNAPSHOT.pom
[JENKINS] Archiving <https://builds.apache.org/job/Tamaya-Extensions-Master/ws/examples/02-resolver-example/pom.xml>
to org.apache.tamaya.ext.examples/02-resolver-example/0.3-incubating-SNAPSHOT/02-resolver-example-0.3-incubating-SNAPSHOT.pom
[JENKINS] Archiving <https://builds.apache.org/job/Tamaya-Extensions-Master/ws/modules/injection/cdi/pom.xml>
to org.apache.tamaya.ext/tamaya-cdi/0.3-incubating-SNAPSHOT/tamaya-cdi-0.3-incubating-SNAPSHOT.pom
[JENKINS] Archiving <https://builds.apache.org/job/Tamaya-Extensions-Master/ws/modules/formats/yaml/pom.xml>
to org.apache.tamaya.ext/tamaya-yaml/0.3-incubating-SNAPSHOT/tamaya-yaml-0.3-incubating-SNAPSHOT.pom
[JENKINS] Archiving <https://builds.apache.org/job/Tamaya-Extensions-Master/ws/modules/injection/injection-api/pom.xml>
to org.apache.tamaya.ext/tamaya-injection-api/0.3-incubating-SNAPSHOT/tamaya-injection-api-0.3-incubating-SNAPSHOT.pom
[JENKINS] Archiving <https://builds.apache.org/job/Tamaya-Extensions-Master/ws/modules/mutable-config/pom.xml>
to org.apache.tamaya.ext/tamaya-mutable-config/0.3-incubating-SNAPSHOT/tamaya-mutable-config-0.3-incubating-SNAPSHOT.pom
[JENKINS] Archiving <https://builds.apache.org/job/Tamaya-Extensions-Master/ws/modules/resources/pom.xml>
to org.apache.tamaya.ext/tamaya-resources/0.3-incubating-SNAPSHOT/tamaya-resources-0.3-incubating-SNAPSHOT.pom
[JENKINS] Archiving <https://builds.apache.org/job/Tamaya-Extensions-Master/ws/examples/04-events-example/pom.xml>
to org.apache.tamaya.ext.examples/04-events-example/0.3-incubating-SNAPSHOT/04-events-example-0.3-incubating-SNAPSHOT.pom
[JENKINS] Archiving <https://builds.apache.org/job/Tamaya-Extensions-Master/ws/modules/formats/json/pom.xml>
to org.apache.tamaya.ext/tamaya-json/0.3-incubating-SNAPSHOT/tamaya-json-0.3-incubating-SNAPSHOT.pom
[JENKINS] Archiving <https://builds.apache.org/job/Tamaya-Extensions-Master/ws/modules/injection/pom.xml>
to org.apache.tamaya.ext/tamaya-injection-all/0.3-incubating-SNAPSHOT/tamaya-injection-all-0.3-incubating-SNAPSHOT.pom
[JENKINS] Archiving <https://builds.apache.org/job/Tamaya-Extensions-Master/ws/examples/01-resources-example/pom.xml>
to org.apache.tamaya.ext.examples/01-resources-example/0.3-incubating-SNAPSHOT/01-resources-example-0.3-incubating-SNAPSHOT.pom
[JENKINS] Archiving <https://builds.apache.org/job/Tamaya-Extensions-Master/ws/modules/functions/pom.xml>
to org.apache.tamaya.ext/tamaya-functions/0.3-incubating-SNAPSHOT/tamaya-functions-0.3-incubating-SNAPSHOT.pom
[JENKINS] Archiving <https://builds.apache.org/job/Tamaya-Extensions-Master/ws/distribution/pom.xml>
to org.apache.tamaya.ext/tamaya-extension-distribution/0.3-incubating-SNAPSHOT/tamaya-extension-distribution-0.3-incubating-SNAPSHOT.pom
[JENKINS] Archiving <https://builds.apache.org/job/Tamaya-Extensions-Master/ws/modules/injection/standalone/pom.xml>
to org.apache.tamaya.ext/tamaya-injection/0.3-incubating-SNAPSHOT/tamaya-injection-0.3-incubating-SNAPSHOT.pom
channel stopped

Mime
View raw message