tamaya-commits mailing list archives

Site index · List index
Message view « Date » · « Thread »
Top « Date » · « Thread »
From Apache Jenkins Server <jenk...@builds.apache.org>
Subject Build failed in Jenkins: Tamaya-Sandbox-Master » Apache Tamaya Modules - Hazelcast PropertySource #556
Date Tue, 18 Apr 2017 10:38:36 GMT
See <https://builds.apache.org/job/Tamaya-Sandbox-Master/org.apache.tamaya.ext$tamaya-hazelcast_beta/556/display/redirect>

------------------------------------------
[INFO]                                                                         
[INFO] ------------------------------------------------------------------------
[INFO] Building Apache Tamaya Modules - Hazelcast PropertySource 0.3-incubating-SNAPSHOT
[INFO] ------------------------------------------------------------------------
[INFO] Downloading: http://repository.apache.org/snapshots/org/apache/tamaya/ext/tamaya-functions/0.3-incubating-SNAPSHOT/maven-metadata.xml
[INFO] Downloaded: http://repository.apache.org/snapshots/org/apache/tamaya/ext/tamaya-functions/0.3-incubating-SNAPSHOT/maven-metadata.xml
(2 KB at 4.0 KB/sec)
[INFO] Downloading: http://repository.apache.org/snapshots/org/apache/tamaya/ext/tamaya-functions/0.3-incubating-SNAPSHOT/tamaya-functions-0.3-incubating-20170416.004755-501.pom
[INFO] Downloaded: http://repository.apache.org/snapshots/org/apache/tamaya/ext/tamaya-functions/0.3-incubating-SNAPSHOT/tamaya-functions-0.3-incubating-20170416.004755-501.pom
(3 KB at 7.0 KB/sec)
[INFO] Downloading: http://repository.apache.org/snapshots/org/apache/tamaya/ext/tamaya-extensions/0.3-incubating-SNAPSHOT/maven-metadata.xml
[INFO] Downloaded: http://repository.apache.org/snapshots/org/apache/tamaya/ext/tamaya-extensions/0.3-incubating-SNAPSHOT/maven-metadata.xml
(863 B at 2.3 KB/sec)
[INFO] Downloading: http://repository.apache.org/snapshots/org/apache/tamaya/ext/tamaya-extensions/0.3-incubating-SNAPSHOT/tamaya-extensions-0.3-incubating-20170417.003359-509.pom
[INFO] Downloaded: http://repository.apache.org/snapshots/org/apache/tamaya/ext/tamaya-extensions/0.3-incubating-SNAPSHOT/tamaya-extensions-0.3-incubating-20170417.003359-509.pom
(2 KB at 5.3 KB/sec)
[INFO] Downloading: http://repository.apache.org/snapshots/org/apache/tamaya/ext/tamaya-extensions-all/0.3-incubating-SNAPSHOT/maven-metadata.xml
[INFO] Downloaded: http://repository.apache.org/snapshots/org/apache/tamaya/ext/tamaya-extensions-all/0.3-incubating-SNAPSHOT/maven-metadata.xml
(867 B at 2.3 KB/sec)
[INFO] Downloading: http://repository.apache.org/snapshots/org/apache/tamaya/ext/tamaya-extensions-all/0.3-incubating-SNAPSHOT/tamaya-extensions-all-0.3-incubating-20170417.003340-340.pom
[INFO] Downloaded: http://repository.apache.org/snapshots/org/apache/tamaya/ext/tamaya-extensions-all/0.3-incubating-SNAPSHOT/tamaya-extensions-all-0.3-incubating-20170417.003340-340.pom
(41 KB at 90.7 KB/sec)
[INFO] Downloading: http://repository.apache.org/snapshots/org/apache/tamaya/ext/tamaya-spisupport/0.3-incubating-SNAPSHOT/maven-metadata.xml
[INFO] Downloaded: http://repository.apache.org/snapshots/org/apache/tamaya/ext/tamaya-spisupport/0.3-incubating-SNAPSHOT/maven-metadata.xml
(2 KB at 4.0 KB/sec)
[INFO] Downloading: http://repository.apache.org/snapshots/org/apache/tamaya/ext/tamaya-spisupport/0.3-incubating-SNAPSHOT/tamaya-spisupport-0.3-incubating-20170416.004711-501.pom
[INFO] Downloaded: http://repository.apache.org/snapshots/org/apache/tamaya/ext/tamaya-spisupport/0.3-incubating-SNAPSHOT/tamaya-spisupport-0.3-incubating-20170416.004711-501.pom
(3 KB at 6.6 KB/sec)
[INFO] Downloading: http://repository.apache.org/snapshots/org/apache/tamaya/ext/tamaya-mutable-config/0.3-incubating-SNAPSHOT/maven-metadata.xml
[INFO] Downloaded: http://repository.apache.org/snapshots/org/apache/tamaya/ext/tamaya-mutable-config/0.3-incubating-SNAPSHOT/maven-metadata.xml
(2 KB at 4.0 KB/sec)
[INFO] Downloading: http://repository.apache.org/snapshots/org/apache/tamaya/ext/tamaya-mutable-config/0.3-incubating-SNAPSHOT/tamaya-mutable-config-0.3-incubating-20170416.005336-493.pom
[INFO] Downloaded: http://repository.apache.org/snapshots/org/apache/tamaya/ext/tamaya-mutable-config/0.3-incubating-SNAPSHOT/tamaya-mutable-config-0.3-incubating-20170416.005336-493.pom
(3 KB at 8.4 KB/sec)
[INFO] Downloading: http://repository.apache.org/snapshots/org/apache/tamaya/ext/tamaya-functions/0.3-incubating-SNAPSHOT/tamaya-functions-0.3-incubating-20170416.004755-501.jar
[INFO] Downloading: http://repository.apache.org/snapshots/org/apache/tamaya/ext/tamaya-spisupport/0.3-incubating-SNAPSHOT/tamaya-spisupport-0.3-incubating-20170416.004711-501.jar
[INFO] Downloading: http://repository.apache.org/snapshots/org/apache/tamaya/ext/tamaya-mutable-config/0.3-incubating-SNAPSHOT/tamaya-mutable-config-0.3-incubating-20170416.005336-493.jar
[INFO] Downloaded: http://repository.apache.org/snapshots/org/apache/tamaya/ext/tamaya-mutable-config/0.3-incubating-SNAPSHOT/tamaya-mutable-config-0.3-incubating-20170416.005336-493.jar
(28 KB at 59.8 KB/sec)
[INFO] Downloaded: http://repository.apache.org/snapshots/org/apache/tamaya/ext/tamaya-spisupport/0.3-incubating-SNAPSHOT/tamaya-spisupport-0.3-incubating-20170416.004711-501.jar
(57 KB at 107.3 KB/sec)
[INFO] Downloaded: http://repository.apache.org/snapshots/org/apache/tamaya/ext/tamaya-functions/0.3-incubating-SNAPSHOT/tamaya-functions-0.3-incubating-20170416.004755-501.jar
(52 KB at 96.0 KB/sec)
[INFO] 
[INFO] --- maven-clean-plugin:3.0.0:clean (default-clean) @ tamaya-hazelcast_beta ---
[INFO] Deleting <https://builds.apache.org/job/Tamaya-Sandbox-Master/org.apache.tamaya.ext$tamaya-hazelcast_beta/ws/target>
[INFO] 
[INFO] --- maven-enforcer-plugin:1.4.1:enforce (enforce-versions) @ tamaya-hazelcast_beta
---
[INFO] 
[INFO] --- apache-rat-plugin:0.12:check (default) @ tamaya-hazelcast_beta ---
[INFO] Enabled default license matchers.
[INFO] Will parse SCM ignores for exclusions...
[INFO] Finished adding exclusions from SCM ignore files.
[INFO] 61 implicit excludes (use -debug for more details).
[INFO] Exclude: **/*banner.txt
[INFO] Exclude: banner.txt
[INFO] Exclude: .git
[INFO] Exclude: derby.log
[INFO] Exclude: **/bootstrap-*
[INFO] Exclude: **/js/jquery-*
[INFO] Exclude: **/*.json
[INFO] Exclude: **/*.md
[INFO] Exclude: **/*.md.vm
[INFO] Exclude: src/site/asciidoc/temp-properties-files-for-site/attributes.adoc
[INFO] Exclude: readme/**
[INFO] 3 resources included (use -debug for more details)
[INFO] Rat check: Summary over all files. Unapproved: 0, unknown: 0, generated: 0, approved:
3 licenses.
[INFO] 
[INFO] --- maven-remote-resources-plugin:1.5:process (process-resource-bundles) @ tamaya-hazelcast_beta
---
[INFO] 
[INFO] --- karaf-maven-plugin:4.0.5:features-generate-descriptor (generate) @ tamaya-hazelcast_beta
---
[INFO] Downloading: http://repository.apache.org/snapshots/org/apache/tamaya/ext/tamaya-hazelcast_beta/0.3-incubating-SNAPSHOT/maven-metadata.xml
[INFO] Downloaded: http://repository.apache.org/snapshots/org/apache/tamaya/ext/tamaya-hazelcast_beta/0.3-incubating-SNAPSHOT/maven-metadata.xml
(2 KB at 4.0 KB/sec)
[INFO] Generating feature descriptor file <https://builds.apache.org/job/Tamaya-Sandbox-Master/org.apache.tamaya.ext$tamaya-hazelcast_beta/ws/target/feature/feature.xml>
[INFO] ...done!
[INFO] 
[INFO] --- maven-resources-plugin:2.7:resources (default-resources) @ tamaya-hazelcast_beta
---
[INFO] Using 'UTF-8' encoding to copy filtered resources.
[INFO] skip non existing resourceDirectory <https://builds.apache.org/job/Tamaya-Sandbox-Master/org.apache.tamaya.ext$tamaya-hazelcast_beta/ws/src/main/resources>
[INFO] Copying 3 resources
[INFO] 
[INFO] --- maven-compiler-plugin:3.5.1:compile (default-compile) @ tamaya-hazelcast_beta ---
[INFO] Changes detected - recompiling the module!
[INFO] Compiling 1 source file to <https://builds.apache.org/job/Tamaya-Sandbox-Master/org.apache.tamaya.ext$tamaya-hazelcast_beta/ws/target/classes>
[INFO] -------------------------------------------------------------
[ERROR] COMPILATION ERROR : 
[INFO] -------------------------------------------------------------
[ERROR] <https://builds.apache.org/job/Tamaya-Sandbox-Master/org.apache.tamaya.ext$tamaya-hazelcast_beta/ws/src/main/java/org/apache/tamaya/hazelcast/HazelcastPropertySource.java>:[231,21]
cannot find symbol
  symbol: method toStringValues()
[ERROR] <https://builds.apache.org/job/Tamaya-Sandbox-Master/org.apache.tamaya.ext$tamaya-hazelcast_beta/ws/src/main/java/org/apache/tamaya/hazelcast/HazelcastPropertySource.java>:[229,5]
method does not override or implement a method from a supertype
[INFO] 2 errors 
[INFO] -------------------------------------------------------------

Mime
View raw message